{"text_format":"1","workbook":"xlsx","n_sheets":48,"sheets":["Criteria","Master Table","Site Template","Main","Summary Table","Master Database","Master Comment","Site 30","Site 29","Site 28","Site 27","Site 26","Site 25","Site 24","Site 23","Site 22","Site 21","Site 20","Site 19","Site 18","Site 17","Site 16","Site 15","Site 14","Site 13","Site 12","Site 11","Site 10","Site 9","Site 8","Site 7","Site 6","Site 5","Site 4","Site 3","Site 2","Cl2 Trends","Site 1","Plant TOC","OEL Calc","TTHM GOAL CALC","HAA5 GOAL CALC","LT GOAL SMRY","Example","TOC-UV","LRAA Sites 1-4","LRAA Sites 5-8","LRAA Sites 9-12"],"not_rendered":{"charts":143,"images":0,"macros":1,"external_links":0,"defined_names":383,"comments":37,"pivot_tables":0},"unopened":[],"bounds":{"document_bytes":16777216,"sheet_cells":100000,"rows_first":2000,"rows_last":500,"rows_between":2000,"halvings":0,"cell_chars":16384,"cell_head_chars":4096},"cells_cut":0,"cells_raw":0,"read":"whole","date_system":"1900"}

{"sheet":"Criteria","index":0,"n_rows":34,"n_cols":7,"rows_kept":34,"cut":false,"hidden":true,"merged":[]}
[null,"MenuSheetLink",1,null,null,"MenuSheetLink1",1]
[null,null,"Select Data Entry",null,null,null,"Select Charts & Tables"]
[null,null,"Main Menu",null,null,null,"Main Menu"]
[null,null,"Site 1",null,null,null,"Cl2 Trends"]
[null,null,"Site 2",null,null,null,"TTHM Goals"]
[null,null,"Site 3",null,null,null,"HAA5 Goals"]
[null,null,"Site 4",null,null,null,"Long Term Trends"]
[null,null,"Site 5",null,null,null,"OEL Calc"]
[null,null,"Site 6",null,null,null,"TOC/UV Trends"]
[null,null,"Site 7",null,null,null,"Summary Table"]
[null,null,"Site 8",null,null,null,"Master Database"]
[null,null,"Site 9",null,null,null,"Master Comment"]
[null,null,"Site 10"]
[null,null,"Site 11"]
[null,null,"Site 12"]
[null,null,"Site 13"]
[null,null,"Site 14"]
[null,null,"Site 15"]
[null,null,"Site 16"]
[null,null,"Site 17"]
[null,null,"Site 18"]
[null,null,"Site 19"]
[null,null,"Site 20"]
[null,null,"Site 21"]
[null,null,"Site 22"]
[null,null,"Site 23"]
[null,null,"Site 24"]
[null,null,"Site 25"]
[null,null,"Site 26"]
[null,null,"Site 27"]
[null,null,"Site 28"]
[null,null,"Site 29"]
[null,null,"Site 30"]
[null,null,"Plant TOC & UV"]

{"sheet":"Master Table","index":1,"n_rows":4,"n_cols":10,"rows_kept":4,"cut":false,"hidden":true,"merged":[]}
[]
[]
[]
[null,"Site ID","Date","TTHM ppb","HAA5 ppb","THM Plus ppb","Temp. C","Cl2 ppm","pH units","THM+ Ratio"]

{"sheet":"Site Template","index":2,"n_rows":46,"n_cols":49,"rows_kept":46,"cut":false,"hidden":true,"merged":[]}
[null,null,null,null,null,null,null,null,null,null,null,null,null,"Page Down to Enter Site Data"]
[]
[]
[]
[null,null,null,null,null,null,null,null,null,{"$f":"Main!C12","v":"Site 4"},null,{"$f":"Main!F12","v":0},null,null,null,"Enter Y if DBP Compliance Site    →",null,null,null,"Y","Columns below can be modified for system specific paramters",null,null,null,null,null,null,null,null,null,null,null,"Charting Goals"]
[null,"Check Date","First TTHM Date","Month","Quarter","Year","M & Y","Q & Y","Cl2 Count",null,"Date","TTHM ppb","HAA5 ppb","THM Plus ppb","THM+ Ratio","Temp. C","pH units","Free Cl2 ppm","Total Cl2 ppm","Delta Cl2","Turbidity NTU","UV254 cm-1",null,null,null,null,null,null,null,null,null,null,"TTHM ppb","HAA5 ppb","THM Plus ppb","THM+ Ratio","Temp. C","pH units","Free Cl2 ppm","Total Cl2 ppm","Delta Cl2","Turbidity NTU","UV254 cm-1"]
[null,null,null,null,null,null,null,null,null,"System Defined Goals",null,60,40,80,null,null,8.5,0.2]
[null,null,null,null,null,null,null,null,null,"Average",null,{"$f":"AVERAGE(L11:L46)","v":{"$error":"#DIV/0!"}},{"$f":"AVERAGE(M11:M46)","v":{"$error":"#DIV/0!"}},{"$error":"#DIV/0!"},{"$error":"#DIV/0!"},{"$error":"#DIV/0!"},{"$error":"#DIV/0!"},{"$error":"#DIV/0!"},{"$error":"#DIV/0!"},{"$error":"#DIV/0!"},{"$error":"#DIV/0!"},{"$error":"#DIV/0!"},{"$error":"#DIV/0!"},{"$error":"#DIV/0!"},{"$error":"#DIV/0!"},{"$error":"#DIV/0!"},{"$error":"#DIV/0!"},{"$error":"#DIV/0!"}]
[null,null,null,null,null,null,null,null,null,"Minimum",null,{"$f":"MIN(L11:L46)","v":0},{"$f":"MIN(M11:M46)","v":0},0,0,0,0,0,0,0,0,0,0,0,0,0,0,0]
[null,null,null,null,null,null,null,null,null,"Maximum",null,{"$f":"MAX(L11:L46)","v":0},{"$f":"MAX(M11:M46)","v":0},0,0,0,0,0,0,0,0,0,0,0,0,0,0,0]
[null,null,null,null,null,null,"M & Y","Q & Y",null,null,null,null,null,null,null,null,null,null,null,null,null,null,null,null,null,null,null,null,"Provide comments below useful for data interpretation (e.g., flushing conducted in sample area, sample visibly red/brown after flush period)."]
[null,{"$f":"IF(L12,K12,)","v":"00:00:00"},{"$f":"IF(L12,1,IF(M12,1,))","v":0},{"$f":"MONTH(K12)","v":1},{"$f":"INT((MONTH(K12)-1)/3)+1","v":1},{"$f":"YEAR(K12)","v":1900},{"$f":"\"M\"&D12&\" \"&F12","v":"M1 1900"},{"$f":"\"Q\"&E12&\" \"&F12","v":"Q1 1900"},{"$f":"IF(R12<>\"\",IF(OR(R12=0,R12<0.2),1,\"\"),\"\")","v":""},{"$f":"$J$5","v":"Site 4"},null,null,null,null,{"$f":"IF(L12,IF(N12,N12/L12,\"\"),\"\")","v":""},null,null,null,null,{"$f":"IF(R12,IF(S12,S12-R12,\"\"),\"\")","v":""},null,null,null,null,null,null,null,null,null,null,null,null,{"$f":"IF($L$7,$L$7,\"\")","v":60},{"$f":"IF($M$7,$M$7,\"\")","v":40},{"$f":"IF($N$7,$N$7,\"\")","v":80},null,null,{"$f":"IF($Q$7,$Q$7,\"\")","v":8.5},{"$f":"IF($R$7,$R$7,\"\")","v":0.2},{"$f":"IF($S$7,$S$7,\"\")","v":""},null,{"$f":"IF($U$7,$U$7,\"\")","v":""},{"$f":"IF($V$7,$V$7,\"\")","v":""},{"$f":"IF($W$7,$W$7,\"\")","v":""},{"$f":"IF($X$7,$X$7,\"\")","v":""},{"$f":"IF($Y$7,$Y$7,\"\")","v":""},{"$f":"IF($Z$7,$Z$7,\"\")","v":""},{"$f":"IF($AA$7,$AA$7,\"\")","v":""},{"$f":"IF($AB$7,$AB$7,\"\")","v":""}]
[null,{"$f":"IF(L13,K13,)","v":"00:00:00"},{"$f":"IF(L13,1,IF(M13,1,))","v":0},{"$f":"MONTH(K13)","v":1},{"$f":"INT((MONTH(K13)-1)/3)+1","v":1},{"$f":"YEAR(K13)","v":1900},{"$f":"\"M\"&D13&\" \"&F13","v":"M1 1900"},{"$f":"\"Q\"&E13&\" \"&F13","v":"Q1 1900"},{"$f":"IF(R13<>\"\",IF(OR(R13=0,R13<0.2),1,\"\"),\"\")","v":""},{"$f":"$J$5","v":"Site 4"},null,null,null,null,{"$f":"IF(L13,IF(N13,N13/L13,\"\"),\"\")","v":""},null,null,null,null,{"$f":"IF(R13,IF(S13,S13-R13,\"\"),\"\")","v":""},null,null,null,null,null,null,null,null,null,null,null,null,{"$f":"IF($L$7,$L$7,\"\")","v":60},{"$f":"IF($M$7,$M$7,\"\")","v":40},{"$f":"IF($N$7,$N$7,\"\")","v":80},null,null,{"$f":"IF($Q$7,$Q$7,\"\")","v":8.5},{"$f":"IF($R$7,$R$7,\"\")","v":0.2},{"$f":"IF($S$7,$S$7,\"\")","v":""},null,{"$f":"IF($U$7,$U$7,\"\")","v":""},{"$f":"IF($V$7,$V$7,\"\")","v":""},{"$f":"IF($W$7,$W$7,\"\")","v":""},{"$f":"IF($X$7,$X$7,\"\")","v":""},{"$f":"IF($Y$7,$Y$7,\"\")","v":""},{"$f":"IF($Z$7,$Z$7,\"\")","v":""},{"$f":"IF($AA$7,$AA$7,\"\")","v":""},{"$f":"IF($AB$7,$AB$7,\"\")","v":""}]
[null,{"$f":"IF(L14,K14,)","v":"00:00:00"},{"$f":"IF(L14,1,IF(M14,1,))","v":0},{"$f":"MONTH(K14)","v":1},{"$f":"INT((MONTH(K14)-1)/3)+1","v":1},{"$f":"YEAR(K14)","v":1900},{"$f":"\"M\"&D14&\" \"&F14","v":"M1 1900"},{"$f":"\"Q\"&E14&\" \"&F14","v":"Q1 1900"},"","Site 4",null,null,null,null,{"$f":"IF(L14,IF(N14,N14/L14,\"\"),\"\")","v":""},null,null,null,null,{"$f":"IF(R14,IF(S14,S14-R14,\"\"),\"\")","v":""},null,null,null,null,null,null,null,null,null,null,null,null,{"$f":"IF($L$7,$L$7,\"\")","v":60},{"$f":"IF($M$7,$M$7,\"\")","v":40},{"$f":"IF($N$7,$N$7,\"\")","v":80},null,null,{"$f":"IF($Q$7,$Q$7,\"\")","v":8.5},{"$f":"IF($R$7,$R$7,\"\")","v":0.2},{"$f":"IF($S$7,$S$7,\"\")","v":""},null,{"$f":"IF($U$7,$U$7,\"\")","v":""},{"$f":"IF($V$7,$V$7,\"\")","v":""},{"$f":"IF($W$7,$W$7,\"\")","v":""},{"$f":"IF($X$7,$X$7,\"\")","v":""},{"$f":"IF($Y$7,$Y$7,\"\")","v":""},{"$f":"IF($Z$7,$Z$7,\"\")","v":""},{"$f":"IF($AA$7,$AA$7,\"\")","v":""},{"$f":"IF($AB$7,$AB$7,\"\")","v":""}]
[null,"00:00:00",0,1,1,1900,"M1 1900","Q1 1900","","Site 4",null,null,null,null,{"$f":"IF(L15,IF(N15,N15/L15,\"\"),\"\")","v":""},null,null,null,null,{"$f":"IF(S15,S15-R15,\"\")","v":""},null,null,null,null,null,null,null,null,null,null,null,null,60,40,80,null,null,8.5,0.2,"",null,"","","","","","","",""]
[null,"00:00:00",0,1,1,1900,"M1 1900","Q1 1900","","Site 4",null,null,null,null,{"$f":"IF(L16,IF(N16,N16/L16,\"\"),\"\")","v":""},null,null,null,null,"",null,null,null,null,null,null,null,null,null,null,null,null,60,40,80,null,null,8.5,0.2,"",null,"","","","","","","",""]
[null,"00:00:00",0,1,1,1900,"M1 1900","Q1 1900","","Site 4",null,null,null,null,"",null,null,null,null,"",null,null,null,null,null,null,null,null,null,null,null,null,60,40,80,null,null,8.5,0.2,"",null,"","","","","","","",""]
[null,"00:00:00",0,1,1,1900,"M1 1900","Q1 1900","","Site 4",null,null,null,null,"",null,null,null,null,"",null,null,null,null,null,null,null,null,null,null,null,null,60,40,80,null,null,8.5,0.2,"",null,"","","","","","","",""]
[null,"00:00:00",0,1,1,1900,"M1 1900","Q1 1900","","Site 4",null,null,null,null,"",null,null,null,null,"",null,null,null,null,null,null,null,null,null,null,null,null,60,40,80,null,null,8.5,0.2,"",null,"","","","","","","",""]
[null,"00:00:00",0,1,1,1900,"M1 1900","Q1 1900","","Site 4",null,null,null,null,"",null,null,null,null,"",null,null,null,null,null,null,null,null,null,null,null,null,60,40,80,null,null,8.5,0.2,"",null,"","","","","","","",""]
[null,"00:00:00",0,1,1,1900,"M1 1900","Q1 1900","","Site 4",null,null,null,null,"",null,null,null,null,"",null,null,null,null,null,null,null,null,null,null,null,null,60,40,80,null,null,8.5,0.2,"",null,"","","","","","","",""]
[null,"00:00:00",0,1,1,1900,"M1 1900","Q1 1900","","Site 4",null,null,null,null,"",null,null,null,null,"",null,null,null,null,null,null,null,null,null,null,null,null,60,40,80,null,null,8.5,0.2,"",null,"","","","","","","",""]
[null,"00:00:00",0,1,1,1900,"M1 1900","Q1 1900","","Site 4",null,null,null,null,"",null,null,null,null,"",null,null,null,null,null,null,null,null,null,null,null,null,60,40,80,null,null,8.5,0.2,"",null,"","","","","","","",""]
[null,"00:00:00",0,1,1,1900,"M1 1900","Q1 1900","","Site 4",null,null,null,null,"",null,null,null,null,"",null,null,null,null,null,null,null,null,null,null,null,null,60,40,80,null,null,8.5,0.2,"",null,"","","","","","","",""]
[null,"00:00:00",0,1,1,1900,"M1 1900","Q1 1900","","Site 4",null,null,null,null,"",null,null,null,null,"",null,null,null,null,null,null,null,null,null,null,null,null,60,40,80,null,null,8.5,0.2,"",null,"","","","","","","",""]
[null,"00:00:00",0,1,1,1900,"M1 1900","Q1 1900","","Site 4",null,null,null,null,"",null,null,null,null,"",null,null,null,null,null,null,null,null,null,null,null,null,60,40,80,null,null,8.5,0.2,"",null,"","","","","","","",""]
[null,"00:00:00",0,1,1,1900,"M1 1900","Q1 1900","","Site 4",null,null,null,null,"",null,null,null,null,"",null,null,null,null,null,null,null,null,null,null,null,null,60,40,80,null,null,8.5,0.2,"",null,"","","","","","","",""]
[null,"00:00:00",0,1,1,1900,"M1 1900","Q1 1900","","Site 4",null,null,null,null,"",null,null,null,null,"",null,null,null,null,null,null,null,null,null,null,null,null,60,40,80,null,null,8.5,0.2,"",null,"","","","","","","",""]
[null,"00:00:00",0,1,1,1900,"M1 1900","Q1 1900","","Site 4",null,null,null,null,"",null,null,null,null,"",null,null,null,null,null,null,null,null,null,null,null,null,60,40,80,null,null,8.5,0.2,"",null,"","","","","","","",""]
[null,"00:00:00",0,1,1,1900,"M1 1900","Q1 1900","","Site 4",null,null,null,null,"",null,null,null,null,"",null,null,null,null,null,null,null,null,null,null,null,null,60,40,80,null,null,8.5,0.2,"",null,"","","","","","","",""]
[null,"00:00:00",0,1,1,1900,"M1 1900","Q1 1900","","Site 4",null,null,null,null,"",null,null,null,null,"",null,null,null,null,null,null,null,null,null,null,null,null,60,40,80,null,null,8.5,0.2,"",null,"","","","","","","",""]
[null,"00:00:00",0,1,1,1900,"M1 1900","Q1 1900","","Site 4",null,null,null,null,"",null,null,null,null,"",null,null,null,null,null,null,null,null,null,null,null,null,60,40,80,null,null,8.5,0.2,"",null,"","","","","","","",""]
[null,"00:00:00",0,1,1,1900,"M1 1900","Q1 1900","","Site 4",null,null,null,null,"",null,null,null,null,"",null,null,null,null,null,null,null,null,null,null,null,null,60,40,80,null,null,8.5,0.2,"",null,"","","","","","","",""]
[null,"00:00:00",0,1,1,1900,"M1 1900","Q1 1900","","Site 4",null,null,null,null,"",null,null,null,null,"",null,null,null,null,null,null,null,null,null,null,null,null,60,40,80,null,null,8.5,0.2,"",null,"","","","","","","",""]
[null,"00:00:00",0,1,1,1900,"M1 1900","Q1 1900","","Site 4",null,null,null,null,"",null,null,null,null,"",null,null,null,null,null,null,null,null,null,null,null,null,60,40,80,null,null,8.5,0.2,"",null,"","","","","","","",""]
[null,"00:00:00",0,1,1,1900,"M1 1900","Q1 1900","","Site 4",null,null,null,null,"",null,null,null,null,"",null,null,null,null,null,null,null,null,null,null,null,null,60,40,80,null,null,8.5,0.2,"",null,"","","","","","","",""]
[null,"00:00:00",0,1,1,1900,"M1 1900","Q1 1900","","Site 4",null,null,null,null,"",null,null,null,null,"",null,null,null,null,null,null,null,null,null,null,null,null,60,40,80,null,null,8.5,0.2,"",null,"","","","","","","",""]
[null,"00:00:00",0,1,1,1900,"M1 1900","Q1 1900","","Site 4",null,null,null,null,"",null,null,null,null,"",null,null,null,null,null,null,null,null,null,null,null,null,60,40,80,null,null,8.5,0.2,"",null,"","","","","","","",""]
[null,"00:00:00",0,1,1,1900,"M1 1900","Q1 1900","","Site 4",null,null,null,null,"",null,null,null,null,"",null,null,null,null,null,null,null,null,null,null,null,null,60,40,80,null,null,8.5,0.2,"",null,"","","","","","","",""]
[null,"00:00:00",0,1,1,1900,"M1 1900","Q1 1900","","Site 4",null,null,null,null,"",null,null,null,null,"",null,null,null,null,null,null,null,null,null,null,null,null,60,40,80,null,null,8.5,0.2,"",null,"","","","","","","",""]
[null,"00:00:00",0,1,1,1900,"M1 1900","Q1 1900","","Site 4",null,null,null,null,"",null,null,null,null,"",null,null,null,null,null,null,null,null,null,null,null,null,60,40,80,null,null,8.5,0.2,"",null,"","","","","","","",""]
[null,"00:00:00",0,1,1,1900,"M1 1900","Q1 1900","","Site 4",null,null,null,null,"",null,null,null,null,"",null,null,null,null,null,null,null,null,null,null,null,null,60,40,80,null,null,8.5,0.2,"",null,"","","","","","","",""]
[null,"00:00:00",0,1,1,1900,"M1 1900","Q1 1900","","Site 4",null,null,null,null,"",null,null,null,null,"",null,null,null,null,null,null,null,null,null,null,null,null,60,40,80,null,null,8.5,0.2,"",null,"","","","","","","",""]
[null,"00:00:00",0,1,1,1900,"M1 1900","Q1 1900","","Site 4",null,null,null,null,"",null,null,null,null,"",null,null,null,null,null,null,null,null,null,null,null,null,60,40,80,null,null,8.5,0.2,"",null,"","","","","","","",""]
[null,"00:00:00",0,1,1,1900,"M1 1900","Q1 1900","","Site 4",null,null,null,null,"",null,null,null,null,"",null,null,null,null,null,null,null,null,null,null,null,null,60,40,80,null,null,8.5,0.2,"",null,"","","","","","","",""]
[{"$f":"MAX(K11:K46)","v":"00:00:00"}]

{"sheet":"Main","index":3,"n_rows":59,"n_cols":6,"rows_kept":59,"cut":false,"hidden":false,"merged":[]}
[]
[]
[null,"Warning:  Inserting new rows and columns manually in the spreadsheet may result in macro errors."]
[]
[null,"Plant/System Name"]
[null,"Plant PWS #"]
[null,"Comments"]
[null,"Site ID","Site Description",null,null,"Other Description (Long. Lat.)"]
[null,"Site 1","Entry Point"]
[null,"Site 2","Site 2"]
[null,"Site 3","Site 3"]
[null,"Site 4","Site 4"]
[null,"Site 5","Site 5"]
[null,"Site 6","Site 6"]
[null,"Site 7","Site 7"]
[null,"Site 8","Site 8"]
[null,"Site 9","Site 9"]
[null,"Site 10","Site 10"]
[null,"Site 11","Site 11"]
[null,"Site 12","Site 12"]
[null,"Site 13","Site 13"]
[null,"Site 14","Site 14"]
[null,"Site 15","Site 15"]
[null,"Site 16","Site 16"]
[null,"Site 17","Site 17"]
[null,"Site 18","Site 18"]
[null,"Site 19","Site 19"]
[null,"Site 20","Site 20"]
[null,"Site 21","Site 21"]
[null,"Site 22","Site 22"]
[null,"Site 23","Site 23"]
[null,"Site 24","Site 24"]
[null,"Site 25","Site 25"]
[null,"Site 26","Site 26"]
[null,"Site 27","Site 27"]
[null,"Site 28","Site 28"]
[null,"Site 29","Site 29"]
[null,"Site 30","Site 30"]
[]
[]
[]
[]
[]
[null,"This spreadsheet is used to trend the following data at DBP sample sites:"]
[null,"DBPs (TTHM & HAA5)"]
[null,"THM Plus"]
[null,"Chlorine residual (free and total), pH, temperature"]
[null,"User identified parameters"]
[null,"Note:  LRAA calculations can accommodate up to 5 years (20 quarters) of data in this spreadsheet"]
[]
[]
[null,"This speadsheet is also used to trend the following data at TOC samples sites:"]
[null,"TOC (source and filtered)"]
[null,"pH"]
[null,"Alkalinity"]
[null,"Coagulant dose"]
[null,"Coagulant pH"]
[null,"UV254 (source and settled - nonchlorinated)"]
[null,"Note: RAA calcuations can accommodate up to 3 years (12 quarters) of data in this spreadsheet"]

{"sheet":"Summary Table","index":4,"n_rows":39,"n_cols":9,"rows_kept":39,"cut":false,"hidden":true,"merged":[]}
[]
[]
[null,"Sample Site Summary Table"]
[null,null,null,"TTHM LRAA","TTHM % / Long Term","HAA5 LRAA","HAA5 % / Long Term","Avg. Free Cl2 ppm","# Cl2 < 0.20 mg/L"]
[null,{"$f":"'Site 1'!J5","v":"Entry Point"},{"$f":"'Site 1'!L5","v":""},{"$f":"IF('TTHM GOAL CALC'!N49=\"NA\",\"\",'TTHM GOAL CALC'!N49)","v":""},{"$f":"IF(ISNUMBER(D5),'TTHM GOAL CALC'!N49/'TTHM GOAL CALC'!$E$6,\"\")","v":""},{"$f":"IF('HAA5 GOAL CALC'!N49=\"NA\",\"\",'HAA5 GOAL CALC'!N49)","v":""},{"$f":"IF(ISNUMBER(F5),'HAA5 GOAL CALC'!N49/'HAA5 GOAL CALC'!$E$6,\"\")","v":""},{"$f":"IF(ISERROR('Cl2 Trends'!BN146),\"\",'Cl2 Trends'!BN146)","v":""},{"$f":"'Cl2 Trends'!BM184","v":0}]
[null,{"$f":"'Site 2'!J5","v":"Site 2"},{"$f":"'Site 2'!L5","v":""},{"$f":"IF('TTHM GOAL CALC'!N50=\"NA\",\"\",'TTHM GOAL CALC'!N50)","v":""},{"$f":"IF(ISNUMBER(D6),'TTHM GOAL CALC'!N50/'TTHM GOAL CALC'!$E$6,\"\")","v":""},{"$f":"IF('HAA5 GOAL CALC'!N50=\"NA\",\"\",'HAA5 GOAL CALC'!N50)","v":""},{"$f":"IF(ISNUMBER(F6),'HAA5 GOAL CALC'!N50/'HAA5 GOAL CALC'!$E$6,\"\")","v":""},{"$f":"IF(ISERROR('Cl2 Trends'!BN147),\"\",'Cl2 Trends'!BN147)","v":""},{"$f":"'Cl2 Trends'!BM185","v":0}]
[null,{"$f":"'Site 3'!J5","v":"Site 3"},{"$f":"'Site 3'!L5","v":""},{"$f":"IF('TTHM GOAL CALC'!N51=\"NA\",\"\",'TTHM GOAL CALC'!N51)","v":""},{"$f":"IF(ISNUMBER(D7),'TTHM GOAL CALC'!N51/'TTHM GOAL CALC'!$E$6,\"\")","v":""},{"$f":"IF('HAA5 GOAL CALC'!N51=\"NA\",\"\",'HAA5 GOAL CALC'!N51)","v":""},{"$f":"IF(ISNUMBER(F7),'HAA5 GOAL CALC'!N51/'HAA5 GOAL CALC'!$E$6,\"\")","v":""},{"$f":"IF(ISERROR('Cl2 Trends'!BN148),\"\",'Cl2 Trends'!BN148)","v":""},{"$f":"'Cl2 Trends'!BM186","v":0}]
[null,{"$f":"'Site 4'!J5","v":"Site 4"},{"$f":"'Site 4'!L5","v":""},{"$f":"IF('TTHM GOAL CALC'!N52=\"NA\",\"\",'TTHM GOAL CALC'!N52)","v":""},{"$f":"IF(ISNUMBER(D8),'TTHM GOAL CALC'!N52/'TTHM GOAL CALC'!$E$6,\"\")","v":""},{"$f":"IF('HAA5 GOAL CALC'!N52=\"NA\",\"\",'HAA5 GOAL CALC'!N52)","v":""},{"$f":"IF(ISNUMBER(F8),'HAA5 GOAL CALC'!N52/'HAA5 GOAL CALC'!$E$6,\"\")","v":""},{"$f":"IF(ISERROR('Cl2 Trends'!BN149),\"\",'Cl2 Trends'!BN149)","v":""},{"$f":"'Cl2 Trends'!BM187","v":0}]
[null,{"$f":"'Site 5'!J5","v":"Site 5"},{"$f":"'Site 5'!L5","v":""},{"$f":"IF('TTHM GOAL CALC'!N53=\"NA\",\"\",'TTHM GOAL CALC'!N53)","v":""},{"$f":"IF(ISNUMBER(D9),'TTHM GOAL CALC'!N53/'TTHM GOAL CALC'!$E$6,\"\")","v":""},{"$f":"IF('HAA5 GOAL CALC'!N53=\"NA\",\"\",'HAA5 GOAL CALC'!N53)","v":""},{"$f":"IF(ISNUMBER(F9),'HAA5 GOAL CALC'!N53/'HAA5 GOAL CALC'!$E$6,\"\")","v":""},{"$f":"IF(ISERROR('Cl2 Trends'!BN150),\"\",'Cl2 Trends'!BN150)","v":""},{"$f":"'Cl2 Trends'!BM188","v":0}]
[null,{"$f":"'Site 6'!J5","v":"Site 6"},{"$f":"'Site 6'!L5","v":""},{"$f":"IF('TTHM GOAL CALC'!N54=\"NA\",\"\",'TTHM GOAL CALC'!N54)","v":""},{"$f":"IF(ISNUMBER(D10),'TTHM GOAL CALC'!N54/'TTHM GOAL CALC'!$E$6,\"\")","v":""},{"$f":"IF('HAA5 GOAL CALC'!N54=\"NA\",\"\",'HAA5 GOAL CALC'!N54)","v":""},{"$f":"IF(ISNUMBER(F10),'HAA5 GOAL CALC'!N54/'HAA5 GOAL CALC'!$E$6,\"\")","v":""},{"$f":"IF(ISERROR('Cl2 Trends'!BN151),\"\",'Cl2 Trends'!BN151)","v":""},{"$f":"'Cl2 Trends'!BM189","v":0}]
[null,{"$f":"'Site 7'!J5","v":"Site 7"},{"$f":"'Site 7'!L5","v":""},{"$f":"IF('TTHM GOAL CALC'!N55=\"NA\",\"\",'TTHM GOAL CALC'!N55)","v":""},{"$f":"IF(ISNUMBER(D11),'TTHM GOAL CALC'!N55/'TTHM GOAL CALC'!$E$6,\"\")","v":""},{"$f":"IF('HAA5 GOAL CALC'!N55=\"NA\",\"\",'HAA5 GOAL CALC'!N55)","v":""},{"$f":"IF(ISNUMBER(F11),'HAA5 GOAL CALC'!N55/'HAA5 GOAL CALC'!$E$6,\"\")","v":""},{"$f":"IF(ISERROR('Cl2 Trends'!BN152),\"\",'Cl2 Trends'!BN152)","v":""},{"$f":"'Cl2 Trends'!BM190","v":0}]
[null,{"$f":"'Site 8'!J5","v":"Site 8"},{"$f":"'Site 8'!L5","v":""},{"$f":"IF('TTHM GOAL CALC'!N56=\"NA\",\"\",'TTHM GOAL CALC'!N56)","v":""},{"$f":"IF(ISNUMBER(D12),'TTHM GOAL CALC'!N56/'TTHM GOAL CALC'!$E$6,\"\")","v":""},{"$f":"IF('HAA5 GOAL CALC'!N56=\"NA\",\"\",'HAA5 GOAL CALC'!N56)","v":""},{"$f":"IF(ISNUMBER(F12),'HAA5 GOAL CALC'!N56/'HAA5 GOAL CALC'!$E$6,\"\")","v":""},{"$f":"IF(ISERROR('Cl2 Trends'!BN153),\"\",'Cl2 Trends'!BN153)","v":""},{"$f":"'Cl2 Trends'!BM191","v":0}]
[null,{"$f":"'Site 9'!J5","v":"Site 9"},{"$f":"'Site 9'!L5","v":""},{"$f":"IF('TTHM GOAL CALC'!N57=\"NA\",\"\",'TTHM GOAL CALC'!N57)","v":""},{"$f":"IF(ISNUMBER(D13),'TTHM GOAL CALC'!N57/'TTHM GOAL CALC'!$E$6,\"\")","v":""},{"$f":"IF('HAA5 GOAL CALC'!N57=\"NA\",\"\",'HAA5 GOAL CALC'!N57)","v":""},{"$f":"IF(ISNUMBER(F13),'HAA5 GOAL CALC'!N57/'HAA5 GOAL CALC'!$E$6,\"\")","v":""},{"$f":"IF(ISERROR('Cl2 Trends'!BN154),\"\",'Cl2 Trends'!BN154)","v":""},{"$f":"'Cl2 Trends'!BM192","v":0}]
[null,{"$f":"'Site 10'!J5","v":"Site 10"},{"$f":"'Site 10'!L5","v":""},{"$f":"IF('TTHM GOAL CALC'!N58=\"NA\",\"\",'TTHM GOAL CALC'!N58)","v":""},{"$f":"IF(ISNUMBER(D14),'TTHM GOAL CALC'!N58/'TTHM GOAL CALC'!$E$6,\"\")","v":""},{"$f":"IF('HAA5 GOAL CALC'!N58=\"NA\",\"\",'HAA5 GOAL CALC'!N58)","v":""},{"$f":"IF(ISNUMBER(F14),'HAA5 GOAL CALC'!N58/'HAA5 GOAL CALC'!$E$6,\"\")","v":""},{"$f":"IF(ISERROR('Cl2 Trends'!BN155),\"\",'Cl2 Trends'!BN155)","v":""},{"$f":"'Cl2 Trends'!BM193","v":0}]
[null,{"$f":"'Site 11'!J5","v":"Site 11"},{"$f":"'Site 11'!L5","v":""},{"$f":"IF('TTHM GOAL CALC'!N59=\"NA\",\"\",'TTHM GOAL CALC'!N59)","v":""},{"$f":"IF(ISNUMBER(D15),'TTHM GOAL CALC'!N59/'TTHM GOAL CALC'!$E$6,\"\")","v":""},{"$f":"IF('HAA5 GOAL CALC'!N59=\"NA\",\"\",'HAA5 GOAL CALC'!N59)","v":""},{"$f":"IF(ISNUMBER(F15),'HAA5 GOAL CALC'!N59/'HAA5 GOAL CALC'!$E$6,\"\")","v":""},{"$f":"IF(ISERROR('Cl2 Trends'!BN156),\"\",'Cl2 Trends'!BN156)","v":""},{"$f":"'Cl2 Trends'!BM194","v":0}]
[null,{"$f":"'Site 12'!J5","v":"Site 12"},{"$f":"'Site 12'!L5","v":""},{"$f":"IF('TTHM GOAL CALC'!N60=\"NA\",\"\",'TTHM GOAL CALC'!N60)","v":""},{"$f":"IF(ISNUMBER(D16),'TTHM GOAL CALC'!N60/'TTHM GOAL CALC'!$E$6,\"\")","v":""},{"$f":"IF('HAA5 GOAL CALC'!N60=\"NA\",\"\",'HAA5 GOAL CALC'!N60)","v":""},{"$f":"IF(ISNUMBER(F16),'HAA5 GOAL CALC'!N60/'HAA5 GOAL CALC'!$E$6,\"\")","v":""},{"$f":"IF(ISERROR('Cl2 Trends'!BN157),\"\",'Cl2 Trends'!BN157)","v":""},{"$f":"'Cl2 Trends'!BM195","v":0}]
[null,{"$f":"'Site 13'!J5","v":"Site 13"},{"$f":"'Site 13'!L5","v":""},{"$f":"IF('TTHM GOAL CALC'!N61=\"NA\",\"\",'TTHM GOAL CALC'!N61)","v":""},{"$f":"IF(ISNUMBER(D17),'TTHM GOAL CALC'!N61/'TTHM GOAL CALC'!$E$6,\"\")","v":""},{"$f":"IF('HAA5 GOAL CALC'!N61=\"NA\",\"\",'HAA5 GOAL CALC'!N61)","v":""},{"$f":"IF(ISNUMBER(F17),'HAA5 GOAL CALC'!N61/'HAA5 GOAL CALC'!$E$6,\"\")","v":""},{"$f":"IF(ISERROR('Cl2 Trends'!BN158),\"\",'Cl2 Trends'!BN158)","v":""},{"$f":"'Cl2 Trends'!BM196","v":0}]
[null,{"$f":"'Site 14'!J5","v":"Site 14"},{"$f":"'Site 14'!L5","v":""},{"$f":"IF('TTHM GOAL CALC'!N62=\"NA\",\"\",'TTHM GOAL CALC'!N62)","v":""},{"$f":"IF(ISNUMBER(D18),'TTHM GOAL CALC'!N62/'TTHM GOAL CALC'!$E$6,\"\")","v":""},{"$f":"IF('HAA5 GOAL CALC'!N62=\"NA\",\"\",'HAA5 GOAL CALC'!N62)","v":""},{"$f":"IF(ISNUMBER(F18),'HAA5 GOAL CALC'!N62/'HAA5 GOAL CALC'!$E$6,\"\")","v":""},{"$f":"IF(ISERROR('Cl2 Trends'!BN159),\"\",'Cl2 Trends'!BN159)","v":""},{"$f":"'Cl2 Trends'!BM197","v":0}]
[null,{"$f":"'Site 15'!J5","v":"Site 15"},{"$f":"'Site 15'!L5","v":""},{"$f":"IF('TTHM GOAL CALC'!N63=\"NA\",\"\",'TTHM GOAL CALC'!N63)","v":""},{"$f":"IF(ISNUMBER(D19),'TTHM GOAL CALC'!N63/'TTHM GOAL CALC'!$E$6,\"\")","v":""},{"$f":"IF('HAA5 GOAL CALC'!N63=\"NA\",\"\",'HAA5 GOAL CALC'!N63)","v":""},{"$f":"IF(ISNUMBER(F19),'HAA5 GOAL CALC'!N63/'HAA5 GOAL CALC'!$E$6,\"\")","v":""},{"$f":"IF(ISERROR('Cl2 Trends'!BN160),\"\",'Cl2 Trends'!BN160)","v":""},{"$f":"'Cl2 Trends'!BM198","v":0}]
[null,{"$f":"'Site 16'!J5","v":"Site 16"},{"$f":"'Site 16'!L5","v":""},{"$f":"IF('TTHM GOAL CALC'!N64=\"NA\",\"\",'TTHM GOAL CALC'!N64)","v":""},{"$f":"IF(ISNUMBER(D20),'TTHM GOAL CALC'!N64/'TTHM GOAL CALC'!$E$6,\"\")","v":""},{"$f":"IF('HAA5 GOAL CALC'!N64=\"NA\",\"\",'HAA5 GOAL CALC'!N64)","v":""},{"$f":"IF(ISNUMBER(F20),'HAA5 GOAL CALC'!N64/'HAA5 GOAL CALC'!$E$6,\"\")","v":""},{"$f":"IF(ISERROR('Cl2 Trends'!BN161),\"\",'Cl2 Trends'!BN161)","v":""},{"$f":"'Cl2 Trends'!BM199","v":0}]
[null,{"$f":"'Site 17'!J5","v":"Site 17"},{"$f":"'Site 17'!L5","v":""},{"$f":"IF('TTHM GOAL CALC'!N65=\"NA\",\"\",'TTHM GOAL CALC'!N65)","v":""},{"$f":"IF(ISNUMBER(D21),'TTHM GOAL CALC'!N65/'TTHM GOAL CALC'!$E$6,\"\")","v":""},{"$f":"IF('HAA5 GOAL CALC'!N65=\"NA\",\"\",'HAA5 GOAL CALC'!N65)","v":""},{"$f":"IF(ISNUMBER(F21),'HAA5 GOAL CALC'!N65/'HAA5 GOAL CALC'!$E$6,\"\")","v":""},{"$f":"IF(ISERROR('Cl2 Trends'!BN162),\"\",'Cl2 Trends'!BN162)","v":""},{"$f":"'Cl2 Trends'!BM200","v":0}]
[null,{"$f":"'Site 18'!J5","v":"Site 18"},{"$f":"'Site 18'!L5","v":""},{"$f":"IF('TTHM GOAL CALC'!N66=\"NA\",\"\",'TTHM GOAL CALC'!N66)","v":""},{"$f":"IF(ISNUMBER(D22),'TTHM GOAL CALC'!N66/'TTHM GOAL CALC'!$E$6,\"\")","v":""},{"$f":"IF('HAA5 GOAL CALC'!N66=\"NA\",\"\",'HAA5 GOAL CALC'!N66)","v":""},{"$f":"IF(ISNUMBER(F22),'HAA5 GOAL CALC'!N66/'HAA5 GOAL CALC'!$E$6,\"\")","v":""},{"$f":"IF(ISERROR('Cl2 Trends'!BN163),\"\",'Cl2 Trends'!BN163)","v":""},{"$f":"'Cl2 Trends'!BM201","v":0}]
[null,{"$f":"'Site 19'!J5","v":"Site 19"},{"$f":"'Site 19'!L5","v":""},{"$f":"IF('TTHM GOAL CALC'!N67=\"NA\",\"\",'TTHM GOAL CALC'!N67)","v":""},{"$f":"IF(ISNUMBER(D23),'TTHM GOAL CALC'!N67/'TTHM GOAL CALC'!$E$6,\"\")","v":""},{"$f":"IF('HAA5 GOAL CALC'!N67=\"NA\",\"\",'HAA5 GOAL CALC'!N67)","v":""},{"$f":"IF(ISNUMBER(F23),'HAA5 GOAL CALC'!N67/'HAA5 GOAL CALC'!$E$6,\"\")","v":""},{"$f":"IF(ISERROR('Cl2 Trends'!BN164),\"\",'Cl2 Trends'!BN164)","v":""},{"$f":"'Cl2 Trends'!BM202","v":0}]
[null,{"$f":"'Site 20'!J5","v":"Site 20"},{"$f":"'Site 20'!L5","v":""},{"$f":"IF('TTHM GOAL CALC'!N68=\"NA\",\"\",'TTHM GOAL CALC'!N68)","v":""},{"$f":"IF(ISNUMBER(D24),'TTHM GOAL CALC'!N68/'TTHM GOAL CALC'!$E$6,\"\")","v":""},{"$f":"IF('HAA5 GOAL CALC'!N68=\"NA\",\"\",'HAA5 GOAL CALC'!N68)","v":""},{"$f":"IF(ISNUMBER(F24),'HAA5 GOAL CALC'!N68/'HAA5 GOAL CALC'!$E$6,\"\")","v":""},{"$f":"IF(ISERROR('Cl2 Trends'!BN165),\"\",'Cl2 Trends'!BN165)","v":""},{"$f":"'Cl2 Trends'!BM203","v":0}]
[null,{"$f":"'Site 21'!J5","v":"Site 21"},{"$f":"'Site 21'!L5","v":""},{"$f":"IF('TTHM GOAL CALC'!N69=\"NA\",\"\",'TTHM GOAL CALC'!N69)","v":""},{"$f":"IF(ISNUMBER(D25),'TTHM GOAL CALC'!N69/'TTHM GOAL CALC'!$E$6,\"\")","v":""},{"$f":"IF('HAA5 GOAL CALC'!N69=\"NA\",\"\",'HAA5 GOAL CALC'!N69)","v":""},{"$f":"IF(ISNUMBER(F25),'HAA5 GOAL CALC'!N69/'HAA5 GOAL CALC'!$E$6,\"\")","v":""},{"$f":"IF(ISERROR('Cl2 Trends'!BN166),\"\",'Cl2 Trends'!BN166)","v":""},{"$f":"'Cl2 Trends'!BM204","v":0}]
[null,{"$f":"'Site 22'!J5","v":"Site 22"},{"$f":"'Site 22'!L5","v":""},{"$f":"IF('TTHM GOAL CALC'!N70=\"NA\",\"\",'TTHM GOAL CALC'!N70)","v":""},{"$f":"IF(ISNUMBER(D26),'TTHM GOAL CALC'!N70/'TTHM GOAL CALC'!$E$6,\"\")","v":""},{"$f":"IF('HAA5 GOAL CALC'!N70=\"NA\",\"\",'HAA5 GOAL CALC'!N70)","v":""},{"$f":"IF(ISNUMBER(F26),'HAA5 GOAL CALC'!N70/'HAA5 GOAL CALC'!$E$6,\"\")","v":""},{"$f":"IF(ISERROR('Cl2 Trends'!BN167),\"\",'Cl2 Trends'!BN167)","v":""},{"$f":"'Cl2 Trends'!BM205","v":0}]
[null,{"$f":"'Site 23'!J5","v":"Site 23"},{"$f":"'Site 23'!L5","v":""},{"$f":"IF('TTHM GOAL CALC'!N71=\"NA\",\"\",'TTHM GOAL CALC'!N71)","v":""},{"$f":"IF(ISNUMBER(D27),'TTHM GOAL CALC'!N71/'TTHM GOAL CALC'!$E$6,\"\")","v":""},{"$f":"IF('HAA5 GOAL CALC'!N71=\"NA\",\"\",'HAA5 GOAL CALC'!N71)","v":""},{"$f":"IF(ISNUMBER(F27),'HAA5 GOAL CALC'!N71/'HAA5 GOAL CALC'!$E$6,\"\")","v":""},{"$f":"IF(ISERROR('Cl2 Trends'!BN168),\"\",'Cl2 Trends'!BN168)","v":""},{"$f":"'Cl2 Trends'!BM206","v":0}]
[null,{"$f":"'Site 24'!J5","v":"Site 24"},{"$f":"'Site 24'!L5","v":""},{"$f":"IF('TTHM GOAL CALC'!N72=\"NA\",\"\",'TTHM GOAL CALC'!N72)","v":""},{"$f":"IF(ISNUMBER(D28),'TTHM GOAL CALC'!N72/'TTHM GOAL CALC'!$E$6,\"\")","v":""},{"$f":"IF('HAA5 GOAL CALC'!N72=\"NA\",\"\",'HAA5 GOAL CALC'!N72)","v":""},{"$f":"IF(ISNUMBER(F28),'HAA5 GOAL CALC'!N72/'HAA5 GOAL CALC'!$E$6,\"\")","v":""},{"$f":"IF(ISERROR('Cl2 Trends'!BN169),\"\",'Cl2 Trends'!BN169)","v":""},{"$f":"'Cl2 Trends'!BM207","v":0}]
[null,{"$f":"'Site 25'!J5","v":"Site 25"},{"$f":"'Site 25'!L5","v":""},{"$f":"IF('TTHM GOAL CALC'!N73=\"NA\",\"\",'TTHM GOAL CALC'!N73)","v":""},{"$f":"IF(ISNUMBER(D29),'TTHM GOAL CALC'!N73/'TTHM GOAL CALC'!$E$6,\"\")","v":""},{"$f":"IF('HAA5 GOAL CALC'!N73=\"NA\",\"\",'HAA5 GOAL CALC'!N73)","v":""},{"$f":"IF(ISNUMBER(F29),'HAA5 GOAL CALC'!N73/'HAA5 GOAL CALC'!$E$6,\"\")","v":""},{"$f":"IF(ISERROR('Cl2 Trends'!BN170),\"\",'Cl2 Trends'!BN170)","v":""},{"$f":"'Cl2 Trends'!BM208","v":0}]
[null,{"$f":"'Site 26'!J5","v":"Site 26"},{"$f":"'Site 26'!L5","v":""},{"$f":"IF('TTHM GOAL CALC'!N74=\"NA\",\"\",'TTHM GOAL CALC'!N74)","v":""},{"$f":"IF(ISNUMBER(D30),'TTHM GOAL CALC'!N74/'TTHM GOAL CALC'!$E$6,\"\")","v":""},{"$f":"IF('HAA5 GOAL CALC'!N74=\"NA\",\"\",'HAA5 GOAL CALC'!N74)","v":""},{"$f":"IF(ISNUMBER(F30),'HAA5 GOAL CALC'!N74/'HAA5 GOAL CALC'!$E$6,\"\")","v":""},{"$f":"IF(ISERROR('Cl2 Trends'!BN171),\"\",'Cl2 Trends'!BN171)","v":""},{"$f":"'Cl2 Trends'!BM209","v":0}]
[null,{"$f":"'Site 27'!J5","v":"Site 27"},{"$f":"'Site 27'!L5","v":""},{"$f":"IF('TTHM GOAL CALC'!N75=\"NA\",\"\",'TTHM GOAL CALC'!N75)","v":""},{"$f":"IF(ISNUMBER(D31),'TTHM GOAL CALC'!N75/'TTHM GOAL CALC'!$E$6,\"\")","v":""},{"$f":"IF('HAA5 GOAL CALC'!N75=\"NA\",\"\",'HAA5 GOAL CALC'!N75)","v":""},{"$f":"IF(ISNUMBER(F31),'HAA5 GOAL CALC'!N75/'HAA5 GOAL CALC'!$E$6,\"\")","v":""},{"$f":"IF(ISERROR('Cl2 Trends'!BN172),\"\",'Cl2 Trends'!BN172)","v":""},{"$f":"'Cl2 Trends'!BM210","v":0}]
[null,{"$f":"'Site 28'!J5","v":"Site 28"},{"$f":"'Site 28'!L5","v":""},{"$f":"IF('TTHM GOAL CALC'!N76=\"NA\",\"\",'TTHM GOAL CALC'!N76)","v":""},{"$f":"IF(ISNUMBER(D32),'TTHM GOAL CALC'!N76/'TTHM GOAL CALC'!$E$6,\"\")","v":""},{"$f":"IF('HAA5 GOAL CALC'!N76=\"NA\",\"\",'HAA5 GOAL CALC'!N76)","v":""},{"$f":"IF(ISNUMBER(F32),'HAA5 GOAL CALC'!N76/'HAA5 GOAL CALC'!$E$6,\"\")","v":""},{"$f":"IF(ISERROR('Cl2 Trends'!BN173),\"\",'Cl2 Trends'!BN173)","v":""},{"$f":"'Cl2 Trends'!BM211","v":0}]
[null,{"$f":"'Site 29'!J5","v":"Site 29"},{"$f":"'Site 29'!L5","v":""},{"$f":"IF('TTHM GOAL CALC'!N77=\"NA\",\"\",'TTHM GOAL CALC'!N77)","v":""},{"$f":"IF(ISNUMBER(D33),'TTHM GOAL CALC'!N77/'TTHM GOAL CALC'!$E$6,\"\")","v":""},{"$f":"IF('HAA5 GOAL CALC'!N77=\"NA\",\"\",'HAA5 GOAL CALC'!N77)","v":""},{"$f":"IF(ISNUMBER(F33),'HAA5 GOAL CALC'!N77/'HAA5 GOAL CALC'!$E$6,\"\")","v":""},{"$f":"IF(ISERROR('Cl2 Trends'!BN174),\"\",'Cl2 Trends'!BN174)","v":""},{"$f":"'Cl2 Trends'!BM212","v":0}]
[null,{"$f":"'Site 30'!J5","v":"Site 30"},{"$f":"'Site 30'!L5","v":""},{"$f":"IF('TTHM GOAL CALC'!N78=\"NA\",\"\",'TTHM GOAL CALC'!N78)","v":""},{"$f":"IF(ISNUMBER(D34),'TTHM GOAL CALC'!N78/'TTHM GOAL CALC'!$E$6,\"\")","v":""},{"$f":"IF('HAA5 GOAL CALC'!N78=\"NA\",\"\",'HAA5 GOAL CALC'!N78)","v":""},{"$f":"IF(ISNUMBER(F34),'HAA5 GOAL CALC'!N78/'HAA5 GOAL CALC'!$E$6,\"\")","v":""},{"$f":"IF(ISERROR('Cl2 Trends'!BN175),\"\",'Cl2 Trends'!BN175)","v":""},{"$f":"'Cl2 Trends'!BM213","v":0}]
[]
[null,null,null,null,null,null,null,null,{"$f":"IF(D36,IF(H36,H36/D36,\"\"),\"\")","v":""}]
[null,null,null,null,null,null,null,null,{"$f":"IF(D37,IF(H37,H37/D37,\"\"),\"\")","v":""}]
[null,null,null,null,null,null,null,null,{"$f":"IF(D38,IF(H38,H38/D38,\"\"),\"\")","v":""}]
[null,null,null,null,null,null,null,null,{"$f":"IF(D39,IF(H39,H39/D39,\"\"),\"\")","v":""}]

{"sheet":"Master Database","index":5,"n_rows":38,"n_cols":22,"rows_kept":38,"cut":false,"hidden":true,"merged":[]}
[]
[]
[null,null,null,null,null,null,null,null,null,null,null,null,null,null,null,null,null,null,null,null,"Columns below can be modified for system specific paramters"]
[null,"Check Date","First TTHM Date","Month","Quarter","Year","M & Y","Q & Y","Cl2 Count","Site ID","Date","TTHM ppb","HAA5 ppb","THM Plus ppb","THM+ Ratio","Temp. C","pH units","Free Cl2 ppm","Total Cl2 ppm","Delta Cl2","Turbidity NTU","UV254 cm-1"]
[null,{"$f":"IF(L5,K5,)","v":"00:00:00"},{"$f":"IF(L5,1,IF(M5,1,))","v":0},{"$f":"MONTH(K5)","v":1},{"$f":"INT((MONTH(K5)-1)/3)+1","v":1},{"$f":"YEAR(K5)","v":1900},{"$f":"\"M\"&D5&\" \"&F5","v":"M1 1900"},{"$f":"\"Q\"&E5&\" \"&F5","v":"Q1 1900"},{"$f":"IF(R5<>\"\",IF(OR(R5=0,R5<0.2),1,\"\"),\"\")","v":""}]
[null,{"$f":"IF(L6,K6,)","v":"00:00:00"},{"$f":"IF(L6,1,IF(M6,1,))","v":0},{"$f":"MONTH(K6)","v":1},{"$f":"INT((MONTH(K6)-1)/3)+1","v":1},{"$f":"YEAR(K6)","v":1900},{"$f":"\"M\"&D6&\" \"&F6","v":"M1 1900"},{"$f":"\"Q\"&E6&\" \"&F6","v":"Q1 1900"},{"$f":"IF(R6<>\"\",IF(OR(R6=0,R6<0.2),1,\"\"),\"\")","v":""}]
[null,{"$f":"IF(L7,K7,)","v":"00:00:00"},{"$f":"IF(L7,1,IF(M7,1,))","v":0},{"$f":"MONTH(K7)","v":1},{"$f":"INT((MONTH(K7)-1)/3)+1","v":1},{"$f":"YEAR(K7)","v":1900},{"$f":"\"M\"&D7&\" \"&F7","v":"M1 1900"},{"$f":"\"Q\"&E7&\" \"&F7","v":"Q1 1900"},""]
[null,"00:00:00",0,1,1,1900,"M1 1900","Q1 1900",""]
[null,"00:00:00",0,1,1,1900,"M1 1900","Q1 1900",""]
[null,"00:00:00",0,1,1,1900,"M1 1900","Q1 1900",""]
[null,"00:00:00",0,1,1,1900,"M1 1900","Q1 1900",""]
[null,"00:00:00",0,1,1,1900,"M1 1900","Q1 1900",""]
[null,"00:00:00",0,1,1,1900,"M1 1900","Q1 1900",""]
[null,"00:00:00",0,1,1,1900,"M1 1900","Q1 1900",""]
[null,"00:00:00",0,1,1,1900,"M1 1900","Q1 1900",""]
[null,"00:00:00",0,1,1,1900,"M1 1900","Q1 1900",""]
[null,"00:00:00",0,1,1,1900,"M1 1900","Q1 1900",""]
[null,"00:00:00",0,1,1,1900,"M1 1900","Q1 1900",""]
[null,"00:00:00",0,1,1,1900,"M1 1900","Q1 1900",""]
[null,"00:00:00",0,1,1,1900,"M1 1900","Q1 1900",""]
[null,"00:00:00",0,1,1,1900,"M1 1900","Q1 1900",""]
[null,"00:00:00",0,1,1,1900,"M1 1900","Q1 1900",""]
[null,"00:00:00",0,1,1,1900,"M1 1900","Q1 1900",""]
[null,"00:00:00",0,1,1,1900,"M1 1900","Q1 1900",""]
[null,"00:00:00",0,1,1,1900,"M1 1900","Q1 1900",""]
[null,"00:00:00",0,1,1,1900,"M1 1900","Q1 1900",""]
[null,"00:00:00",0,1,1,1900,"M1 1900","Q1 1900",""]
[null,"00:00:00",0,1,1,1900,"M1 1900","Q1 1900",""]
[null,"00:00:00",0,1,1,1900,"M1 1900","Q1 1900",""]
[null,"00:00:00",0,1,1,1900,"M1 1900","Q1 1900",""]
[null,"00:00:00",0,1,1,1900,"M1 1900","Q1 1900",""]
[null,"00:00:00",0,1,1,1900,"M1 1900","Q1 1900",""]
[null,"00:00:00",0,1,1,1900,"M1 1900","Q1 1900",""]
[null,"00:00:00",0,1,1,1900,"M1 1900","Q1 1900",""]
[null,"00:00:00",0,1,1,1900,"M1 1900","Q1 1900",""]
[null,"00:00:00",0,1,1,1900,"M1 1900","Q1 1900",""]
[null,"00:00:00",0,1,1,1900,"M1 1900","Q1 1900",""]
[null,"00:00:00",0,1,1,1900,"M1 1900","Q1 1900",""]

{"sheet":"Master Comment","index":6,"n_rows":2,"n_cols":2,"rows_kept":2,"cut":false,"hidden":true,"merged":[]}
[]
["Date","General Comments:  List overall changes to DS operations including changes to tank levels; installation of mains; changes to DS flow routing; changes at the plant to chlorine, corrosion practices; etc.  Include the date of the change and the DBP sites that it might impact."]

{"sheet":"Site 30","index":7,"n_rows":13,"n_cols":49,"rows_kept":13,"cut":false,"hidden":true,"merged":[]}
[]
[null,null,null,null,null,null,null,null,null,"                               Discrete Sample DBP Trends",null,null,null,null,"DBP LRAA Trends (recent 8 quarters)",null,null,null,null,null,"Discrete Sample Cl2 Residual, pH, and Temperature Trends",null,null,null,null,null,null,"Monthly Cl2 Residual Trends"]
[]
[]
[null,null,null,null,null,null,null,null,null,{"$f":"IF(Main!C38=\"\",\"\",Main!C38)","v":"Site 30"},null,{"$f":"IF(Main!F38=\"\",\"\",Main!F38)","v":""},null,null,null,"Enter Y if DBP Compliance Site    →",null,null,null,null,"Columns below can be modified for system specific paramters",null,null,null,null,null,null,null,null,null,null,null,"Charting Goals"]
[null,"Check Date","First TTHM Date","Month","Quarter","Year","M & Y","Q & Y","Cl2 Count",null,"Date","TTHM ppb","HAA5 ppb","THM Plus ppb","THM+ Ratio","Temp. C","pH units","Free Cl2 ppm","Total Cl2 ppm","Delta Cl2",null,null,null,null,null,null,null,null,null,null,null,null,"TTHM ppb","HAA5 ppb","THM Plus ppb","THM+ Ratio","Temp. C","pH units","Free Cl2 ppm","Total Cl2 ppm","Delta Cl2","Turbidity NTU","UV254 cm-1"]
[null,null,null,null,null,null,null,null,null,"System Defined Goals"]
[null,null,null,null,null,null,null,null,null,"Average",null,{"$f":"AVERAGE(L11:L13)","v":{"$error":"#DIV/0!"}},{"$error":"#DIV/0!"},{"$error":"#DIV/0!"},{"$error":"#DIV/0!"},{"$error":"#DIV/0!"},{"$error":"#DIV/0!"},{"$error":"#DIV/0!"},{"$error":"#DIV/0!"},{"$error":"#DIV/0!"},{"$error":"#DIV/0!"},{"$error":"#DIV/0!"},{"$error":"#DIV/0!"},{"$error":"#DIV/0!"},{"$error":"#DIV/0!"},{"$error":"#DIV/0!"},{"$error":"#DIV/0!"},{"$error":"#DIV/0!"}]
[null,null,null,null,null,null,null,null,null,"Minimum",null,{"$f":"MIN(L11:L13)","v":0},0,0,0,0,0,0,0,0,0,0,0,0,0,0,0,0]
[null,null,null,null,null,null,null,null,null,"Maximum",null,{"$f":"MAX(L11:L13)","v":0},0,0,0,0,0,0,0,0,0,0,0,0,0,0,0,0]
[null,null,null,null,null,null,"M & Y","Q & Y",null,null,null,null,null,null,null,null,null,null,null,null,null,null,null,null,null,null,null,null,"Provide comments below useful for data interpretation (e.g., flushing conducted in sample area, sample visibly red/brown after flush period)."]
[null,{"$f":"IF(L12,K12,)","v":"00:00:00"},{"$f":"IF(L12,1,IF(M12,1,))","v":0},{"$f":"MONTH(K12)","v":1},{"$f":"INT((MONTH(K12)-1)/3)+1","v":1},{"$f":"YEAR(K12)","v":1900},{"$f":"\"M\"&D12&\" \"&F12","v":"M1 1900"},{"$f":"\"Q\"&E12&\" \"&F12","v":"Q1 1900"},{"$f":"IF(R12<>\"\",IF(OR(R12=0,R12<0.2),1,\"\"),\"\")","v":""},{"$f":"J5","v":"Site 30"},null,null,null,null,{"$f":"IF(L12,IF(N12,N12/L12,\"\"),\"\")","v":""},null,null,null,null,{"$f":"IF(R12,IF(S12,S12-R12,\"\"),\"\")","v":""},null,null,null,null,null,null,null,null,null,null,null,null,{"$f":"IF($L$7,$L$7,\"\")","v":""},{"$f":"IF($M$7,$M$7,\"\")","v":""},{"$f":"IF($N$7,$N$7,\"\")","v":""},null,null,{"$f":"IF($Q$7,$Q$7,\"\")","v":""},{"$f":"IF($R$7,$R$7,\"\")","v":""},{"$f":"IF($S$7,$S$7,\"\")","v":""},null,{"$f":"IF($U$7,$U$7,\"\")","v":""},{"$f":"IF($V$7,$V$7,\"\")","v":""},{"$f":"IF($W$7,$W$7,\"\")","v":""},{"$f":"IF($X$7,$X$7,\"\")","v":""},{"$f":"IF($Y$7,$Y$7,\"\")","v":""},{"$f":"IF($Z$7,$Z$7,\"\")","v":""},{"$f":"IF($AA$7,$AA$7,\"\")","v":""},{"$f":"IF($AB$7,$AB$7,\"\")","v":""}]
[{"$f":"MAX(K11:K13)","v":"00:00:00"}]

{"sheet":"Site 29","index":8,"n_rows":13,"n_cols":49,"rows_kept":13,"cut":false,"hidden":true,"merged":[]}
[]
[null,null,null,null,null,null,null,null,null,"                               Discrete Sample DBP Trends",null,null,null,null,"DBP LRAA Trends (recent 8 quarters)",null,null,null,null,null,"Discrete Sample Cl2 Residual, pH, and Temperature Trends",null,null,null,null,null,null,"Monthly Cl2 Residual Trends"]
[]
[]
[null,null,null,null,null,null,null,null,null,{"$f":"IF(Main!C37=\"\",\"\",Main!C37)","v":"Site 29"},null,{"$f":"IF(Main!F37=\"\",\"\",Main!F37)","v":""},null,null,null,"Enter Y if DBP Compliance Site    →",null,null,null,null,"Columns below can be modified for system specific paramters",null,null,null,null,null,null,null,null,null,null,null,"Charting Goals"]
[null,"Check Date","First TTHM Date","Month","Quarter","Year","M & Y","Q & Y","Cl2 Count",null,"Date","TTHM ppb","HAA5 ppb","THM Plus ppb","THM+ Ratio","Temp. C","pH units","Free Cl2 ppm","Total Cl2 ppm","Delta Cl2",null,null,null,null,null,null,null,null,null,null,null,null,"TTHM ppb","HAA5 ppb","THM Plus ppb","THM+ Ratio","Temp. C","pH units","Free Cl2 ppm","Total Cl2 ppm","Delta Cl2","Turbidity NTU","UV254 cm-1"]
[null,null,null,null,null,null,null,null,null,"System Defined Goals"]
[null,null,null,null,null,null,null,null,null,"Average",null,{"$f":"AVERAGE(L11:L13)","v":{"$error":"#DIV/0!"}},{"$error":"#DIV/0!"},{"$error":"#DIV/0!"},{"$error":"#DIV/0!"},{"$error":"#DIV/0!"},{"$error":"#DIV/0!"},{"$error":"#DIV/0!"},{"$error":"#DIV/0!"},{"$error":"#DIV/0!"},{"$error":"#DIV/0!"},{"$error":"#DIV/0!"},{"$error":"#DIV/0!"},{"$error":"#DIV/0!"},{"$error":"#DIV/0!"},{"$error":"#DIV/0!"},{"$error":"#DIV/0!"},{"$error":"#DIV/0!"}]
[null,null,null,null,null,null,null,null,null,"Minimum",null,{"$f":"MIN(L11:L13)","v":0},0,0,0,0,0,0,0,0,0,0,0,0,0,0,0,0]
[null,null,null,null,null,null,null,null,null,"Maximum",null,{"$f":"MAX(L11:L13)","v":0},0,0,0,0,0,0,0,0,0,0,0,0,0,0,0,0]
[null,null,null,null,null,null,"M & Y","Q & Y",null,null,null,null,null,null,null,null,null,null,null,null,null,null,null,null,null,null,null,null,"Provide comments below useful for data interpretation (e.g., flushing conducted in sample area, sample visibly red/brown after flush period)."]
[null,{"$f":"IF(L12,K12,)","v":"00:00:00"},{"$f":"IF(L12,1,IF(M12,1,))","v":0},{"$f":"MONTH(K12)","v":1},{"$f":"INT((MONTH(K12)-1)/3)+1","v":1},{"$f":"YEAR(K12)","v":1900},{"$f":"\"M\"&D12&\" \"&F12","v":"M1 1900"},{"$f":"\"Q\"&E12&\" \"&F12","v":"Q1 1900"},{"$f":"IF(R12<>\"\",IF(OR(R12=0,R12<0.2),1,\"\"),\"\")","v":""},{"$f":"J5","v":"Site 29"},null,null,null,null,{"$f":"IF(L12,IF(N12,N12/L12,\"\"),\"\")","v":""},null,null,null,null,{"$f":"IF(R12,IF(S12,S12-R12,\"\"),\"\")","v":""},null,null,null,null,null,null,null,null,null,null,null,null,{"$f":"IF($L$7,$L$7,\"\")","v":""},{"$f":"IF($M$7,$M$7,\"\")","v":""},{"$f":"IF($N$7,$N$7,\"\")","v":""},null,null,{"$f":"IF($Q$7,$Q$7,\"\")","v":""},{"$f":"IF($R$7,$R$7,\"\")","v":""},{"$f":"IF($S$7,$S$7,\"\")","v":""},null,{"$f":"IF($U$7,$U$7,\"\")","v":""},{"$f":"IF($V$7,$V$7,\"\")","v":""},{"$f":"IF($W$7,$W$7,\"\")","v":""},{"$f":"IF($X$7,$X$7,\"\")","v":""},{"$f":"IF($Y$7,$Y$7,\"\")","v":""},{"$f":"IF($Z$7,$Z$7,\"\")","v":""},{"$f":"IF($AA$7,$AA$7,\"\")","v":""},{"$f":"IF($AB$7,$AB$7,\"\")","v":""}]
[{"$f":"MAX(K11:K13)","v":"00:00:00"}]

{"sheet":"Site 28","index":9,"n_rows":13,"n_cols":49,"rows_kept":13,"cut":false,"hidden":true,"merged":[]}
[]
[null,null,null,null,null,null,null,null,null,"                               Discrete Sample DBP Trends",null,null,null,null,"DBP LRAA Trends (recent 8 quarters)",null,null,null,null,null,"Discrete Sample Cl2 Residual, pH, and Temperature Trends",null,null,null,null,null,null,"Monthly Cl2 Residual Trends"]
[]
[]
[null,null,null,null,null,null,null,null,null,{"$f":"IF(Main!C36=\"\",\"\",Main!C36)","v":"Site 28"},null,{"$f":"IF(Main!F36=\"\",\"\",Main!F36)","v":""},null,null,null,"Enter Y if DBP Compliance Site    →",null,null,null,null,"Columns below can be modified for system specific paramters",null,null,null,null,null,null,null,null,null,null,null,"Charting Goals"]
[null,"Check Date","First TTHM Date","Month","Quarter","Year","M & Y","Q & Y","Cl2 Count",null,"Date","TTHM ppb","HAA5 ppb","THM Plus ppb","THM+ Ratio","Temp. C","pH units","Free Cl2 ppm","Total Cl2 ppm","Delta Cl2",null,null,null,null,null,null,null,null,null,null,null,null,"TTHM ppb","HAA5 ppb","THM Plus ppb","THM+ Ratio","Temp. C","pH units","Free Cl2 ppm","Total Cl2 ppm","Delta Cl2","Turbidity NTU","UV254 cm-1"]
[null,null,null,null,null,null,null,null,null,"System Defined Goals"]
[null,null,null,null,null,null,null,null,null,"Average",null,{"$f":"AVERAGE(L11:L13)","v":{"$error":"#DIV/0!"}},{"$error":"#DIV/0!"},{"$error":"#DIV/0!"},{"$error":"#DIV/0!"},{"$error":"#DIV/0!"},{"$error":"#DIV/0!"},{"$error":"#DIV/0!"},{"$error":"#DIV/0!"},{"$error":"#DIV/0!"},{"$error":"#DIV/0!"},{"$error":"#DIV/0!"},{"$error":"#DIV/0!"},{"$error":"#DIV/0!"},{"$error":"#DIV/0!"},{"$error":"#DIV/0!"},{"$error":"#DIV/0!"},{"$error":"#DIV/0!"}]
[null,null,null,null,null,null,null,null,null,"Minimum",null,{"$f":"MIN(L11:L13)","v":0},0,0,0,0,0,0,0,0,0,0,0,0,0,0,0,0]
[null,null,null,null,null,null,null,null,null,"Maximum",null,{"$f":"MAX(L11:L13)","v":0},0,0,0,0,0,0,0,0,0,0,0,0,0,0,0,0]
[null,null,null,null,null,null,"M & Y","Q & Y",null,null,null,null,null,null,null,null,null,null,null,null,null,null,null,null,null,null,null,null,"Provide comments below useful for data interpretation (e.g., flushing conducted in sample area, sample visibly red/brown after flush period)."]
[null,{"$f":"IF(L12,K12,)","v":"00:00:00"},{"$f":"IF(L12,1,IF(M12,1,))","v":0},{"$f":"MONTH(K12)","v":1},{"$f":"INT((MONTH(K12)-1)/3)+1","v":1},{"$f":"YEAR(K12)","v":1900},{"$f":"\"M\"&D12&\" \"&F12","v":"M1 1900"},{"$f":"\"Q\"&E12&\" \"&F12","v":"Q1 1900"},{"$f":"IF(R12<>\"\",IF(OR(R12=0,R12<0.2),1,\"\"),\"\")","v":""},{"$f":"J5","v":"Site 28"},null,null,null,null,{"$f":"IF(L12,IF(N12,N12/L12,\"\"),\"\")","v":""},null,null,null,null,{"$f":"IF(R12,IF(S12,S12-R12,\"\"),\"\")","v":""},null,null,null,null,null,null,null,null,null,null,null,null,{"$f":"IF($L$7,$L$7,\"\")","v":""},{"$f":"IF($M$7,$M$7,\"\")","v":""},{"$f":"IF($N$7,$N$7,\"\")","v":""},null,null,{"$f":"IF($Q$7,$Q$7,\"\")","v":""},{"$f":"IF($R$7,$R$7,\"\")","v":""},{"$f":"IF($S$7,$S$7,\"\")","v":""},null,{"$f":"IF($U$7,$U$7,\"\")","v":""},{"$f":"IF($V$7,$V$7,\"\")","v":""},{"$f":"IF($W$7,$W$7,\"\")","v":""},{"$f":"IF($X$7,$X$7,\"\")","v":""},{"$f":"IF($Y$7,$Y$7,\"\")","v":""},{"$f":"IF($Z$7,$Z$7,\"\")","v":""},{"$f":"IF($AA$7,$AA$7,\"\")","v":""},{"$f":"IF($AB$7,$AB$7,\"\")","v":""}]
[{"$f":"MAX(K11:K13)","v":"00:00:00"}]

{"sheet":"Site 27","index":10,"n_rows":13,"n_cols":49,"rows_kept":13,"cut":false,"hidden":true,"merged":[]}
[]
[null,null,null,null,null,null,null,null,null,"                               Discrete Sample DBP Trends",null,null,null,null,"DBP LRAA Trends (recent 8 quarters)",null,null,null,null,null,"Discrete Sample Cl2 Residual, pH, and Temperature Trends",null,null,null,null,null,null,"Monthly Cl2 Residual Trends"]
[]
[]
[null,null,null,null,null,null,null,null,null,{"$f":"IF(Main!C35=\"\",\"\",Main!C35)","v":"Site 27"},null,{"$f":"IF(Main!F35=\"\",\"\",Main!F35)","v":""},null,null,null,"Enter Y if DBP Compliance Site    →",null,null,null,null,"Columns below can be modified for system specific paramters",null,null,null,null,null,null,null,null,null,null,null,"Charting Goals"]
[null,"Check Date","First TTHM Date","Month","Quarter","Year","M & Y","Q & Y","Cl2 Count",null,"Date","TTHM ppb","HAA5 ppb","THM Plus ppb","THM+ Ratio","Temp. C","pH units","Free Cl2 ppm","Total Cl2 ppm","Delta Cl2",null,null,null,null,null,null,null,null,null,null,null,null,"TTHM ppb","HAA5 ppb","THM Plus ppb","THM+ Ratio","Temp. C","pH units","Free Cl2 ppm","Total Cl2 ppm","Delta Cl2","Turbidity NTU","UV254 cm-1"]
[null,null,null,null,null,null,null,null,null,"System Defined Goals"]
[null,null,null,null,null,null,null,null,null,"Average",null,{"$f":"AVERAGE(L11:L13)","v":{"$error":"#DIV/0!"}},{"$error":"#DIV/0!"},{"$error":"#DIV/0!"},{"$error":"#DIV/0!"},{"$error":"#DIV/0!"},{"$error":"#DIV/0!"},{"$error":"#DIV/0!"},{"$error":"#DIV/0!"},{"$error":"#DIV/0!"},{"$error":"#DIV/0!"},{"$error":"#DIV/0!"},{"$error":"#DIV/0!"},{"$error":"#DIV/0!"},{"$error":"#DIV/0!"},{"$error":"#DIV/0!"},{"$error":"#DIV/0!"},{"$error":"#DIV/0!"}]
[null,null,null,null,null,null,null,null,null,"Minimum",null,{"$f":"MIN(L11:L13)","v":0},0,0,0,0,0,0,0,0,0,0,0,0,0,0,0,0]
[null,null,null,null,null,null,null,null,null,"Maximum",null,{"$f":"MAX(L11:L13)","v":0},0,0,0,0,0,0,0,0,0,0,0,0,0,0,0,0]
[null,null,null,null,null,null,"M & Y","Q & Y",null,null,null,null,null,null,null,null,null,null,null,null,null,null,null,null,null,null,null,null,"Provide comments below useful for data interpretation (e.g., flushing conducted in sample area, sample visibly red/brown after flush period)."]
[null,{"$f":"IF(L12,K12,)","v":"00:00:00"},{"$f":"IF(L12,1,IF(M12,1,))","v":0},{"$f":"MONTH(K12)","v":1},{"$f":"INT((MONTH(K12)-1)/3)+1","v":1},{"$f":"YEAR(K12)","v":1900},{"$f":"\"M\"&D12&\" \"&F12","v":"M1 1900"},{"$f":"\"Q\"&E12&\" \"&F12","v":"Q1 1900"},{"$f":"IF(R12<>\"\",IF(OR(R12=0,R12<0.2),1,\"\"),\"\")","v":""},{"$f":"J5","v":"Site 27"},null,null,null,null,{"$f":"IF(L12,IF(N12,N12/L12,\"\"),\"\")","v":""},null,null,null,null,{"$f":"IF(R12,IF(S12,S12-R12,\"\"),\"\")","v":""},null,null,null,null,null,null,null,null,null,null,null,null,{"$f":"IF($L$7,$L$7,\"\")","v":""},{"$f":"IF($M$7,$M$7,\"\")","v":""},{"$f":"IF($N$7,$N$7,\"\")","v":""},null,null,{"$f":"IF($Q$7,$Q$7,\"\")","v":""},{"$f":"IF($R$7,$R$7,\"\")","v":""},{"$f":"IF($S$7,$S$7,\"\")","v":""},null,{"$f":"IF($U$7,$U$7,\"\")","v":""},{"$f":"IF($V$7,$V$7,\"\")","v":""},{"$f":"IF($W$7,$W$7,\"\")","v":""},{"$f":"IF($X$7,$X$7,\"\")","v":""},{"$f":"IF($Y$7,$Y$7,\"\")","v":""},{"$f":"IF($Z$7,$Z$7,\"\")","v":""},{"$f":"IF($AA$7,$AA$7,\"\")","v":""},{"$f":"IF($AB$7,$AB$7,\"\")","v":""}]
[{"$f":"MAX(K11:K13)","v":"00:00:00"}]

{"sheet":"Site 26","index":11,"n_rows":13,"n_cols":49,"rows_kept":13,"cut":false,"hidden":true,"merged":[]}
[]
[null,null,null,null,null,null,null,null,null,"                               Discrete Sample DBP Trends",null,null,null,null,"DBP LRAA Trends (recent 8 quarters)",null,null,null,null,null,"Discrete Sample Cl2 Residual, pH, and Temperature Trends",null,null,null,null,null,null,"Monthly Cl2 Residual Trends"]
[]
[]
[null,null,null,null,null,null,null,null,null,{"$f":"IF(Main!C34=\"\",\"\",Main!C34)","v":"Site 26"},null,{"$f":"IF(Main!F34=\"\",\"\",Main!F34)","v":""},null,null,null,"Enter Y if DBP Compliance Site    →",null,null,null,null,"Columns below can be modified for system specific paramters",null,null,null,null,null,null,null,null,null,null,null,"Charting Goals"]
[null,"Check Date","First TTHM Date","Month","Quarter","Year","M & Y","Q & Y","Cl2 Count",null,"Date","TTHM ppb","HAA5 ppb","THM Plus ppb","THM+ Ratio","Temp. C","pH units","Free Cl2 ppm","Total Cl2 ppm","Delta Cl2",null,null,null,null,null,null,null,null,null,null,null,null,"TTHM ppb","HAA5 ppb","THM Plus ppb","THM+ Ratio","Temp. C","pH units","Free Cl2 ppm","Total Cl2 ppm","Delta Cl2","Turbidity NTU","UV254 cm-1"]
[null,null,null,null,null,null,null,null,null,"System Defined Goals"]
[null,null,null,null,null,null,null,null,null,"Average",null,{"$f":"AVERAGE(L11:L13)","v":{"$error":"#DIV/0!"}},{"$error":"#DIV/0!"},{"$error":"#DIV/0!"},{"$error":"#DIV/0!"},{"$error":"#DIV/0!"},{"$error":"#DIV/0!"},{"$error":"#DIV/0!"},{"$error":"#DIV/0!"},{"$error":"#DIV/0!"},{"$error":"#DIV/0!"},{"$error":"#DIV/0!"},{"$error":"#DIV/0!"},{"$error":"#DIV/0!"},{"$error":"#DIV/0!"},{"$error":"#DIV/0!"},{"$error":"#DIV/0!"},{"$error":"#DIV/0!"}]
[null,null,null,null,null,null,null,null,null,"Minimum",null,{"$f":"MIN(L11:L13)","v":0},0,0,0,0,0,0,0,0,0,0,0,0,0,0,0,0]
[null,null,null,null,null,null,null,null,null,"Maximum",null,{"$f":"MAX(L11:L13)","v":0},0,0,0,0,0,0,0,0,0,0,0,0,0,0,0,0]
[null,null,null,null,null,null,"M & Y","Q & Y",null,null,null,null,null,null,null,null,null,null,null,null,null,null,null,null,null,null,null,null,"Provide comments below useful for data interpretation (e.g., flushing conducted in sample area, sample visibly red/brown after flush period)."]
[null,{"$f":"IF(L12,K12,)","v":"00:00:00"},{"$f":"IF(L12,1,IF(M12,1,))","v":0},{"$f":"MONTH(K12)","v":1},{"$f":"INT((MONTH(K12)-1)/3)+1","v":1},{"$f":"YEAR(K12)","v":1900},{"$f":"\"M\"&D12&\" \"&F12","v":"M1 1900"},{"$f":"\"Q\"&E12&\" \"&F12","v":"Q1 1900"},{"$f":"IF(R12<>\"\",IF(OR(R12=0,R12<0.2),1,\"\"),\"\")","v":""},{"$f":"J5","v":"Site 26"},null,null,null,null,{"$f":"IF(L12,IF(N12,N12/L12,\"\"),\"\")","v":""},null,null,null,null,{"$f":"IF(R12,IF(S12,S12-R12,\"\"),\"\")","v":""},null,null,null,null,null,null,null,null,null,null,null,null,{"$f":"IF($L$7,$L$7,\"\")","v":""},{"$f":"IF($M$7,$M$7,\"\")","v":""},{"$f":"IF($N$7,$N$7,\"\")","v":""},null,null,{"$f":"IF($Q$7,$Q$7,\"\")","v":""},{"$f":"IF($R$7,$R$7,\"\")","v":""},{"$f":"IF($S$7,$S$7,\"\")","v":""},null,{"$f":"IF($U$7,$U$7,\"\")","v":""},{"$f":"IF($V$7,$V$7,\"\")","v":""},{"$f":"IF($W$7,$W$7,\"\")","v":""},{"$f":"IF($X$7,$X$7,\"\")","v":""},{"$f":"IF($Y$7,$Y$7,\"\")","v":""},{"$f":"IF($Z$7,$Z$7,\"\")","v":""},{"$f":"IF($AA$7,$AA$7,\"\")","v":""},{"$f":"IF($AB$7,$AB$7,\"\")","v":""}]
[{"$f":"MAX(K11:K13)","v":"00:00:00"}]

{"sheet":"Site 25","index":12,"n_rows":13,"n_cols":49,"rows_kept":13,"cut":false,"hidden":true,"merged":[]}
[]
[null,null,null,null,null,null,null,null,null,"                               Discrete Sample DBP Trends",null,null,null,null,"DBP LRAA Trends (recent 8 quarters)",null,null,null,null,null,"Discrete Sample Cl2 Residual, pH, and Temperature Trends",null,null,null,null,null,null,"Monthly Cl2 Residual Trends"]
[]
[]
[null,null,null,null,null,null,null,null,null,{"$f":"IF(Main!C33=\"\",\"\",Main!C33)","v":"Site 25"},null,{"$f":"IF(Main!F33=\"\",\"\",Main!F33)","v":""},null,null,null,"Enter Y if DBP Compliance Site    →",null,null,null,null,"Columns below can be modified for system specific paramters",null,null,null,null,null,null,null,null,null,null,null,"Charting Goals"]
[null,"Check Date","First TTHM Date","Month","Quarter","Year","M & Y","Q & Y","Cl2 Count",null,"Date","TTHM ppb","HAA5 ppb","THM Plus ppb","THM+ Ratio","Temp. C","pH units","Free Cl2 ppm","Total Cl2 ppm","Delta Cl2",null,null,null,null,null,null,null,null,null,null,null,null,"TTHM ppb","HAA5 ppb","THM Plus ppb","THM+ Ratio","Temp. C","pH units","Free Cl2 ppm","Total Cl2 ppm","Delta Cl2","Turbidity NTU","UV254 cm-1"]
[null,null,null,null,null,null,null,null,null,"System Defined Goals"]
[null,null,null,null,null,null,null,null,null,"Average",null,{"$f":"AVERAGE(L11:L13)","v":{"$error":"#DIV/0!"}},{"$error":"#DIV/0!"},{"$error":"#DIV/0!"},{"$error":"#DIV/0!"},{"$error":"#DIV/0!"},{"$error":"#DIV/0!"},{"$error":"#DIV/0!"},{"$error":"#DIV/0!"},{"$error":"#DIV/0!"},{"$error":"#DIV/0!"},{"$error":"#DIV/0!"},{"$error":"#DIV/0!"},{"$error":"#DIV/0!"},{"$error":"#DIV/0!"},{"$error":"#DIV/0!"},{"$error":"#DIV/0!"},{"$error":"#DIV/0!"}]
[null,null,null,null,null,null,null,null,null,"Minimum",null,{"$f":"MIN(L11:L13)","v":0},0,0,0,0,0,0,0,0,0,0,0,0,0,0,0,0]
[null,null,null,null,null,null,null,null,null,"Maximum",null,{"$f":"MAX(L11:L13)","v":0},0,0,0,0,0,0,0,0,0,0,0,0,0,0,0,0]
[null,null,null,null,null,null,"M & Y","Q & Y",null,null,null,null,null,null,null,null,null,null,null,null,null,null,null,null,null,null,null,null,"Provide comments below useful for data interpretation (e.g., flushing conducted in sample area, sample visibly red/brown after flush period)."]
[null,{"$f":"IF(L12,K12,)","v":"00:00:00"},{"$f":"IF(L12,1,IF(M12,1,))","v":0},{"$f":"MONTH(K12)","v":1},{"$f":"INT((MONTH(K12)-1)/3)+1","v":1},{"$f":"YEAR(K12)","v":1900},{"$f":"\"M\"&D12&\" \"&F12","v":"M1 1900"},{"$f":"\"Q\"&E12&\" \"&F12","v":"Q1 1900"},{"$f":"IF(R12<>\"\",IF(OR(R12=0,R12<0.2),1,\"\"),\"\")","v":""},{"$f":"J5","v":"Site 25"},null,null,null,null,{"$f":"IF(L12,IF(N12,N12/L12,\"\"),\"\")","v":""},null,null,null,null,{"$f":"IF(R12,IF(S12,S12-R12,\"\"),\"\")","v":""},null,null,null,null,null,null,null,null,null,null,null,null,{"$f":"IF($L$7,$L$7,\"\")","v":""},{"$f":"IF($M$7,$M$7,\"\")","v":""},{"$f":"IF($N$7,$N$7,\"\")","v":""},null,null,{"$f":"IF($Q$7,$Q$7,\"\")","v":""},{"$f":"IF($R$7,$R$7,\"\")","v":""},{"$f":"IF($S$7,$S$7,\"\")","v":""},null,{"$f":"IF($U$7,$U$7,\"\")","v":""},{"$f":"IF($V$7,$V$7,\"\")","v":""},{"$f":"IF($W$7,$W$7,\"\")","v":""},{"$f":"IF($X$7,$X$7,\"\")","v":""},{"$f":"IF($Y$7,$Y$7,\"\")","v":""},{"$f":"IF($Z$7,$Z$7,\"\")","v":""},{"$f":"IF($AA$7,$AA$7,\"\")","v":""},{"$f":"IF($AB$7,$AB$7,\"\")","v":""}]
[{"$f":"MAX(K11:K13)","v":"00:00:00"}]

{"sheet":"Site 24","index":13,"n_rows":13,"n_cols":49,"rows_kept":13,"cut":false,"hidden":true,"merged":[]}
[]
[null,null,null,null,null,null,null,null,null,"                               Discrete Sample DBP Trends",null,null,null,null,"DBP LRAA Trends (recent 8 quarters)",null,null,null,null,null,"Discrete Sample Cl2 Residual, pH, and Temperature Trends",null,null,null,null,null,null,"Monthly Cl2 Residual Trends"]
[]
[]
[null,null,null,null,null,null,null,null,null,{"$f":"IF(Main!C32=\"\",\"\",Main!C32)","v":"Site 24"},null,{"$f":"IF(Main!F32=\"\",\"\",Main!F32)","v":""},null,null,null,"Enter Y if DBP Compliance Site    →",null,null,null,null,"Columns below can be modified for system specific paramters",null,null,null,null,null,null,null,null,null,null,null,"Charting Goals"]
[null,"Check Date","First TTHM Date","Month","Quarter","Year","M & Y","Q & Y","Cl2 Count",null,"Date","TTHM ppb","HAA5 ppb","THM Plus ppb","THM+ Ratio","Temp. C","pH units","Free Cl2 ppm","Total Cl2 ppm","Delta Cl2",null,null,null,null,null,null,null,null,null,null,null,null,"TTHM ppb","HAA5 ppb","THM Plus ppb","THM+ Ratio","Temp. C","pH units","Free Cl2 ppm","Total Cl2 ppm","Delta Cl2","Turbidity NTU","UV254 cm-1"]
[null,null,null,null,null,null,null,null,null,"System Defined Goals"]
[null,null,null,null,null,null,null,null,null,"Average",null,{"$f":"AVERAGE(L11:L13)","v":{"$error":"#DIV/0!"}},{"$error":"#DIV/0!"},{"$error":"#DIV/0!"},{"$error":"#DIV/0!"},{"$error":"#DIV/0!"},{"$error":"#DIV/0!"},{"$error":"#DIV/0!"},{"$error":"#DIV/0!"},{"$error":"#DIV/0!"},{"$error":"#DIV/0!"},{"$error":"#DIV/0!"},{"$error":"#DIV/0!"},{"$error":"#DIV/0!"},{"$error":"#DIV/0!"},{"$error":"#DIV/0!"},{"$error":"#DIV/0!"},{"$error":"#DIV/0!"}]
[null,null,null,null,null,null,null,null,null,"Minimum",null,{"$f":"MIN(L11:L13)","v":0},0,0,0,0,0,0,0,0,0,0,0,0,0,0,0,0]
[null,null,null,null,null,null,null,null,null,"Maximum",null,{"$f":"MAX(L11:L13)","v":0},0,0,0,0,0,0,0,0,0,0,0,0,0,0,0,0]
[null,null,null,null,null,null,"M & Y","Q & Y",null,null,null,null,null,null,null,null,null,null,null,null,null,null,null,null,null,null,null,null,"Provide comments below useful for data interpretation (e.g., flushing conducted in sample area, sample visibly red/brown after flush period)."]
[null,{"$f":"IF(L12,K12,)","v":"00:00:00"},{"$f":"IF(L12,1,IF(M12,1,))","v":0},{"$f":"MONTH(K12)","v":1},{"$f":"INT((MONTH(K12)-1)/3)+1","v":1},{"$f":"YEAR(K12)","v":1900},{"$f":"\"M\"&D12&\" \"&F12","v":"M1 1900"},{"$f":"\"Q\"&E12&\" \"&F12","v":"Q1 1900"},{"$f":"IF(R12<>\"\",IF(OR(R12=0,R12<0.2),1,\"\"),\"\")","v":""},{"$f":"J5","v":"Site 24"},null,null,null,null,{"$f":"IF(L12,IF(N12,N12/L12,\"\"),\"\")","v":""},null,null,null,null,{"$f":"IF(R12,IF(S12,S12-R12,\"\"),\"\")","v":""},null,null,null,null,null,null,null,null,null,null,null,null,{"$f":"IF($L$7,$L$7,\"\")","v":""},{"$f":"IF($M$7,$M$7,\"\")","v":""},{"$f":"IF($N$7,$N$7,\"\")","v":""},null,null,{"$f":"IF($Q$7,$Q$7,\"\")","v":""},{"$f":"IF($R$7,$R$7,\"\")","v":""},{"$f":"IF($S$7,$S$7,\"\")","v":""},null,{"$f":"IF($U$7,$U$7,\"\")","v":""},{"$f":"IF($V$7,$V$7,\"\")","v":""},{"$f":"IF($W$7,$W$7,\"\")","v":""},{"$f":"IF($X$7,$X$7,\"\")","v":""},{"$f":"IF($Y$7,$Y$7,\"\")","v":""},{"$f":"IF($Z$7,$Z$7,\"\")","v":""},{"$f":"IF($AA$7,$AA$7,\"\")","v":""},{"$f":"IF($AB$7,$AB$7,\"\")","v":""}]
[{"$f":"MAX(K11:K13)","v":"00:00:00"}]

{"sheet":"Site 23","index":14,"n_rows":13,"n_cols":49,"rows_kept":13,"cut":false,"hidden":true,"merged":[]}
[]
[null,null,null,null,null,null,null,null,null,"                               Discrete Sample DBP Trends",null,null,null,null,"DBP LRAA Trends (recent 8 quarters)",null,null,null,null,null,"Discrete Sample Cl2 Residual, pH, and Temperature Trends",null,null,null,null,null,null,"Monthly Cl2 Residual Trends"]
[]
[]
[null,null,null,null,null,null,null,null,null,{"$f":"IF(Main!C31=\"\",\"\",Main!C31)","v":"Site 23"},null,{"$f":"IF(Main!F31=\"\",\"\",Main!F31)","v":""},null,null,null,"Enter Y if DBP Compliance Site    →",null,null,null,null,"Columns below can be modified for system specific paramters",null,null,null,null,null,null,null,null,null,null,null,"Charting Goals"]
[null,"Check Date","First TTHM Date","Month","Quarter","Year","M & Y","Q & Y","Cl2 Count",null,"Date","TTHM ppb","HAA5 ppb","THM Plus ppb","THM+ Ratio","Temp. C","pH units","Free Cl2 ppm","Total Cl2 ppm","Delta Cl2",null,null,null,null,null,null,null,null,null,null,null,null,"TTHM ppb","HAA5 ppb","THM Plus ppb","THM+ Ratio","Temp. C","pH units","Free Cl2 ppm","Total Cl2 ppm","Delta Cl2","Turbidity NTU","UV254 cm-1"]
[null,null,null,null,null,null,null,null,null,"System Defined Goals"]
[null,null,null,null,null,null,null,null,null,"Average",null,{"$f":"AVERAGE(L11:L13)","v":{"$error":"#DIV/0!"}},{"$error":"#DIV/0!"},{"$error":"#DIV/0!"},{"$error":"#DIV/0!"},{"$error":"#DIV/0!"},{"$error":"#DIV/0!"},{"$error":"#DIV/0!"},{"$error":"#DIV/0!"},{"$error":"#DIV/0!"},{"$error":"#DIV/0!"},{"$error":"#DIV/0!"},{"$error":"#DIV/0!"},{"$error":"#DIV/0!"},{"$error":"#DIV/0!"},{"$error":"#DIV/0!"},{"$error":"#DIV/0!"},{"$error":"#DIV/0!"}]
[null,null,null,null,null,null,null,null,null,"Minimum",null,{"$f":"MIN(L11:L13)","v":0},0,0,0,0,0,0,0,0,0,0,0,0,0,0,0,0]
[null,null,null,null,null,null,null,null,null,"Maximum",null,{"$f":"MAX(L11:L13)","v":0},0,0,0,0,0,0,0,0,0,0,0,0,0,0,0,0]
[null,null,null,null,null,null,"M & Y","Q & Y",null,null,null,null,null,null,null,null,null,null,null,null,null,null,null,null,null,null,null,null,"Provide comments below useful for data interpretation (e.g., flushing conducted in sample area, sample visibly red/brown after flush period)."]
[null,{"$f":"IF(L12,K12,)","v":"00:00:00"},{"$f":"IF(L12,1,IF(M12,1,))","v":0},{"$f":"MONTH(K12)","v":1},{"$f":"INT((MONTH(K12)-1)/3)+1","v":1},{"$f":"YEAR(K12)","v":1900},{"$f":"\"M\"&D12&\" \"&F12","v":"M1 1900"},{"$f":"\"Q\"&E12&\" \"&F12","v":"Q1 1900"},{"$f":"IF(R12<>\"\",IF(OR(R12=0,R12<0.2),1,\"\"),\"\")","v":""},{"$f":"J5","v":"Site 23"},null,null,null,null,{"$f":"IF(L12,IF(N12,N12/L12,\"\"),\"\")","v":""},null,null,null,null,{"$f":"IF(R12,IF(S12,S12-R12,\"\"),\"\")","v":""},null,null,null,null,null,null,null,null,null,null,null,null,{"$f":"IF($L$7,$L$7,\"\")","v":""},{"$f":"IF($M$7,$M$7,\"\")","v":""},{"$f":"IF($N$7,$N$7,\"\")","v":""},null,null,{"$f":"IF($Q$7,$Q$7,\"\")","v":""},{"$f":"IF($R$7,$R$7,\"\")","v":""},{"$f":"IF($S$7,$S$7,\"\")","v":""},null,{"$f":"IF($U$7,$U$7,\"\")","v":""},{"$f":"IF($V$7,$V$7,\"\")","v":""},{"$f":"IF($W$7,$W$7,\"\")","v":""},{"$f":"IF($X$7,$X$7,\"\")","v":""},{"$f":"IF($Y$7,$Y$7,\"\")","v":""},{"$f":"IF($Z$7,$Z$7,\"\")","v":""},{"$f":"IF($AA$7,$AA$7,\"\")","v":""},{"$f":"IF($AB$7,$AB$7,\"\")","v":""}]
[{"$f":"MAX(K11:K13)","v":"00:00:00"}]

{"sheet":"Site 22","index":15,"n_rows":13,"n_cols":49,"rows_kept":13,"cut":false,"hidden":true,"merged":[]}
[]
[null,null,null,null,null,null,null,null,null,"                               Discrete Sample DBP Trends",null,null,null,null,"DBP LRAA Trends (recent 8 quarters)",null,null,null,null,null,"Discrete Sample Cl2 Residual, pH, and Temperature Trends",null,null,null,null,null,null,"Monthly Cl2 Residual Trends"]
[]
[]
[null,null,null,null,null,null,null,null,null,{"$f":"IF(Main!C30=\"\",\"\",Main!C30)","v":"Site 22"},null,{"$f":"IF(Main!F30=\"\",\"\",Main!F30)","v":""},null,null,null,"Enter Y if DBP Compliance Site    →",null,null,null,null,"Columns below can be modified for system specific paramters",null,null,null,null,null,null,null,null,null,null,null,"Charting Goals"]
[null,"Check Date","First TTHM Date","Month","Quarter","Year","M & Y","Q & Y","Cl2 Count",null,"Date","TTHM ppb","HAA5 ppb","THM Plus ppb","THM+ Ratio","Temp. C","pH units","Free Cl2 ppm","Total Cl2 ppm","Delta Cl2",null,null,null,null,null,null,null,null,null,null,null,null,"TTHM ppb","HAA5 ppb","THM Plus ppb","THM+ Ratio","Temp. C","pH units","Free Cl2 ppm","Total Cl2 ppm","Delta Cl2","Turbidity NTU","UV254 cm-1"]
[null,null,null,null,null,null,null,null,null,"System Defined Goals"]
[null,null,null,null,null,null,null,null,null,"Average",null,{"$f":"AVERAGE(L11:L13)","v":{"$error":"#DIV/0!"}},{"$error":"#DIV/0!"},{"$error":"#DIV/0!"},{"$error":"#DIV/0!"},{"$error":"#DIV/0!"},{"$error":"#DIV/0!"},{"$error":"#DIV/0!"},{"$error":"#DIV/0!"},{"$error":"#DIV/0!"},{"$error":"#DIV/0!"},{"$error":"#DIV/0!"},{"$error":"#DIV/0!"},{"$error":"#DIV/0!"},{"$error":"#DIV/0!"},{"$error":"#DIV/0!"},{"$error":"#DIV/0!"},{"$error":"#DIV/0!"}]
[null,null,null,null,null,null,null,null,null,"Minimum",null,{"$f":"MIN(L11:L13)","v":0},0,0,0,0,0,0,0,0,0,0,0,0,0,0,0,0]
[null,null,null,null,null,null,null,null,null,"Maximum",null,{"$f":"MAX(L11:L13)","v":0},0,0,0,0,0,0,0,0,0,0,0,0,0,0,0,0]
[null,null,null,null,null,null,"M & Y","Q & Y",null,null,null,null,null,null,null,null,null,null,null,null,null,null,null,null,null,null,null,null,"Provide comments below useful for data interpretation (e.g., flushing conducted in sample area, sample visibly red/brown after flush period)."]
[null,{"$f":"IF(L12,K12,)","v":"00:00:00"},{"$f":"IF(L12,1,IF(M12,1,))","v":0},{"$f":"MONTH(K12)","v":1},{"$f":"INT((MONTH(K12)-1)/3)+1","v":1},{"$f":"YEAR(K12)","v":1900},{"$f":"\"M\"&D12&\" \"&F12","v":"M1 1900"},{"$f":"\"Q\"&E12&\" \"&F12","v":"Q1 1900"},{"$f":"IF(R12<>\"\",IF(OR(R12=0,R12<0.2),1,\"\"),\"\")","v":""},{"$f":"J5","v":"Site 22"},null,null,null,null,{"$f":"IF(L12,IF(N12,N12/L12,\"\"),\"\")","v":""},null,null,null,null,{"$f":"IF(R12,IF(S12,S12-R12,\"\"),\"\")","v":""},null,null,null,null,null,null,null,null,null,null,null,null,{"$f":"IF($L$7,$L$7,\"\")","v":""},{"$f":"IF($M$7,$M$7,\"\")","v":""},{"$f":"IF($N$7,$N$7,\"\")","v":""},null,null,{"$f":"IF($Q$7,$Q$7,\"\")","v":""},{"$f":"IF($R$7,$R$7,\"\")","v":""},{"$f":"IF($S$7,$S$7,\"\")","v":""},null,{"$f":"IF($U$7,$U$7,\"\")","v":""},{"$f":"IF($V$7,$V$7,\"\")","v":""},{"$f":"IF($W$7,$W$7,\"\")","v":""},{"$f":"IF($X$7,$X$7,\"\")","v":""},{"$f":"IF($Y$7,$Y$7,\"\")","v":""},{"$f":"IF($Z$7,$Z$7,\"\")","v":""},{"$f":"IF($AA$7,$AA$7,\"\")","v":""},{"$f":"IF($AB$7,$AB$7,\"\")","v":""}]
[{"$f":"MAX(K11:K13)","v":"00:00:00"}]

{"sheet":"Site 21","index":16,"n_rows":13,"n_cols":49,"rows_kept":13,"cut":false,"hidden":true,"merged":[]}
[]
[null,null,null,null,null,null,null,null,null,"                               Discrete Sample DBP Trends",null,null,null,null,"DBP LRAA Trends (recent 8 quarters)",null,null,null,null,null,"Discrete Sample Cl2 Residual, pH, and Temperature Trends",null,null,null,null,null,null,"Monthly Cl2 Residual Trends"]
[]
[]
[null,null,null,null,null,null,null,null,null,{"$f":"IF(Main!C29=\"\",\"\",Main!C29)","v":"Site 21"},null,{"$f":"IF(Main!F29=\"\",\"\",Main!F29)","v":""},null,null,null,"Enter Y if DBP Compliance Site    →",null,null,null,null,"Columns below can be modified for system specific paramters",null,null,null,null,null,null,null,null,null,null,null,"Charting Goals"]
[null,"Check Date","First TTHM Date","Month","Quarter","Year","M & Y","Q & Y","Cl2 Count",null,"Date","TTHM ppb","HAA5 ppb","THM Plus ppb","THM+ Ratio","Temp. C","pH units","Free Cl2 ppm","Total Cl2 ppm","Delta Cl2",null,null,null,null,null,null,null,null,null,null,null,null,"TTHM ppb","HAA5 ppb","THM Plus ppb","THM+ Ratio","Temp. C","pH units","Free Cl2 ppm","Total Cl2 ppm","Delta Cl2","Turbidity NTU","UV254 cm-1"]
[null,null,null,null,null,null,null,null,null,"System Defined Goals"]
[null,null,null,null,null,null,null,null,null,"Average",null,{"$f":"AVERAGE(L11:L13)","v":{"$error":"#DIV/0!"}},{"$error":"#DIV/0!"},{"$error":"#DIV/0!"},{"$error":"#DIV/0!"},{"$error":"#DIV/0!"},{"$error":"#DIV/0!"},{"$error":"#DIV/0!"},{"$error":"#DIV/0!"},{"$error":"#DIV/0!"},{"$error":"#DIV/0!"},{"$error":"#DIV/0!"},{"$error":"#DIV/0!"},{"$error":"#DIV/0!"},{"$error":"#DIV/0!"},{"$error":"#DIV/0!"},{"$error":"#DIV/0!"},{"$error":"#DIV/0!"}]
[null,null,null,null,null,null,null,null,null,"Minimum",null,{"$f":"MIN(L11:L13)","v":0},0,0,0,0,0,0,0,0,0,0,0,0,0,0,0,0]
[null,null,null,null,null,null,null,null,null,"Maximum",null,{"$f":"MAX(L11:L13)","v":0},0,0,0,0,0,0,0,0,0,0,0,0,0,0,0,0]
[null,null,null,null,null,null,"M & Y","Q & Y",null,null,null,null,null,null,null,null,null,null,null,null,null,null,null,null,null,null,null,null,"Provide comments below useful for data interpretation (e.g., flushing conducted in sample area, sample visibly red/brown after flush period)."]
[null,{"$f":"IF(L12,K12,)","v":"00:00:00"},{"$f":"IF(L12,1,IF(M12,1,))","v":0},{"$f":"MONTH(K12)","v":1},{"$f":"INT((MONTH(K12)-1)/3)+1","v":1},{"$f":"YEAR(K12)","v":1900},{"$f":"\"M\"&D12&\" \"&F12","v":"M1 1900"},{"$f":"\"Q\"&E12&\" \"&F12","v":"Q1 1900"},{"$f":"IF(R12<>\"\",IF(OR(R12=0,R12<0.2),1,\"\"),\"\")","v":""},{"$f":"J5","v":"Site 21"},null,null,null,null,{"$f":"IF(L12,IF(N12,N12/L12,\"\"),\"\")","v":""},null,null,null,null,{"$f":"IF(R12,IF(S12,S12-R12,\"\"),\"\")","v":""},null,null,null,null,null,null,null,null,null,null,null,null,{"$f":"IF($L$7,$L$7,\"\")","v":""},{"$f":"IF($M$7,$M$7,\"\")","v":""},{"$f":"IF($N$7,$N$7,\"\")","v":""},null,null,{"$f":"IF($Q$7,$Q$7,\"\")","v":""},{"$f":"IF($R$7,$R$7,\"\")","v":""},{"$f":"IF($S$7,$S$7,\"\")","v":""},null,{"$f":"IF($U$7,$U$7,\"\")","v":""},{"$f":"IF($V$7,$V$7,\"\")","v":""},{"$f":"IF($W$7,$W$7,\"\")","v":""},{"$f":"IF($X$7,$X$7,\"\")","v":""},{"$f":"IF($Y$7,$Y$7,\"\")","v":""},{"$f":"IF($Z$7,$Z$7,\"\")","v":""},{"$f":"IF($AA$7,$AA$7,\"\")","v":""},{"$f":"IF($AB$7,$AB$7,\"\")","v":""}]
[{"$f":"MAX(K11:K13)","v":"00:00:00"}]

{"sheet":"Site 20","index":17,"n_rows":13,"n_cols":49,"rows_kept":13,"cut":false,"hidden":true,"merged":[]}
[]
[null,null,null,null,null,null,null,null,null,"                               Discrete Sample DBP Trends",null,null,null,null,"DBP LRAA Trends (recent 8 quarters)",null,null,null,null,null,"Discrete Sample Cl2 Residual, pH, and Temperature Trends",null,null,null,null,null,null,"Monthly Cl2 Residual Trends"]
[]
[]
[null,null,null,null,null,null,null,null,null,{"$f":"IF(Main!C28=\"\",\"\",Main!C28)","v":"Site 20"},null,{"$f":"IF(Main!F28=\"\",\"\",Main!F28)","v":""},null,null,null,"Enter Y if DBP Compliance Site    →",null,null,null,null,"Columns below can be modified for system specific paramters",null,null,null,null,null,null,null,null,null,null,null,"Charting Goals"]
[null,"Check Date","First TTHM Date","Month","Quarter","Year","M & Y","Q & Y","Cl2 Count",null,"Date","TTHM ppb","HAA5 ppb","THM Plus ppb","THM+ Ratio","Temp. C","pH units","Free Cl2 ppm","Total Cl2 ppm","Delta Cl2",null,null,null,null,null,null,null,null,null,null,null,null,"TTHM ppb","HAA5 ppb","THM Plus ppb","THM+ Ratio","Temp. C","pH units","Free Cl2 ppm","Total Cl2 ppm","Delta Cl2","Turbidity NTU","UV254 cm-1"]
[null,null,null,null,null,null,null,null,null,"System Defined Goals"]
[null,null,null,null,null,null,null,null,null,"Average",null,{"$f":"AVERAGE(L11:L13)","v":{"$error":"#DIV/0!"}},{"$error":"#DIV/0!"},{"$error":"#DIV/0!"},{"$error":"#DIV/0!"},{"$error":"#DIV/0!"},{"$error":"#DIV/0!"},{"$error":"#DIV/0!"},{"$error":"#DIV/0!"},{"$error":"#DIV/0!"},{"$error":"#DIV/0!"},{"$error":"#DIV/0!"},{"$error":"#DIV/0!"},{"$error":"#DIV/0!"},{"$error":"#DIV/0!"},{"$error":"#DIV/0!"},{"$error":"#DIV/0!"},{"$error":"#DIV/0!"}]
[null,null,null,null,null,null,null,null,null,"Minimum",null,{"$f":"MIN(L11:L13)","v":0},0,0,0,0,0,0,0,0,0,0,0,0,0,0,0,0]
[null,null,null,null,null,null,null,null,null,"Maximum",null,{"$f":"MAX(L11:L13)","v":0},0,0,0,0,0,0,0,0,0,0,0,0,0,0,0,0]
[null,null,null,null,null,null,"M & Y","Q & Y",null,null,null,null,null,null,null,null,null,null,null,null,null,null,null,null,null,null,null,null,"Provide comments below useful for data interpretation (e.g., flushing conducted in sample area, sample visibly red/brown after flush period)."]
[null,{"$f":"IF(L12,K12,)","v":"00:00:00"},{"$f":"IF(L12,1,IF(M12,1,))","v":0},{"$f":"MONTH(K12)","v":1},{"$f":"INT((MONTH(K12)-1)/3)+1","v":1},{"$f":"YEAR(K12)","v":1900},{"$f":"\"M\"&D12&\" \"&F12","v":"M1 1900"},{"$f":"\"Q\"&E12&\" \"&F12","v":"Q1 1900"},{"$f":"IF(R12<>\"\",IF(OR(R12=0,R12<0.2),1,\"\"),\"\")","v":""},{"$f":"J5","v":"Site 20"},null,null,null,null,{"$f":"IF(L12,IF(N12,N12/L12,\"\"),\"\")","v":""},null,null,null,null,{"$f":"IF(R12,IF(S12,S12-R12,\"\"),\"\")","v":""},null,null,null,null,null,null,null,null,null,null,null,null,{"$f":"IF($L$7,$L$7,\"\")","v":""},{"$f":"IF($M$7,$M$7,\"\")","v":""},{"$f":"IF($N$7,$N$7,\"\")","v":""},null,null,{"$f":"IF($Q$7,$Q$7,\"\")","v":""},{"$f":"IF($R$7,$R$7,\"\")","v":""},{"$f":"IF($S$7,$S$7,\"\")","v":""},null,{"$f":"IF($U$7,$U$7,\"\")","v":""},{"$f":"IF($V$7,$V$7,\"\")","v":""},{"$f":"IF($W$7,$W$7,\"\")","v":""},{"$f":"IF($X$7,$X$7,\"\")","v":""},{"$f":"IF($Y$7,$Y$7,\"\")","v":""},{"$f":"IF($Z$7,$Z$7,\"\")","v":""},{"$f":"IF($AA$7,$AA$7,\"\")","v":""},{"$f":"IF($AB$7,$AB$7,\"\")","v":""}]
[{"$f":"MAX(K11:K13)","v":"00:00:00"}]

{"sheet":"Site 19","index":18,"n_rows":13,"n_cols":49,"rows_kept":13,"cut":false,"hidden":true,"merged":[]}
[]
[null,null,null,null,null,null,null,null,null,"                               Discrete Sample DBP Trends",null,null,null,null,"DBP LRAA Trends (recent 8 quarters)",null,null,null,null,null,"Discrete Sample Cl2 Residual, pH, and Temperature Trends",null,null,null,null,null,null,"Monthly Cl2 Residual Trends"]
[]
[]
[null,null,null,null,null,null,null,null,null,{"$f":"IF(Main!C27=\"\",\"\",Main!C27)","v":"Site 19"},null,{"$f":"IF(Main!F27=\"\",\"\",Main!F27)","v":""},null,null,null,"Enter Y if DBP Compliance Site    →",null,null,null,null,"Columns below can be modified for system specific paramters",null,null,null,null,null,null,null,null,null,null,null,"Charting Goals"]
[null,"Check Date","First TTHM Date","Month","Quarter","Year","M & Y","Q & Y","Cl2 Count",null,"Date","TTHM ppb","HAA5 ppb","THM Plus ppb","THM+ Ratio","Temp. C","pH units","Free Cl2 ppm","Total Cl2 ppm","Delta Cl2",null,null,null,null,null,null,null,null,null,null,null,null,"TTHM ppb","HAA5 ppb","THM Plus ppb","THM+ Ratio","Temp. C","pH units","Free Cl2 ppm","Total Cl2 ppm","Delta Cl2","Turbidity NTU","UV254 cm-1"]
[null,null,null,null,null,null,null,null,null,"System Defined Goals"]
[null,null,null,null,null,null,null,null,null,"Average",null,{"$f":"AVERAGE(L11:L13)","v":{"$error":"#DIV/0!"}},{"$error":"#DIV/0!"},{"$error":"#DIV/0!"},{"$error":"#DIV/0!"},{"$error":"#DIV/0!"},{"$error":"#DIV/0!"},{"$error":"#DIV/0!"},{"$error":"#DIV/0!"},{"$error":"#DIV/0!"},{"$error":"#DIV/0!"},{"$error":"#DIV/0!"},{"$error":"#DIV/0!"},{"$error":"#DIV/0!"},{"$error":"#DIV/0!"},{"$error":"#DIV/0!"},{"$error":"#DIV/0!"},{"$error":"#DIV/0!"}]
[null,null,null,null,null,null,null,null,null,"Minimum",null,{"$f":"MIN(L11:L13)","v":0},0,0,0,0,0,0,0,0,0,0,0,0,0,0,0,0]
[null,null,null,null,null,null,null,null,null,"Maximum",null,{"$f":"MAX(L11:L13)","v":0},0,0,0,0,0,0,0,0,0,0,0,0,0,0,0,0]
[null,null,null,null,null,null,"M & Y","Q & Y",null,null,null,null,null,null,null,null,null,null,null,null,null,null,null,null,null,null,null,null,"Provide comments below useful for data interpretation (e.g., flushing conducted in sample area, sample visibly red/brown after flush period)."]
[null,{"$f":"IF(L12,K12,)","v":"00:00:00"},{"$f":"IF(L12,1,IF(M12,1,))","v":0},{"$f":"MONTH(K12)","v":1},{"$f":"INT((MONTH(K12)-1)/3)+1","v":1},{"$f":"YEAR(K12)","v":1900},{"$f":"\"M\"&D12&\" \"&F12","v":"M1 1900"},{"$f":"\"Q\"&E12&\" \"&F12","v":"Q1 1900"},{"$f":"IF(R12<>\"\",IF(OR(R12=0,R12<0.2),1,\"\"),\"\")","v":""},{"$f":"J5","v":"Site 19"},null,null,null,null,{"$f":"IF(L12,IF(N12,N12/L12,\"\"),\"\")","v":""},null,null,null,null,{"$f":"IF(R12,IF(S12,S12-R12,\"\"),\"\")","v":""},null,null,null,null,null,null,null,null,null,null,null,null,{"$f":"IF($L$7,$L$7,\"\")","v":""},{"$f":"IF($M$7,$M$7,\"\")","v":""},{"$f":"IF($N$7,$N$7,\"\")","v":""},null,null,{"$f":"IF($Q$7,$Q$7,\"\")","v":""},{"$f":"IF($R$7,$R$7,\"\")","v":""},{"$f":"IF($S$7,$S$7,\"\")","v":""},null,{"$f":"IF($U$7,$U$7,\"\")","v":""},{"$f":"IF($V$7,$V$7,\"\")","v":""},{"$f":"IF($W$7,$W$7,\"\")","v":""},{"$f":"IF($X$7,$X$7,\"\")","v":""},{"$f":"IF($Y$7,$Y$7,\"\")","v":""},{"$f":"IF($Z$7,$Z$7,\"\")","v":""},{"$f":"IF($AA$7,$AA$7,\"\")","v":""},{"$f":"IF($AB$7,$AB$7,\"\")","v":""}]
[{"$f":"MAX(K11:K13)","v":"00:00:00"}]

{"sheet":"Site 18","index":19,"n_rows":13,"n_cols":49,"rows_kept":13,"cut":false,"hidden":true,"merged":[]}
[]
[null,null,null,null,null,null,null,null,null,"                               Discrete Sample DBP Trends",null,null,null,null,"DBP LRAA Trends (recent 8 quarters)",null,null,null,null,null,"Discrete Sample Cl2 Residual, pH, and Temperature Trends",null,null,null,null,null,null,"Monthly Cl2 Residual Trends"]
[]
[]
[null,null,null,null,null,null,null,null,null,{"$f":"IF(Main!C26=\"\",\"\",Main!C26)","v":"Site 18"},null,{"$f":"IF(Main!F26=\"\",\"\",Main!F26)","v":""},null,null,null,"Enter Y if DBP Compliance Site    →",null,null,null,null,"Columns below can be modified for system specific paramters",null,null,null,null,null,null,null,null,null,null,null,"Charting Goals"]
[null,"Check Date","First TTHM Date","Month","Quarter","Year","M & Y","Q & Y","Cl2 Count",null,"Date","TTHM ppb","HAA5 ppb","THM Plus ppb","THM+ Ratio","Temp. C","pH units","Free Cl2 ppm","Total Cl2 ppm","Delta Cl2",null,null,null,null,null,null,null,null,null,null,null,null,"TTHM ppb","HAA5 ppb","THM Plus ppb","THM+ Ratio","Temp. C","pH units","Free Cl2 ppm","Total Cl2 ppm","Delta Cl2","Turbidity NTU","UV254 cm-1"]
[null,null,null,null,null,null,null,null,null,"System Defined Goals"]
[null,null,null,null,null,null,null,null,null,"Average",null,{"$f":"AVERAGE(L11:L13)","v":{"$error":"#DIV/0!"}},{"$error":"#DIV/0!"},{"$error":"#DIV/0!"},{"$error":"#DIV/0!"},{"$error":"#DIV/0!"},{"$error":"#DIV/0!"},{"$error":"#DIV/0!"},{"$error":"#DIV/0!"},{"$error":"#DIV/0!"},{"$error":"#DIV/0!"},{"$error":"#DIV/0!"},{"$error":"#DIV/0!"},{"$error":"#DIV/0!"},{"$error":"#DIV/0!"},{"$error":"#DIV/0!"},{"$error":"#DIV/0!"},{"$error":"#DIV/0!"}]
[null,null,null,null,null,null,null,null,null,"Minimum",null,{"$f":"MIN(L11:L13)","v":0},0,0,0,0,0,0,0,0,0,0,0,0,0,0,0,0]
[null,null,null,null,null,null,null,null,null,"Maximum",null,{"$f":"MAX(L11:L13)","v":0},0,0,0,0,0,0,0,0,0,0,0,0,0,0,0,0]
[null,null,null,null,null,null,"M & Y","Q & Y",null,null,null,null,null,null,null,null,null,null,null,null,null,null,null,null,null,null,null,null,"Provide comments below useful for data interpretation (e.g., flushing conducted in sample area, sample visibly red/brown after flush period)."]
[null,{"$f":"IF(L12,K12,)","v":"00:00:00"},{"$f":"IF(L12,1,IF(M12,1,))","v":0},{"$f":"MONTH(K12)","v":1},{"$f":"INT((MONTH(K12)-1)/3)+1","v":1},{"$f":"YEAR(K12)","v":1900},{"$f":"\"M\"&D12&\" \"&F12","v":"M1 1900"},{"$f":"\"Q\"&E12&\" \"&F12","v":"Q1 1900"},{"$f":"IF(R12<>\"\",IF(OR(R12=0,R12<0.2),1,\"\"),\"\")","v":""},{"$f":"J5","v":"Site 18"},null,null,null,null,{"$f":"IF(L12,IF(N12,N12/L12,\"\"),\"\")","v":""},null,null,null,null,{"$f":"IF(R12,IF(S12,S12-R12,\"\"),\"\")","v":""},null,null,null,null,null,null,null,null,null,null,null,null,{"$f":"IF($L$7,$L$7,\"\")","v":""},{"$f":"IF($M$7,$M$7,\"\")","v":""},{"$f":"IF($N$7,$N$7,\"\")","v":""},null,null,{"$f":"IF($Q$7,$Q$7,\"\")","v":""},{"$f":"IF($R$7,$R$7,\"\")","v":""},{"$f":"IF($S$7,$S$7,\"\")","v":""},null,{"$f":"IF($U$7,$U$7,\"\")","v":""},{"$f":"IF($V$7,$V$7,\"\")","v":""},{"$f":"IF($W$7,$W$7,\"\")","v":""},{"$f":"IF($X$7,$X$7,\"\")","v":""},{"$f":"IF($Y$7,$Y$7,\"\")","v":""},{"$f":"IF($Z$7,$Z$7,\"\")","v":""},{"$f":"IF($AA$7,$AA$7,\"\")","v":""},{"$f":"IF($AB$7,$AB$7,\"\")","v":""}]
[{"$f":"MAX(K11:K13)","v":"00:00:00"}]

{"sheet":"Site 17","index":20,"n_rows":13,"n_cols":49,"rows_kept":13,"cut":false,"hidden":true,"merged":[]}
[]
[null,null,null,null,null,null,null,null,null,"                               Discrete Sample DBP Trends",null,null,null,null,"DBP LRAA Trends (recent 8 quarters)",null,null,null,null,null,"Discrete Sample Cl2 Residual, pH, and Temperature Trends",null,null,null,null,null,null,"Monthly Cl2 Residual Trends"]
[]
[]
[null,null,null,null,null,null,null,null,null,{"$f":"IF(Main!C25=\"\",\"\",Main!C25)","v":"Site 17"},null,{"$f":"IF(Main!F25=\"\",\"\",Main!F25)","v":""},null,null,null,"Enter Y if DBP Compliance Site    →",null,null,null,null,"Columns below can be modified for system specific paramters",null,null,null,null,null,null,null,null,null,null,null,"Charting Goals"]
[null,"Check Date","First TTHM Date","Month","Quarter","Year","M & Y","Q & Y","Cl2 Count",null,"Date","TTHM ppb","HAA5 ppb","THM Plus ppb","THM+ Ratio","Temp. C","pH units","Free Cl2 ppm","Total Cl2 ppm","Delta Cl2",null,null,null,null,null,null,null,null,null,null,null,null,"TTHM ppb","HAA5 ppb","THM Plus ppb","THM+ Ratio","Temp. C","pH units","Free Cl2 ppm","Total Cl2 ppm","Delta Cl2","Turbidity NTU","UV254 cm-1"]
[null,null,null,null,null,null,null,null,null,"System Defined Goals"]
[null,null,null,null,null,null,null,null,null,"Average",null,{"$f":"AVERAGE(L11:L13)","v":{"$error":"#DIV/0!"}},{"$error":"#DIV/0!"},{"$error":"#DIV/0!"},{"$error":"#DIV/0!"},{"$error":"#DIV/0!"},{"$error":"#DIV/0!"},{"$error":"#DIV/0!"},{"$error":"#DIV/0!"},{"$error":"#DIV/0!"},{"$error":"#DIV/0!"},{"$error":"#DIV/0!"},{"$error":"#DIV/0!"},{"$error":"#DIV/0!"},{"$error":"#DIV/0!"},{"$error":"#DIV/0!"},{"$error":"#DIV/0!"},{"$error":"#DIV/0!"}]
[null,null,null,null,null,null,null,null,null,"Minimum",null,{"$f":"MIN(L11:L13)","v":0},0,0,0,0,0,0,0,0,0,0,0,0,0,0,0,0]
[null,null,null,null,null,null,null,null,null,"Maximum",null,{"$f":"MAX(L11:L13)","v":0},0,0,0,0,0,0,0,0,0,0,0,0,0,0,0,0]
[null,null,null,null,null,null,"M & Y","Q & Y",null,null,null,null,null,null,null,null,null,null,null,null,null,null,null,null,null,null,null,null,"Provide comments below useful for data interpretation (e.g., flushing conducted in sample area, sample visibly red/brown after flush period)."]
[null,{"$f":"IF(L12,K12,)","v":"00:00:00"},{"$f":"IF(L12,1,IF(M12,1,))","v":0},{"$f":"MONTH(K12)","v":1},{"$f":"INT((MONTH(K12)-1)/3)+1","v":1},{"$f":"YEAR(K12)","v":1900},{"$f":"\"M\"&D12&\" \"&F12","v":"M1 1900"},{"$f":"\"Q\"&E12&\" \"&F12","v":"Q1 1900"},{"$f":"IF(R12<>\"\",IF(OR(R12=0,R12<0.2),1,\"\"),\"\")","v":""},{"$f":"J5","v":"Site 17"},null,null,null,null,{"$f":"IF(L12,IF(N12,N12/L12,\"\"),\"\")","v":""},null,null,null,null,{"$f":"IF(R12,IF(S12,S12-R12,\"\"),\"\")","v":""},null,null,null,null,null,null,null,null,null,null,null,null,{"$f":"IF($L$7,$L$7,\"\")","v":""},{"$f":"IF($M$7,$M$7,\"\")","v":""},{"$f":"IF($N$7,$N$7,\"\")","v":""},null,null,{"$f":"IF($Q$7,$Q$7,\"\")","v":""},{"$f":"IF($R$7,$R$7,\"\")","v":""},{"$f":"IF($S$7,$S$7,\"\")","v":""},null,{"$f":"IF($U$7,$U$7,\"\")","v":""},{"$f":"IF($V$7,$V$7,\"\")","v":""},{"$f":"IF($W$7,$W$7,\"\")","v":""},{"$f":"IF($X$7,$X$7,\"\")","v":""},{"$f":"IF($Y$7,$Y$7,\"\")","v":""},{"$f":"IF($Z$7,$Z$7,\"\")","v":""},{"$f":"IF($AA$7,$AA$7,\"\")","v":""},{"$f":"IF($AB$7,$AB$7,\"\")","v":""}]
[{"$f":"MAX(K11:K13)","v":"00:00:00"}]

{"sheet":"Site 16","index":21,"n_rows":13,"n_cols":49,"rows_kept":13,"cut":false,"hidden":true,"merged":[]}
[]
[null,null,null,null,null,null,null,null,null,"                               Discrete Sample DBP Trends",null,null,null,null,"DBP LRAA Trends (recent 8 quarters)",null,null,null,null,null,"Discrete Sample Cl2 Residual, pH, and Temperature Trends",null,null,null,null,null,null,"Monthly Cl2 Residual Trends"]
[]
[]
[null,null,null,null,null,null,null,null,null,{"$f":"IF(Main!C24=\"\",\"\",Main!C24)","v":"Site 16"},null,{"$f":"IF(Main!F24=\"\",\"\",Main!F24)","v":""},null,null,null,"Enter Y if DBP Compliance Site    →",null,null,null,null,"Columns below can be modified for system specific paramters",null,null,null,null,null,null,null,null,null,null,null,"Charting Goals"]
[null,"Check Date","First TTHM Date","Month","Quarter","Year","M & Y","Q & Y","Cl2 Count",null,"Date","TTHM ppb","HAA5 ppb","THM Plus ppb","THM+ Ratio","Temp. C","pH units","Free Cl2 ppm","Total Cl2 ppm","Delta Cl2",null,null,null,null,null,null,null,null,null,null,null,null,"TTHM ppb","HAA5 ppb","THM Plus ppb","THM+ Ratio","Temp. C","pH units","Free Cl2 ppm","Total Cl2 ppm","Delta Cl2","Turbidity NTU","UV254 cm-1"]
[null,null,null,null,null,null,null,null,null,"System Defined Goals"]
[null,null,null,null,null,null,null,null,null,"Average",null,{"$f":"AVERAGE(L11:L13)","v":{"$error":"#DIV/0!"}},{"$error":"#DIV/0!"},{"$error":"#DIV/0!"},{"$error":"#DIV/0!"},{"$error":"#DIV/0!"},{"$error":"#DIV/0!"},{"$error":"#DIV/0!"},{"$error":"#DIV/0!"},{"$error":"#DIV/0!"},{"$error":"#DIV/0!"},{"$error":"#DIV/0!"},{"$error":"#DIV/0!"},{"$error":"#DIV/0!"},{"$error":"#DIV/0!"},{"$error":"#DIV/0!"},{"$error":"#DIV/0!"},{"$error":"#DIV/0!"}]
[null,null,null,null,null,null,null,null,null,"Minimum",null,{"$f":"MIN(L11:L13)","v":0},0,0,0,0,0,0,0,0,0,0,0,0,0,0,0,0]
[null,null,null,null,null,null,null,null,null,"Maximum",null,{"$f":"MAX(L11:L13)","v":0},0,0,0,0,0,0,0,0,0,0,0,0,0,0,0,0]
[null,null,null,null,null,null,"M & Y","Q & Y",null,null,null,null,null,null,null,null,null,null,null,null,null,null,null,null,null,null,null,null,"Provide comments below useful for data interpretation (e.g., flushing conducted in sample area, sample visibly red/brown after flush period)."]
[null,{"$f":"IF(L12,K12,)","v":"00:00:00"},{"$f":"IF(L12,1,IF(M12,1,))","v":0},{"$f":"MONTH(K12)","v":1},{"$f":"INT((MONTH(K12)-1)/3)+1","v":1},{"$f":"YEAR(K12)","v":1900},{"$f":"\"M\"&D12&\" \"&F12","v":"M1 1900"},{"$f":"\"Q\"&E12&\" \"&F12","v":"Q1 1900"},{"$f":"IF(R12<>\"\",IF(OR(R12=0,R12<0.2),1,\"\"),\"\")","v":""},{"$f":"J5","v":"Site 16"},null,null,null,null,{"$f":"IF(L12,IF(N12,N12/L12,\"\"),\"\")","v":""},null,null,null,null,{"$f":"IF(R12,IF(S12,S12-R12,\"\"),\"\")","v":""},null,null,null,null,null,null,null,null,null,null,null,null,{"$f":"IF($L$7,$L$7,\"\")","v":""},{"$f":"IF($M$7,$M$7,\"\")","v":""},{"$f":"IF($N$7,$N$7,\"\")","v":""},null,null,{"$f":"IF($Q$7,$Q$7,\"\")","v":""},{"$f":"IF($R$7,$R$7,\"\")","v":""},{"$f":"IF($S$7,$S$7,\"\")","v":""},null,{"$f":"IF($U$7,$U$7,\"\")","v":""},{"$f":"IF($V$7,$V$7,\"\")","v":""},{"$f":"IF($W$7,$W$7,\"\")","v":""},{"$f":"IF($X$7,$X$7,\"\")","v":""},{"$f":"IF($Y$7,$Y$7,\"\")","v":""},{"$f":"IF($Z$7,$Z$7,\"\")","v":""},{"$f":"IF($AA$7,$AA$7,\"\")","v":""},{"$f":"IF($AB$7,$AB$7,\"\")","v":""}]
[{"$f":"MAX(K11:K13)","v":"00:00:00"}]

{"sheet":"Site 15","index":22,"n_rows":13,"n_cols":49,"rows_kept":13,"cut":false,"hidden":true,"merged":[]}
[]
[null,null,null,null,null,null,null,null,null,"                               Discrete Sample DBP Trends",null,null,null,null,"DBP LRAA Trends (recent 8 quarters)",null,null,null,null,null,"Discrete Sample Cl2 Residual, pH, and Temperature Trends",null,null,null,null,null,null,"Monthly Cl2 Residual Trends"]
[]
[]
[null,null,null,null,null,null,null,null,null,{"$f":"IF(Main!C23=\"\",\"\",Main!C23)","v":"Site 15"},null,{"$f":"IF(Main!F23=\"\",\"\",Main!F23)","v":""},null,null,null,"Enter Y if DBP Compliance Site    →",null,null,null,null,"Columns below can be modified for system specific paramters",null,null,null,null,null,null,null,null,null,null,null,"Charting Goals"]
[null,"Check Date","First TTHM Date","Month","Quarter","Year","M & Y","Q & Y","Cl2 Count",null,"Date","TTHM ppb","HAA5 ppb","THM Plus ppb","THM+ Ratio","Temp. C","pH units","Free Cl2 ppm","Total Cl2 ppm","Delta Cl2",null,null,null,null,null,null,null,null,null,null,null,null,"TTHM ppb","HAA5 ppb","THM Plus ppb","THM+ Ratio","Temp. C","pH units","Free Cl2 ppm","Total Cl2 ppm","Delta Cl2","Turbidity NTU","UV254 cm-1"]
[null,null,null,null,null,null,null,null,null,"System Defined Goals"]
[null,null,null,null,null,null,null,null,null,"Average",null,{"$f":"AVERAGE(L11:L13)","v":{"$error":"#DIV/0!"}},{"$error":"#DIV/0!"},{"$error":"#DIV/0!"},{"$error":"#DIV/0!"},{"$error":"#DIV/0!"},{"$error":"#DIV/0!"},{"$error":"#DIV/0!"},{"$error":"#DIV/0!"},{"$error":"#DIV/0!"},{"$error":"#DIV/0!"},{"$error":"#DIV/0!"},{"$error":"#DIV/0!"},{"$error":"#DIV/0!"},{"$error":"#DIV/0!"},{"$error":"#DIV/0!"},{"$error":"#DIV/0!"},{"$error":"#DIV/0!"}]
[null,null,null,null,null,null,null,null,null,"Minimum",null,{"$f":"MIN(L11:L13)","v":0},0,0,0,0,0,0,0,0,0,0,0,0,0,0,0,0]
[null,null,null,null,null,null,null,null,null,"Maximum",null,{"$f":"MAX(L11:L13)","v":0},0,0,0,0,0,0,0,0,0,0,0,0,0,0,0,0]
[null,null,null,null,null,null,"M & Y","Q & Y",null,null,null,null,null,null,null,null,null,null,null,null,null,null,null,null,null,null,null,null,"Provide comments below useful for data interpretation (e.g., flushing conducted in sample area, sample visibly red/brown after flush period)."]
[null,{"$f":"IF(L12,K12,)","v":"00:00:00"},{"$f":"IF(L12,1,IF(M12,1,))","v":0},{"$f":"MONTH(K12)","v":1},{"$f":"INT((MONTH(K12)-1)/3)+1","v":1},{"$f":"YEAR(K12)","v":1900},{"$f":"\"M\"&D12&\" \"&F12","v":"M1 1900"},{"$f":"\"Q\"&E12&\" \"&F12","v":"Q1 1900"},{"$f":"IF(R12<>\"\",IF(OR(R12=0,R12<0.2),1,\"\"),\"\")","v":""},{"$f":"J5","v":"Site 15"},null,null,null,null,{"$f":"IF(L12,IF(N12,N12/L12,\"\"),\"\")","v":""},null,null,null,null,{"$f":"IF(R12,IF(S12,S12-R12,\"\"),\"\")","v":""},null,null,null,null,null,null,null,null,null,null,null,null,{"$f":"IF($L$7,$L$7,\"\")","v":""},{"$f":"IF($M$7,$M$7,\"\")","v":""},{"$f":"IF($N$7,$N$7,\"\")","v":""},null,null,{"$f":"IF($Q$7,$Q$7,\"\")","v":""},{"$f":"IF($R$7,$R$7,\"\")","v":""},{"$f":"IF($S$7,$S$7,\"\")","v":""},null,{"$f":"IF($U$7,$U$7,\"\")","v":""},{"$f":"IF($V$7,$V$7,\"\")","v":""},{"$f":"IF($W$7,$W$7,\"\")","v":""},{"$f":"IF($X$7,$X$7,\"\")","v":""},{"$f":"IF($Y$7,$Y$7,\"\")","v":""},{"$f":"IF($Z$7,$Z$7,\"\")","v":""},{"$f":"IF($AA$7,$AA$7,\"\")","v":""},{"$f":"IF($AB$7,$AB$7,\"\")","v":""}]
[{"$f":"MAX(K11:K13)","v":"00:00:00"}]

{"sheet":"Site 14","index":23,"n_rows":13,"n_cols":49,"rows_kept":13,"cut":false,"hidden":true,"merged":[]}
[]
[null,null,null,null,null,null,null,null,null,"                               Discrete Sample DBP Trends",null,null,null,null,"DBP LRAA Trends (recent 8 quarters)",null,null,null,null,null,"Discrete Sample Cl2 Residual, pH, and Temperature Trends",null,null,null,null,null,null,"Monthly Cl2 Residual Trends"]
[]
[]
[null,null,null,null,null,null,null,null,null,{"$f":"IF(Main!C22=\"\",\"\",Main!C22)","v":"Site 14"},null,{"$f":"IF(Main!F22=\"\",\"\",Main!F22)","v":""},null,null,null,"Enter Y if DBP Compliance Site    →",null,null,null,null,"Columns below can be modified for system specific paramters",null,null,null,null,null,null,null,null,null,null,null,"Charting Goals"]
[null,"Check Date","First TTHM Date","Month","Quarter","Year","M & Y","Q & Y","Cl2 Count",null,"Date","TTHM ppb","HAA5 ppb","THM Plus ppb","THM+ Ratio","Temp. C","pH units","Free Cl2 ppm","Total Cl2 ppm","Delta Cl2",null,null,null,null,null,null,null,null,null,null,null,null,"TTHM ppb","HAA5 ppb","THM Plus ppb","THM+ Ratio","Temp. C","pH units","Free Cl2 ppm","Total Cl2 ppm","Delta Cl2","Turbidity NTU","UV254 cm-1"]
[null,null,null,null,null,null,null,null,null,"System Defined Goals"]
[null,null,null,null,null,null,null,null,null,"Average",null,{"$f":"AVERAGE(L11:L13)","v":{"$error":"#DIV/0!"}},{"$error":"#DIV/0!"},{"$error":"#DIV/0!"},{"$error":"#DIV/0!"},{"$error":"#DIV/0!"},{"$error":"#DIV/0!"},{"$error":"#DIV/0!"},{"$error":"#DIV/0!"},{"$error":"#DIV/0!"},{"$error":"#DIV/0!"},{"$error":"#DIV/0!"},{"$error":"#DIV/0!"},{"$error":"#DIV/0!"},{"$error":"#DIV/0!"},{"$error":"#DIV/0!"},{"$error":"#DIV/0!"},{"$error":"#DIV/0!"}]
[null,null,null,null,null,null,null,null,null,"Minimum",null,{"$f":"MIN(L11:L13)","v":0},0,0,0,0,0,0,0,0,0,0,0,0,0,0,0,0]
[null,null,null,null,null,null,null,null,null,"Maximum",null,{"$f":"MAX(L11:L13)","v":0},0,0,0,0,0,0,0,0,0,0,0,0,0,0,0,0]
[null,null,null,null,null,null,"M & Y","Q & Y",null,null,null,null,null,null,null,null,null,null,null,null,null,null,null,null,null,null,null,null,"Provide comments below useful for data interpretation (e.g., flushing conducted in sample area, sample visibly red/brown after flush period)."]
[null,{"$f":"IF(L12,K12,)","v":"00:00:00"},{"$f":"IF(L12,1,IF(M12,1,))","v":0},{"$f":"MONTH(K12)","v":1},{"$f":"INT((MONTH(K12)-1)/3)+1","v":1},{"$f":"YEAR(K12)","v":1900},{"$f":"\"M\"&D12&\" \"&F12","v":"M1 1900"},{"$f":"\"Q\"&E12&\" \"&F12","v":"Q1 1900"},{"$f":"IF(R12<>\"\",IF(OR(R12=0,R12<0.2),1,\"\"),\"\")","v":""},{"$f":"J5","v":"Site 14"},null,null,null,null,{"$f":"IF(L12,IF(N12,N12/L12,\"\"),\"\")","v":""},null,null,null,null,{"$f":"IF(R12,IF(S12,S12-R12,\"\"),\"\")","v":""},null,null,null,null,null,null,null,null,null,null,null,null,{"$f":"IF($L$7,$L$7,\"\")","v":""},{"$f":"IF($M$7,$M$7,\"\")","v":""},{"$f":"IF($N$7,$N$7,\"\")","v":""},null,null,{"$f":"IF($Q$7,$Q$7,\"\")","v":""},{"$f":"IF($R$7,$R$7,\"\")","v":""},{"$f":"IF($S$7,$S$7,\"\")","v":""},null,{"$f":"IF($U$7,$U$7,\"\")","v":""},{"$f":"IF($V$7,$V$7,\"\")","v":""},{"$f":"IF($W$7,$W$7,\"\")","v":""},{"$f":"IF($X$7,$X$7,\"\")","v":""},{"$f":"IF($Y$7,$Y$7,\"\")","v":""},{"$f":"IF($Z$7,$Z$7,\"\")","v":""},{"$f":"IF($AA$7,$AA$7,\"\")","v":""},{"$f":"IF($AB$7,$AB$7,\"\")","v":""}]
[{"$f":"MAX(K11:K13)","v":"00:00:00"}]

{"sheet":"Site 13","index":24,"n_rows":13,"n_cols":49,"rows_kept":13,"cut":false,"hidden":true,"merged":[]}
[]
[null,null,null,null,null,null,null,null,null,"                               Discrete Sample DBP Trends",null,null,null,null,"DBP LRAA Trends (recent 8 quarters)",null,null,null,null,null,"Discrete Sample Cl2 Residual, pH, and Temperature Trends",null,null,null,null,null,null,"Monthly Cl2 Residual Trends"]
[]
[]
[null,null,null,null,null,null,null,null,null,{"$f":"IF(Main!C21=\"\",\"\",Main!C21)","v":"Site 13"},null,{"$f":"IF(Main!F21=\"\",\"\",Main!F21)","v":""},null,null,null,"Enter Y if DBP Compliance Site    →",null,null,null,null,"Columns below can be modified for system specific paramters",null,null,null,null,null,null,null,null,null,null,null,"Charting Goals"]
[null,"Check Date","First TTHM Date","Month","Quarter","Year","M & Y","Q & Y","Cl2 Count",null,"Date","TTHM ppb","HAA5 ppb","THM Plus ppb","THM+ Ratio","Temp. C","pH units","Free Cl2 ppm","Total Cl2 ppm","Delta Cl2",null,null,null,null,null,null,null,null,null,null,null,null,"TTHM ppb","HAA5 ppb","THM Plus ppb","THM+ Ratio","Temp. C","pH units","Free Cl2 ppm","Total Cl2 ppm","Delta Cl2","Turbidity NTU","UV254 cm-1"]
[null,null,null,null,null,null,null,null,null,"System Defined Goals"]
[null,null,null,null,null,null,null,null,null,"Average",null,{"$f":"AVERAGE(L11:L13)","v":{"$error":"#DIV/0!"}},{"$error":"#DIV/0!"},{"$error":"#DIV/0!"},{"$error":"#DIV/0!"},{"$error":"#DIV/0!"},{"$error":"#DIV/0!"},{"$error":"#DIV/0!"},{"$error":"#DIV/0!"},{"$error":"#DIV/0!"},{"$error":"#DIV/0!"},{"$error":"#DIV/0!"},{"$error":"#DIV/0!"},{"$error":"#DIV/0!"},{"$error":"#DIV/0!"},{"$error":"#DIV/0!"},{"$error":"#DIV/0!"},{"$error":"#DIV/0!"}]
[null,null,null,null,null,null,null,null,null,"Minimum",null,{"$f":"MIN(L11:L13)","v":0},0,0,0,0,0,0,0,0,0,0,0,0,0,0,0,0]
[null,null,null,null,null,null,null,null,null,"Maximum",null,{"$f":"MAX(L11:L13)","v":0},0,0,0,0,0,0,0,0,0,0,0,0,0,0,0,0]
[null,null,null,null,null,null,"M & Y","Q & Y",null,null,null,null,null,null,null,null,null,null,null,null,null,null,null,null,null,null,null,null,"Provide comments below useful for data interpretation (e.g., flushing conducted in sample area, sample visibly red/brown after flush period)."]
[null,{"$f":"IF(L12,K12,)","v":"00:00:00"},{"$f":"IF(L12,1,IF(M12,1,))","v":0},{"$f":"MONTH(K12)","v":1},{"$f":"INT((MONTH(K12)-1)/3)+1","v":1},{"$f":"YEAR(K12)","v":1900},{"$f":"\"M\"&D12&\" \"&F12","v":"M1 1900"},{"$f":"\"Q\"&E12&\" \"&F12","v":"Q1 1900"},{"$f":"IF(R12<>\"\",IF(OR(R12=0,R12<0.2),1,\"\"),\"\")","v":""},{"$f":"J5","v":"Site 13"},null,null,null,null,{"$f":"IF(L12,IF(N12,N12/L12,\"\"),\"\")","v":""},null,null,null,null,{"$f":"IF(R12,IF(S12,S12-R12,\"\"),\"\")","v":""},null,null,null,null,null,null,null,null,null,null,null,null,{"$f":"IF($L$7,$L$7,\"\")","v":""},{"$f":"IF($M$7,$M$7,\"\")","v":""},{"$f":"IF($N$7,$N$7,\"\")","v":""},null,null,{"$f":"IF($Q$7,$Q$7,\"\")","v":""},{"$f":"IF($R$7,$R$7,\"\")","v":""},{"$f":"IF($S$7,$S$7,\"\")","v":""},null,{"$f":"IF($U$7,$U$7,\"\")","v":""},{"$f":"IF($V$7,$V$7,\"\")","v":""},{"$f":"IF($W$7,$W$7,\"\")","v":""},{"$f":"IF($X$7,$X$7,\"\")","v":""},{"$f":"IF($Y$7,$Y$7,\"\")","v":""},{"$f":"IF($Z$7,$Z$7,\"\")","v":""},{"$f":"IF($AA$7,$AA$7,\"\")","v":""},{"$f":"IF($AB$7,$AB$7,\"\")","v":""}]
[{"$f":"MAX(K11:K13)","v":"00:00:00"}]

{"sheet":"Site 12","index":25,"n_rows":13,"n_cols":49,"rows_kept":13,"cut":false,"hidden":true,"merged":[]}
[]
[null,null,null,null,null,null,null,null,null,"                               Discrete Sample DBP Trends",null,null,null,null,"DBP LRAA Trends (recent 8 quarters)",null,null,null,null,null,"Discrete Sample Cl2 Residual, pH, and Temperature Trends",null,null,null,null,null,null,"Monthly Cl2 Residual Trends"]
[]
[]
[null,null,null,null,null,null,null,null,null,{"$f":"IF(Main!C20=\"\",\"\",Main!C20)","v":"Site 12"},null,{"$f":"IF(Main!F20=\"\",\"\",Main!F20)","v":""},null,null,null,"Enter Y if DBP Compliance Site    →",null,null,null,null,"Columns below can be modified for system specific paramters",null,null,null,null,null,null,null,null,null,null,null,"Charting Goals"]
[null,"Check Date","First TTHM Date","Month","Quarter","Year","M & Y","Q & Y","Cl2 Count",null,"Date","TTHM ppb","HAA5 ppb","THM Plus ppb","THM+ Ratio","Temp. C","pH units","Free Cl2 ppm","Total Cl2 ppm","Delta Cl2",null,null,null,null,null,null,null,null,null,null,null,null,"TTHM ppb","HAA5 ppb","THM Plus ppb","THM+ Ratio","Temp. C","pH units","Free Cl2 ppm","Total Cl2 ppm","Delta Cl2","Turbidity NTU","UV254 cm-1"]
[null,null,null,null,null,null,null,null,null,"System Defined Goals"]
[null,null,null,null,null,null,null,null,null,"Average",null,{"$f":"AVERAGE(L11:L13)","v":{"$error":"#DIV/0!"}},{"$error":"#DIV/0!"},{"$error":"#DIV/0!"},{"$error":"#DIV/0!"},{"$error":"#DIV/0!"},{"$error":"#DIV/0!"},{"$error":"#DIV/0!"},{"$error":"#DIV/0!"},{"$error":"#DIV/0!"},{"$error":"#DIV/0!"},{"$error":"#DIV/0!"},{"$error":"#DIV/0!"},{"$error":"#DIV/0!"},{"$error":"#DIV/0!"},{"$error":"#DIV/0!"},{"$error":"#DIV/0!"},{"$error":"#DIV/0!"}]
[null,null,null,null,null,null,null,null,null,"Minimum",null,{"$f":"MIN(L11:L13)","v":0},0,0,0,0,0,0,0,0,0,0,0,0,0,0,0,0]
[null,null,null,null,null,null,null,null,null,"Maximum",null,{"$f":"MAX(L11:L13)","v":0},0,0,0,0,0,0,0,0,0,0,0,0,0,0,0,0]
[null,null,null,null,null,null,"M & Y","Q & Y",null,null,null,null,null,null,null,null,null,null,null,null,null,null,null,null,null,null,null,null,"Provide comments below useful for data interpretation (e.g., flushing conducted in sample area, sample visibly red/brown after flush period)."]
[null,{"$f":"IF(L12,K12,)","v":"00:00:00"},{"$f":"IF(L12,1,IF(M12,1,))","v":0},{"$f":"MONTH(K12)","v":1},{"$f":"INT((MONTH(K12)-1)/3)+1","v":1},{"$f":"YEAR(K12)","v":1900},{"$f":"\"M\"&D12&\" \"&F12","v":"M1 1900"},{"$f":"\"Q\"&E12&\" \"&F12","v":"Q1 1900"},{"$f":"IF(R12<>\"\",IF(OR(R12=0,R12<0.2),1,\"\"),\"\")","v":""},{"$f":"J5","v":"Site 12"},null,null,null,null,{"$f":"IF(L12,IF(N12,N12/L12,\"\"),\"\")","v":""},null,null,null,null,{"$f":"IF(R12,IF(S12,S12-R12,\"\"),\"\")","v":""},null,null,null,null,null,null,null,null,null,null,null,null,{"$f":"IF($L$7,$L$7,\"\")","v":""},{"$f":"IF($M$7,$M$7,\"\")","v":""},{"$f":"IF($N$7,$N$7,\"\")","v":""},null,null,{"$f":"IF($Q$7,$Q$7,\"\")","v":""},{"$f":"IF($R$7,$R$7,\"\")","v":""},{"$f":"IF($S$7,$S$7,\"\")","v":""},null,{"$f":"IF($U$7,$U$7,\"\")","v":""},{"$f":"IF($V$7,$V$7,\"\")","v":""},{"$f":"IF($W$7,$W$7,\"\")","v":""},{"$f":"IF($X$7,$X$7,\"\")","v":""},{"$f":"IF($Y$7,$Y$7,\"\")","v":""},{"$f":"IF($Z$7,$Z$7,\"\")","v":""},{"$f":"IF($AA$7,$AA$7,\"\")","v":""},{"$f":"IF($AB$7,$AB$7,\"\")","v":""}]
[{"$f":"MAX(K11:K13)","v":"00:00:00"}]

{"sheet":"Site 11","index":26,"n_rows":13,"n_cols":49,"rows_kept":13,"cut":false,"hidden":true,"merged":[]}
[]
[null,null,null,null,null,null,null,null,null,"                               Discrete Sample DBP Trends",null,null,null,null,"DBP LRAA Trends (recent 8 quarters)",null,null,null,null,null,"Discrete Sample Cl2 Residual, pH, and Temperature Trends",null,null,null,null,null,null,"Monthly Cl2 Residual Trends"]
[]
[]
[null,null,null,null,null,null,null,null,null,{"$f":"IF(Main!C19=\"\",\"\",Main!C19)","v":"Site 11"},null,{"$f":"IF(Main!F19=\"\",\"\",Main!F19)","v":""},null,null,null,"Enter Y if DBP Compliance Site    →",null,null,null,null,"Columns below can be modified for system specific paramters",null,null,null,null,null,null,null,null,null,null,null,"Charting Goals"]
[null,"Check Date","First TTHM Date","Month","Quarter","Year","M & Y","Q & Y","Cl2 Count",null,"Date","TTHM ppb","HAA5 ppb","THM Plus ppb","THM+ Ratio","Temp. C","pH units","Free Cl2 ppm","Total Cl2 ppm","Delta Cl2",null,null,null,null,null,null,null,null,null,null,null,null,"TTHM ppb","HAA5 ppb","THM Plus ppb","THM+ Ratio","Temp. C","pH units","Free Cl2 ppm","Total Cl2 ppm","Delta Cl2","Turbidity NTU","UV254 cm-1"]
[null,null,null,null,null,null,null,null,null,"System Defined Goals"]
[null,null,null,null,null,null,null,null,null,"Average",null,{"$f":"AVERAGE(L11:L13)","v":{"$error":"#DIV/0!"}},{"$error":"#DIV/0!"},{"$error":"#DIV/0!"},{"$error":"#DIV/0!"},{"$error":"#DIV/0!"},{"$error":"#DIV/0!"},{"$error":"#DIV/0!"},{"$error":"#DIV/0!"},{"$error":"#DIV/0!"},{"$error":"#DIV/0!"},{"$error":"#DIV/0!"},{"$error":"#DIV/0!"},{"$error":"#DIV/0!"},{"$error":"#DIV/0!"},{"$error":"#DIV/0!"},{"$error":"#DIV/0!"},{"$error":"#DIV/0!"}]
[null,null,null,null,null,null,null,null,null,"Minimum",null,{"$f":"MIN(L11:L13)","v":0},0,0,0,0,0,0,0,0,0,0,0,0,0,0,0,0]
[null,null,null,null,null,null,null,null,null,"Maximum",null,{"$f":"MAX(L11:L13)","v":0},0,0,0,0,0,0,0,0,0,0,0,0,0,0,0,0]
[null,null,null,null,null,null,"M & Y","Q & Y",null,null,null,null,null,null,null,null,null,null,null,null,null,null,null,null,null,null,null,null,"Provide comments below useful for data interpretation (e.g., flushing conducted in sample area, sample visibly red/brown after flush period)."]
[null,{"$f":"IF(L12,K12,)","v":"00:00:00"},{"$f":"IF(L12,1,IF(M12,1,))","v":0},{"$f":"MONTH(K12)","v":1},{"$f":"INT((MONTH(K12)-1)/3)+1","v":1},{"$f":"YEAR(K12)","v":1900},{"$f":"\"M\"&D12&\" \"&F12","v":"M1 1900"},{"$f":"\"Q\"&E12&\" \"&F12","v":"Q1 1900"},{"$f":"IF(R12<>\"\",IF(OR(R12=0,R12<0.2),1,\"\"),\"\")","v":""},{"$f":"J5","v":"Site 11"},null,null,null,null,{"$f":"IF(L12,IF(N12,N12/L12,\"\"),\"\")","v":""},null,null,null,null,{"$f":"IF(R12,IF(S12,S12-R12,\"\"),\"\")","v":""},null,null,null,null,null,null,null,null,null,null,null,null,{"$f":"IF($L$7,$L$7,\"\")","v":""},{"$f":"IF($M$7,$M$7,\"\")","v":""},{"$f":"IF($N$7,$N$7,\"\")","v":""},null,null,{"$f":"IF($Q$7,$Q$7,\"\")","v":""},{"$f":"IF($R$7,$R$7,\"\")","v":""},{"$f":"IF($S$7,$S$7,\"\")","v":""},null,{"$f":"IF($U$7,$U$7,\"\")","v":""},{"$f":"IF($V$7,$V$7,\"\")","v":""},{"$f":"IF($W$7,$W$7,\"\")","v":""},{"$f":"IF($X$7,$X$7,\"\")","v":""},{"$f":"IF($Y$7,$Y$7,\"\")","v":""},{"$f":"IF($Z$7,$Z$7,\"\")","v":""},{"$f":"IF($AA$7,$AA$7,\"\")","v":""},{"$f":"IF($AB$7,$AB$7,\"\")","v":""}]
[{"$f":"MAX(K11:K13)","v":"00:00:00"}]

{"sheet":"Site 10","index":27,"n_rows":13,"n_cols":49,"rows_kept":13,"cut":false,"hidden":true,"merged":[]}
[]
[null,null,null,null,null,null,null,null,null,"                               Discrete Sample DBP Trends",null,null,null,null,"DBP LRAA Trends (recent 8 quarters)",null,null,null,null,null,"Discrete Sample Cl2 Residual, pH, and Temperature Trends",null,null,null,null,null,null,"Monthly Cl2 Residual Trends"]
[]
[]
[null,null,null,null,null,null,null,null,null,{"$f":"IF(Main!C18=\"\",\"\",Main!C18)","v":"Site 10"},null,{"$f":"IF(Main!F18=\"\",\"\",Main!F18)","v":""},null,null,null,"Enter Y if DBP Compliance Site    →",null,null,null,null,"Columns below can be modified for system specific paramters",null,null,null,null,null,null,null,null,null,null,null,"Charting Goals"]
[null,"Check Date","First TTHM Date","Month","Quarter","Year","M & Y","Q & Y","Cl2 Count",null,"Date","TTHM ppb","HAA5 ppb","THM Plus ppb","THM+ Ratio","Temp. C","pH units","Free Cl2 ppm","Total Cl2 ppm","Delta Cl2",null,null,null,null,null,null,null,null,null,null,null,null,"TTHM ppb","HAA5 ppb","THM Plus ppb","THM+ Ratio","Temp. C","pH units","Free Cl2 ppm","Total Cl2 ppm","Delta Cl2","Turbidity NTU","UV254 cm-1"]
[null,null,null,null,null,null,null,null,null,"System Defined Goals"]
[null,null,null,null,null,null,null,null,null,"Average",null,{"$f":"AVERAGE(L11:L13)","v":{"$error":"#DIV/0!"}},{"$error":"#DIV/0!"},{"$error":"#DIV/0!"},{"$error":"#DIV/0!"},{"$error":"#DIV/0!"},{"$error":"#DIV/0!"},{"$error":"#DIV/0!"},{"$error":"#DIV/0!"},{"$error":"#DIV/0!"},{"$error":"#DIV/0!"},{"$error":"#DIV/0!"},{"$error":"#DIV/0!"},{"$error":"#DIV/0!"},{"$error":"#DIV/0!"},{"$error":"#DIV/0!"},{"$error":"#DIV/0!"},{"$error":"#DIV/0!"}]
[null,null,null,null,null,null,null,null,null,"Minimum",null,{"$f":"MIN(L11:L13)","v":0},0,0,0,0,0,0,0,0,0,0,0,0,0,0,0,0]
[null,null,null,null,null,null,null,null,null,"Maximum",null,{"$f":"MAX(L11:L13)","v":0},0,0,0,0,0,0,0,0,0,0,0,0,0,0,0,0]
[null,null,null,null,null,null,"M & Y","Q & Y",null,null,null,null,null,null,null,null,null,null,null,null,null,null,null,null,null,null,null,null,"Provide comments below useful for data interpretation (e.g., flushing conducted in sample area, sample visibly red/brown after flush period)."]
[null,{"$f":"IF(L12,K12,)","v":"00:00:00"},{"$f":"IF(L12,1,IF(M12,1,))","v":0},{"$f":"MONTH(K12)","v":1},{"$f":"INT((MONTH(K12)-1)/3)+1","v":1},{"$f":"YEAR(K12)","v":1900},{"$f":"\"M\"&D12&\" \"&F12","v":"M1 1900"},{"$f":"\"Q\"&E12&\" \"&F12","v":"Q1 1900"},{"$f":"IF(R12<>\"\",IF(OR(R12=0,R12<0.2),1,\"\"),\"\")","v":""},{"$f":"J5","v":"Site 10"},null,null,null,null,{"$f":"IF(L12,IF(N12,N12/L12,\"\"),\"\")","v":""},null,null,null,null,{"$f":"IF(R12,IF(S12,S12-R12,\"\"),\"\")","v":""},null,null,null,null,null,null,null,null,null,null,null,null,{"$f":"IF($L$7,$L$7,\"\")","v":""},{"$f":"IF($M$7,$M$7,\"\")","v":""},{"$f":"IF($N$7,$N$7,\"\")","v":""},null,null,{"$f":"IF($Q$7,$Q$7,\"\")","v":""},{"$f":"IF($R$7,$R$7,\"\")","v":""},{"$f":"IF($S$7,$S$7,\"\")","v":""},null,{"$f":"IF($U$7,$U$7,\"\")","v":""},{"$f":"IF($V$7,$V$7,\"\")","v":""},{"$f":"IF($W$7,$W$7,\"\")","v":""},{"$f":"IF($X$7,$X$7,\"\")","v":""},{"$f":"IF($Y$7,$Y$7,\"\")","v":""},{"$f":"IF($Z$7,$Z$7,\"\")","v":""},{"$f":"IF($AA$7,$AA$7,\"\")","v":""},{"$f":"IF($AB$7,$AB$7,\"\")","v":""}]
[{"$f":"MAX(K11:K13)","v":"00:00:00"}]

{"sheet":"Site 9","index":28,"n_rows":13,"n_cols":49,"rows_kept":13,"cut":false,"hidden":true,"merged":[]}
[]
[null,null,null,null,null,null,null,null,null,"                               Discrete Sample DBP Trends",null,null,null,null,"DBP LRAA Trends (recent 8 quarters)",null,null,null,null,null,"Discrete Sample Cl2 Residual, pH, and Temperature Trends",null,null,null,null,null,null,"Monthly Cl2 Residual Trends"]
[]
[]
[null,null,null,null,null,null,null,null,null,{"$f":"IF(Main!C17=\"\",\"\",Main!C17)","v":"Site 9"},null,{"$f":"IF(Main!F17=\"\",\"\",Main!F17)","v":""},null,null,null,"Enter Y if DBP Compliance Site    →",null,null,null,null,"Columns below can be modified for system specific paramters",null,null,null,null,null,null,null,null,null,null,null,"Charting Goals"]
[null,"Check Date","First TTHM Date","Month","Quarter","Year","M & Y","Q & Y","Cl2 Count",null,"Date","TTHM ppb","HAA5 ppb","THM Plus ppb","THM+ Ratio","Temp. C","pH units","Free Cl2 ppm","Total Cl2 ppm","Delta Cl2",null,null,null,null,null,null,null,null,null,null,null,null,"TTHM ppb","HAA5 ppb","THM Plus ppb","THM+ Ratio","Temp. C","pH units","Free Cl2 ppm","Total Cl2 ppm","Delta Cl2","Turbidity NTU","UV254 cm-1"]
[null,null,null,null,null,null,null,null,null,"System Defined Goals"]
[null,null,null,null,null,null,null,null,null,"Average",null,{"$f":"AVERAGE(L11:L13)","v":{"$error":"#DIV/0!"}},{"$error":"#DIV/0!"},{"$error":"#DIV/0!"},{"$error":"#DIV/0!"},{"$error":"#DIV/0!"},{"$error":"#DIV/0!"},{"$error":"#DIV/0!"},{"$error":"#DIV/0!"},{"$error":"#DIV/0!"},{"$error":"#DIV/0!"},{"$error":"#DIV/0!"},{"$error":"#DIV/0!"},{"$error":"#DIV/0!"},{"$error":"#DIV/0!"},{"$error":"#DIV/0!"},{"$error":"#DIV/0!"},{"$error":"#DIV/0!"}]
[null,null,null,null,null,null,null,null,null,"Minimum",null,{"$f":"MIN(L11:L13)","v":0},0,0,0,0,0,0,0,0,0,0,0,0,0,0,0,0]
[null,null,null,null,null,null,null,null,null,"Maximum",null,{"$f":"MAX(L11:L13)","v":0},0,0,0,0,0,0,0,0,0,0,0,0,0,0,0,0]
[null,null,null,null,null,null,"M & Y","Q & Y",null,null,null,null,null,null,null,null,null,null,null,null,null,null,null,null,null,null,null,null,"Provide comments below useful for data interpretation (e.g., flushing conducted in sample area, sample visibly red/brown after flush period)."]
[null,{"$f":"IF(L12,K12,)","v":"00:00:00"},{"$f":"IF(L12,1,IF(M12,1,))","v":0},{"$f":"MONTH(K12)","v":1},{"$f":"INT((MONTH(K12)-1)/3)+1","v":1},{"$f":"YEAR(K12)","v":1900},{"$f":"\"M\"&D12&\" \"&F12","v":"M1 1900"},{"$f":"\"Q\"&E12&\" \"&F12","v":"Q1 1900"},{"$f":"IF(R12<>\"\",IF(OR(R12=0,R12<0.2),1,\"\"),\"\")","v":""},{"$f":"J5","v":"Site 9"},null,null,null,null,{"$f":"IF(L12,IF(N12,N12/L12,\"\"),\"\")","v":""},null,null,null,null,{"$f":"IF(R12,IF(S12,S12-R12,\"\"),\"\")","v":""},null,null,null,null,null,null,null,null,null,null,null,null,{"$f":"IF($L$7,$L$7,\"\")","v":""},{"$f":"IF($M$7,$M$7,\"\")","v":""},{"$f":"IF($N$7,$N$7,\"\")","v":""},null,null,{"$f":"IF($Q$7,$Q$7,\"\")","v":""},{"$f":"IF($R$7,$R$7,\"\")","v":""},{"$f":"IF($S$7,$S$7,\"\")","v":""},null,{"$f":"IF($U$7,$U$7,\"\")","v":""},{"$f":"IF($V$7,$V$7,\"\")","v":""},{"$f":"IF($W$7,$W$7,\"\")","v":""},{"$f":"IF($X$7,$X$7,\"\")","v":""},{"$f":"IF($Y$7,$Y$7,\"\")","v":""},{"$f":"IF($Z$7,$Z$7,\"\")","v":""},{"$f":"IF($AA$7,$AA$7,\"\")","v":""},{"$f":"IF($AB$7,$AB$7,\"\")","v":""}]
[{"$f":"MAX(K11:K13)","v":"00:00:00"}]

{"sheet":"Site 8","index":29,"n_rows":13,"n_cols":49,"rows_kept":13,"cut":false,"hidden":true,"merged":[]}
[]
[null,null,null,null,null,null,null,null,null,"                               Discrete Sample DBP Trends",null,null,null,null,"DBP LRAA Trends (recent 8 quarters)",null,null,null,null,null,"Discrete Sample Cl2 Residual, pH, and Temperature Trends",null,null,null,null,null,null,"Monthly Cl2 Residual Trends"]
[]
[]
[null,null,null,null,null,null,null,null,null,{"$f":"IF(Main!C16=\"\",\"\",Main!C16)","v":"Site 8"},null,{"$f":"IF(Main!F16=\"\",\"\",Main!F16)","v":""},null,null,null,"Enter Y if DBP Compliance Site    →",null,null,null,null,"Columns below can be modified for system specific paramters",null,null,null,null,null,null,null,null,null,null,null,"Charting Goals"]
[null,"Check Date","First TTHM Date","Month","Quarter","Year","M & Y","Q & Y","Cl2 Count",null,"Date","TTHM ppb","HAA5 ppb","THM Plus ppb","THM+ Ratio","Temp. C","pH units","Free Cl2 ppm","Total Cl2 ppm","Delta Cl2",null,null,null,null,null,null,null,null,null,null,null,null,"TTHM ppb","HAA5 ppb","THM Plus ppb","THM+ Ratio","Temp. C","pH units","Free Cl2 ppm","Total Cl2 ppm","Delta Cl2","Turbidity NTU","UV254 cm-1"]
[null,null,null,null,null,null,null,null,null,"System Defined Goals"]
[null,null,null,null,null,null,null,null,null,"Average",null,{"$f":"AVERAGE(L11:L13)","v":{"$error":"#DIV/0!"}},{"$error":"#DIV/0!"},{"$error":"#DIV/0!"},{"$error":"#DIV/0!"},{"$error":"#DIV/0!"},{"$error":"#DIV/0!"},{"$error":"#DIV/0!"},{"$error":"#DIV/0!"},{"$error":"#DIV/0!"},{"$error":"#DIV/0!"},{"$error":"#DIV/0!"},{"$error":"#DIV/0!"},{"$error":"#DIV/0!"},{"$error":"#DIV/0!"},{"$error":"#DIV/0!"},{"$error":"#DIV/0!"},{"$error":"#DIV/0!"}]
[null,null,null,null,null,null,null,null,null,"Minimum",null,{"$f":"MIN(L11:L13)","v":0},0,0,0,0,0,0,0,0,0,0,0,0,0,0,0,0]
[null,null,null,null,null,null,null,null,null,"Maximum",null,{"$f":"MAX(L11:L13)","v":0},0,0,0,0,0,0,0,0,0,0,0,0,0,0,0,0]
[null,null,null,null,null,null,"M & Y","Q & Y",null,null,null,null,null,null,null,null,null,null,null,null,null,null,null,null,null,null,null,null,"Provide comments below useful for data interpretation (e.g., flushing conducted in sample area, sample visibly red/brown after flush period)."]
[null,{"$f":"IF(L12,K12,)","v":"00:00:00"},{"$f":"IF(L12,1,IF(M12,1,))","v":0},{"$f":"MONTH(K12)","v":1},{"$f":"INT((MONTH(K12)-1)/3)+1","v":1},{"$f":"YEAR(K12)","v":1900},{"$f":"\"M\"&D12&\" \"&F12","v":"M1 1900"},{"$f":"\"Q\"&E12&\" \"&F12","v":"Q1 1900"},{"$f":"IF(R12<>\"\",IF(OR(R12=0,R12<0.2),1,\"\"),\"\")","v":""},{"$f":"J5","v":"Site 8"},null,null,null,null,{"$f":"IF(L12,IF(N12,N12/L12,\"\"),\"\")","v":""},null,null,null,null,{"$f":"IF(R12,IF(S12,S12-R12,\"\"),\"\")","v":""},null,null,null,null,null,null,null,null,null,null,null,null,{"$f":"IF($L$7,$L$7,\"\")","v":""},{"$f":"IF($M$7,$M$7,\"\")","v":""},{"$f":"IF($N$7,$N$7,\"\")","v":""},null,null,{"$f":"IF($Q$7,$Q$7,\"\")","v":""},{"$f":"IF($R$7,$R$7,\"\")","v":""},{"$f":"IF($S$7,$S$7,\"\")","v":""},null,{"$f":"IF($U$7,$U$7,\"\")","v":""},{"$f":"IF($V$7,$V$7,\"\")","v":""},{"$f":"IF($W$7,$W$7,\"\")","v":""},{"$f":"IF($X$7,$X$7,\"\")","v":""},{"$f":"IF($Y$7,$Y$7,\"\")","v":""},{"$f":"IF($Z$7,$Z$7,\"\")","v":""},{"$f":"IF($AA$7,$AA$7,\"\")","v":""},{"$f":"IF($AB$7,$AB$7,\"\")","v":""}]
[{"$f":"MAX(K11:K13)","v":"00:00:00"}]

{"sheet":"Site 7","index":30,"n_rows":13,"n_cols":49,"rows_kept":13,"cut":false,"hidden":true,"merged":[]}
[]
[null,null,null,null,null,null,null,null,null,"                               Discrete Sample DBP Trends",null,null,null,null,"DBP LRAA Trends (recent 8 quarters)",null,null,null,null,null,"Discrete Sample Cl2 Residual, pH, and Temperature Trends",null,null,null,null,null,null,"Monthly Cl2 Residual Trends"]
[]
[]
[null,null,null,null,null,null,null,null,null,{"$f":"IF(Main!C15=\"\",\"\",Main!C15)","v":"Site 7"},null,{"$f":"IF(Main!F15=\"\",\"\",Main!F15)","v":""},null,null,null,"Enter Y if DBP Compliance Site    →",null,null,null,null,"Columns below can be modified for system specific paramters",null,null,null,null,null,null,null,null,null,null,null,"Charting Goals"]
[null,"Check Date","First TTHM Date","Month","Quarter","Year","M & Y","Q & Y","Cl2 Count",null,"Date","TTHM ppb","HAA5 ppb","THM Plus ppb","THM+ Ratio","Temp. C","pH units","Free Cl2 ppm","Total Cl2 ppm","Delta Cl2",null,null,null,null,null,null,null,null,null,null,null,null,"TTHM ppb","HAA5 ppb","THM Plus ppb","THM+ Ratio","Temp. C","pH units","Free Cl2 ppm","Total Cl2 ppm","Delta Cl2","Turbidity NTU","UV254 cm-1"]
[null,null,null,null,null,null,null,null,null,"System Defined Goals"]
[null,null,null,null,null,null,null,null,null,"Average",null,{"$f":"AVERAGE(L11:L13)","v":{"$error":"#DIV/0!"}},{"$error":"#DIV/0!"},{"$error":"#DIV/0!"},{"$error":"#DIV/0!"},{"$error":"#DIV/0!"},{"$error":"#DIV/0!"},{"$error":"#DIV/0!"},{"$error":"#DIV/0!"},{"$error":"#DIV/0!"},{"$error":"#DIV/0!"},{"$error":"#DIV/0!"},{"$error":"#DIV/0!"},{"$error":"#DIV/0!"},{"$error":"#DIV/0!"},{"$error":"#DIV/0!"},{"$error":"#DIV/0!"},{"$error":"#DIV/0!"}]
[null,null,null,null,null,null,null,null,null,"Minimum",null,{"$f":"MIN(L11:L13)","v":0},0,0,0,0,0,0,0,0,0,0,0,0,0,0,0,0]
[null,null,null,null,null,null,null,null,null,"Maximum",null,{"$f":"MAX(L11:L13)","v":0},0,0,0,0,0,0,0,0,0,0,0,0,0,0,0,0]
[null,null,null,null,null,null,"M & Y","Q & Y",null,null,null,null,null,null,null,null,null,null,null,null,null,null,null,null,null,null,null,null,"Provide comments below useful for data interpretation (e.g., flushing conducted in sample area, sample visibly red/brown after flush period)."]
[null,{"$f":"IF(L12,K12,)","v":"00:00:00"},{"$f":"IF(L12,1,IF(M12,1,))","v":0},{"$f":"MONTH(K12)","v":1},{"$f":"INT((MONTH(K12)-1)/3)+1","v":1},{"$f":"YEAR(K12)","v":1900},{"$f":"\"M\"&D12&\" \"&F12","v":"M1 1900"},{"$f":"\"Q\"&E12&\" \"&F12","v":"Q1 1900"},{"$f":"IF(R12<>\"\",IF(OR(R12=0,R12<0.2),1,\"\"),\"\")","v":""},{"$f":"J5","v":"Site 7"},null,null,null,null,{"$f":"IF(L12,IF(N12,N12/L12,\"\"),\"\")","v":""},null,null,null,null,{"$f":"IF(R12,IF(S12,S12-R12,\"\"),\"\")","v":""},null,null,null,null,null,null,null,null,null,null,null,null,{"$f":"IF($L$7,$L$7,\"\")","v":""},{"$f":"IF($M$7,$M$7,\"\")","v":""},{"$f":"IF($N$7,$N$7,\"\")","v":""},null,null,{"$f":"IF($Q$7,$Q$7,\"\")","v":""},{"$f":"IF($R$7,$R$7,\"\")","v":""},{"$f":"IF($S$7,$S$7,\"\")","v":""},null,{"$f":"IF($U$7,$U$7,\"\")","v":""},{"$f":"IF($V$7,$V$7,\"\")","v":""},{"$f":"IF($W$7,$W$7,\"\")","v":""},{"$f":"IF($X$7,$X$7,\"\")","v":""},{"$f":"IF($Y$7,$Y$7,\"\")","v":""},{"$f":"IF($Z$7,$Z$7,\"\")","v":""},{"$f":"IF($AA$7,$AA$7,\"\")","v":""},{"$f":"IF($AB$7,$AB$7,\"\")","v":""}]
[{"$f":"MAX(K11:K13)","v":"00:00:00"}]

{"sheet":"Site 6","index":31,"n_rows":13,"n_cols":49,"rows_kept":13,"cut":false,"hidden":true,"merged":[]}
[]
[null,null,null,null,null,null,null,null,null,"                               Discrete Sample DBP Trends",null,null,null,null,"DBP LRAA Trends (recent 8 quarters)",null,null,null,null,null,"Discrete Sample Cl2 Residual, pH, and Temperature Trends",null,null,null,null,null,null,"Monthly Cl2 Residual Trends"]
[]
[]
[null,null,null,null,null,null,null,null,null,{"$f":"IF(Main!C14=\"\",\"\",Main!C14)","v":"Site 6"},null,{"$f":"IF(Main!F14=\"\",\"\",Main!F14)","v":""},null,null,null,"Enter Y if DBP Compliance Site    →",null,null,null,null,"Columns below can be modified for system specific paramters",null,null,null,null,null,null,null,null,null,null,null,"Charting Goals"]
[null,"Check Date","First TTHM Date","Month","Quarter","Year","M & Y","Q & Y","Cl2 Count",null,"Date","TTHM ppb","HAA5 ppb","THM Plus ppb","THM+ Ratio","Temp. C","pH units","Free Cl2 ppm","Total Cl2 ppm","Delta Cl2",null,null,null,null,null,null,null,null,null,null,null,null,"TTHM ppb","HAA5 ppb","THM Plus ppb","THM+ Ratio","Temp. C","pH units","Free Cl2 ppm","Total Cl2 ppm","Delta Cl2","Turbidity NTU","UV254 cm-1"]
[null,null,null,null,null,null,null,null,null,"System Defined Goals"]
[null,null,null,null,null,null,null,null,null,"Average",null,{"$f":"AVERAGE(L11:L13)","v":{"$error":"#DIV/0!"}},{"$error":"#DIV/0!"},{"$error":"#DIV/0!"},{"$error":"#DIV/0!"},{"$error":"#DIV/0!"},{"$error":"#DIV/0!"},{"$error":"#DIV/0!"},{"$error":"#DIV/0!"},{"$error":"#DIV/0!"},{"$error":"#DIV/0!"},{"$error":"#DIV/0!"},{"$error":"#DIV/0!"},{"$error":"#DIV/0!"},{"$error":"#DIV/0!"},{"$error":"#DIV/0!"},{"$error":"#DIV/0!"},{"$error":"#DIV/0!"}]
[null,null,null,null,null,null,null,null,null,"Minimum",null,{"$f":"MIN(L11:L13)","v":0},0,0,0,0,0,0,0,0,0,0,0,0,0,0,0,0]
[null,null,null,null,null,null,null,null,null,"Maximum",null,{"$f":"MAX(L11:L13)","v":0},0,0,0,0,0,0,0,0,0,0,0,0,0,0,0,0]
[null,null,null,null,null,null,"M & Y","Q & Y",null,null,null,null,null,null,null,null,null,null,null,null,null,null,null,null,null,null,null,null,"Provide comments below useful for data interpretation (e.g., flushing conducted in sample area, sample visibly red/brown after flush period)."]
[null,{"$f":"IF(L12,K12,)","v":"00:00:00"},{"$f":"IF(L12,1,IF(M12,1,))","v":0},{"$f":"MONTH(K12)","v":1},{"$f":"INT((MONTH(K12)-1)/3)+1","v":1},{"$f":"YEAR(K12)","v":1900},{"$f":"\"M\"&D12&\" \"&F12","v":"M1 1900"},{"$f":"\"Q\"&E12&\" \"&F12","v":"Q1 1900"},{"$f":"IF(R12<>\"\",IF(OR(R12=0,R12<0.2),1,\"\"),\"\")","v":""},{"$f":"J5","v":"Site 6"},null,null,null,null,{"$f":"IF(L12,IF(N12,N12/L12,\"\"),\"\")","v":""},null,null,null,null,{"$f":"IF(R12,IF(S12,S12-R12,\"\"),\"\")","v":""},null,null,null,null,null,null,null,null,null,null,null,null,{"$f":"IF($L$7,$L$7,\"\")","v":""},{"$f":"IF($M$7,$M$7,\"\")","v":""},{"$f":"IF($N$7,$N$7,\"\")","v":""},null,null,{"$f":"IF($Q$7,$Q$7,\"\")","v":""},{"$f":"IF($R$7,$R$7,\"\")","v":""},{"$f":"IF($S$7,$S$7,\"\")","v":""},null,{"$f":"IF($U$7,$U$7,\"\")","v":""},{"$f":"IF($V$7,$V$7,\"\")","v":""},{"$f":"IF($W$7,$W$7,\"\")","v":""},{"$f":"IF($X$7,$X$7,\"\")","v":""},{"$f":"IF($Y$7,$Y$7,\"\")","v":""},{"$f":"IF($Z$7,$Z$7,\"\")","v":""},{"$f":"IF($AA$7,$AA$7,\"\")","v":""},{"$f":"IF($AB$7,$AB$7,\"\")","v":""}]
[{"$f":"MAX(K11:K13)","v":"00:00:00"}]

{"sheet":"Site 5","index":32,"n_rows":13,"n_cols":49,"rows_kept":13,"cut":false,"hidden":true,"merged":[]}
[]
[null,null,null,null,null,null,null,null,null,"                               Discrete Sample DBP Trends",null,null,null,null,"DBP LRAA Trends (recent 8 quarters)",null,null,null,null,null,"Discrete Sample Cl2 Residual, pH, and Temperature Trends",null,null,null,null,null,null,"Monthly Cl2 Residual Trends"]
[]
[]
[null,null,null,null,null,null,null,null,null,{"$f":"IF(Main!C13=\"\",\"\",Main!C13)","v":"Site 5"},null,{"$f":"IF(Main!F13=\"\",\"\",Main!F13)","v":""},null,null,null,"Enter Y if DBP Compliance Site    →",null,null,null,null,"Columns below can be modified for system specific paramters",null,null,null,null,null,null,null,null,null,null,null,"Charting Goals"]
[null,"Check Date","First TTHM Date","Month","Quarter","Year","M & Y","Q & Y","Cl2 Count",null,"Date","TTHM ppb","HAA5 ppb","THM Plus ppb","THM+ Ratio","Temp. C","pH units","Free Cl2 ppm","Total Cl2 ppm","Delta Cl2",null,null,null,null,null,null,null,null,null,null,null,null,"TTHM ppb","HAA5 ppb","THM Plus ppb","THM+ Ratio","Temp. C","pH units","Free Cl2 ppm","Total Cl2 ppm","Delta Cl2","Turbidity NTU","UV254 cm-1"]
[null,null,null,null,null,null,null,null,null,"System Defined Goals"]
[null,null,null,null,null,null,null,null,null,"Average",null,{"$f":"AVERAGE(L11:L13)","v":{"$error":"#DIV/0!"}},{"$error":"#DIV/0!"},{"$error":"#DIV/0!"},{"$error":"#DIV/0!"},{"$error":"#DIV/0!"},{"$error":"#DIV/0!"},{"$error":"#DIV/0!"},{"$error":"#DIV/0!"},{"$error":"#DIV/0!"},{"$error":"#DIV/0!"},{"$error":"#DIV/0!"},{"$error":"#DIV/0!"},{"$error":"#DIV/0!"},{"$error":"#DIV/0!"},{"$error":"#DIV/0!"},{"$error":"#DIV/0!"},{"$error":"#DIV/0!"}]
[null,null,null,null,null,null,null,null,null,"Minimum",null,{"$f":"MIN(L11:L13)","v":0},0,0,0,0,0,0,0,0,0,0,0,0,0,0,0,0]
[null,null,null,null,null,null,null,null,null,"Maximum",null,{"$f":"MAX(L11:L13)","v":0},0,0,0,0,0,0,0,0,0,0,0,0,0,0,0,0]
[null,null,null,null,null,null,"M & Y","Q & Y",null,null,null,null,null,null,null,null,null,null,null,null,null,null,null,null,null,null,null,null,"Provide comments below useful for data interpretation (e.g., flushing conducted in sample area, sample visibly red/brown after flush period)."]
[null,{"$f":"IF(L12,K12,)","v":"00:00:00"},{"$f":"IF(L12,1,IF(M12,1,))","v":0},{"$f":"MONTH(K12)","v":1},{"$f":"INT((MONTH(K12)-1)/3)+1","v":1},{"$f":"YEAR(K12)","v":1900},{"$f":"\"M\"&D12&\" \"&F12","v":"M1 1900"},{"$f":"\"Q\"&E12&\" \"&F12","v":"Q1 1900"},{"$f":"IF(R12<>\"\",IF(OR(R12=0,R12<0.2),1,\"\"),\"\")","v":""},{"$f":"J5","v":"Site 5"},null,null,null,null,{"$f":"IF(L12,IF(N12,N12/L12,\"\"),\"\")","v":""},null,null,null,null,{"$f":"IF(R12,IF(S12,S12-R12,\"\"),\"\")","v":""},null,null,null,null,null,null,null,null,null,null,null,null,{"$f":"IF($L$7,$L$7,\"\")","v":""},{"$f":"IF($M$7,$M$7,\"\")","v":""},{"$f":"IF($N$7,$N$7,\"\")","v":""},null,null,{"$f":"IF($Q$7,$Q$7,\"\")","v":""},{"$f":"IF($R$7,$R$7,\"\")","v":""},{"$f":"IF($S$7,$S$7,\"\")","v":""},null,{"$f":"IF($U$7,$U$7,\"\")","v":""},{"$f":"IF($V$7,$V$7,\"\")","v":""},{"$f":"IF($W$7,$W$7,\"\")","v":""},{"$f":"IF($X$7,$X$7,\"\")","v":""},{"$f":"IF($Y$7,$Y$7,\"\")","v":""},{"$f":"IF($Z$7,$Z$7,\"\")","v":""},{"$f":"IF($AA$7,$AA$7,\"\")","v":""},{"$f":"IF($AB$7,$AB$7,\"\")","v":""}]
[{"$f":"MAX(K11:K13)","v":"00:00:00"}]

{"sheet":"Site 4","index":33,"n_rows":13,"n_cols":49,"rows_kept":13,"cut":false,"hidden":true,"merged":[]}
[]
[null,null,null,null,null,null,null,null,null,"                               Discrete Sample DBP Trends",null,null,null,null,"DBP LRAA Trends (recent 8 quarters)",null,null,null,null,null,"Discrete Sample Cl2 Residual, pH, and Temperature Trends",null,null,null,null,null,null,"Monthly Cl2 Residual Trends"]
[]
[]
[null,null,null,null,null,null,null,null,null,{"$f":"IF(Main!C12=\"\",\"\",Main!C12)","v":"Site 4"},null,{"$f":"IF(Main!F12=\"\",\"\",Main!F12)","v":""},null,null,null,"Enter Y if DBP Compliance Site    →",null,null,null,null,null,null,null,null,null,null,null,null,null,null,null,null,"Charting Goals"]
[null,"Check Date","First TTHM Date","Month","Quarter","Year","M & Y","Q & Y","Cl2 Count",null,"Date","TTHM ppb","HAA5 ppb","THM Plus ppb","THM+ Ratio","Temp. C","pH units","Free Cl2 ppm","Total Cl2 ppm","Delta Cl2",null,null,null,null,null,null,null,null,null,null,null,null,"TTHM ppb","HAA5 ppb","THM Plus ppb","THM+ Ratio","Temp. C","pH units","Free Cl2 ppm","Total Cl2 ppm","Delta Cl2","Turbidity NTU","UV254 cm-1"]
[null,null,null,null,null,null,null,null,null,"System Defined Goals"]
[null,null,null,null,null,null,null,null,null,"Average",null,{"$f":"AVERAGE(L11:L13)","v":{"$error":"#DIV/0!"}},{"$error":"#DIV/0!"},{"$error":"#DIV/0!"},{"$error":"#DIV/0!"},{"$error":"#DIV/0!"},{"$error":"#DIV/0!"},{"$error":"#DIV/0!"},{"$error":"#DIV/0!"},{"$error":"#DIV/0!"},{"$error":"#DIV/0!"},{"$error":"#DIV/0!"},{"$error":"#DIV/0!"},{"$error":"#DIV/0!"},{"$error":"#DIV/0!"},{"$error":"#DIV/0!"},{"$error":"#DIV/0!"},{"$error":"#DIV/0!"}]
[null,null,null,null,null,null,null,null,null,"Minimum",null,{"$f":"MIN(L11:L13)","v":0},0,0,0,0,0,0,0,0,0,0,0,0,0,0,0,0]
[null,null,null,null,null,null,null,null,null,"Maximum",null,{"$f":"MAX(L11:L13)","v":0},0,0,0,0,0,0,0,0,0,0,0,0,0,0,0,0]
[null,null,null,null,null,null,"M & Y","Q & Y",null,null,null,null,null,null,null,null,null,null,null,null,null,null,null,null,null,null,null,null,"Provide comments below useful for data interpretation (e.g., flushing conducted in sample area, sample visibly red/brown after flush period)."]
[null,{"$f":"IF(L12,K12,)","v":"00:00:00"},{"$f":"IF(L12,1,IF(M12,1,))","v":0},{"$f":"MONTH(K12)","v":1},{"$f":"INT((MONTH(K12)-1)/3)+1","v":1},{"$f":"YEAR(K12)","v":1900},{"$f":"\"M\"&D12&\" \"&F12","v":"M1 1900"},{"$f":"\"Q\"&E12&\" \"&F12","v":"Q1 1900"},{"$f":"IF(R12<>\"\",IF(OR(R12=0,R12<0.2),1,\"\"),\"\")","v":""},{"$f":"J5","v":"Site 4"},null,null,null,null,{"$f":"IF(L12,IF(N12,N12/L12,\"\"),\"\")","v":""},null,null,null,null,null,null,null,null,null,null,null,null,null,null,null,null,null,{"$f":"IF($L$7,$L$7,\"\")","v":""},{"$f":"IF($M$7,$M$7,\"\")","v":""},{"$f":"IF($N$7,$N$7,\"\")","v":""},null,null,{"$f":"IF($Q$7,$Q$7,\"\")","v":""},{"$f":"IF($R$7,$R$7,\"\")","v":""},{"$f":"IF($S$7,$S$7,\"\")","v":""},null,{"$f":"IF($U$7,$U$7,\"\")","v":""},{"$f":"IF($V$7,$V$7,\"\")","v":""},{"$f":"IF($W$7,$W$7,\"\")","v":""},{"$f":"IF($X$7,$X$7,\"\")","v":""},{"$f":"IF($Y$7,$Y$7,\"\")","v":""},{"$f":"IF($Z$7,$Z$7,\"\")","v":""},{"$f":"IF($AA$7,$AA$7,\"\")","v":""},{"$f":"IF($AB$7,$AB$7,\"\")","v":""}]
[{"$f":"MAX(K11:K13)","v":"00:00:00"}]

{"sheet":"Site 3","index":34,"n_rows":13,"n_cols":49,"rows_kept":13,"cut":false,"hidden":true,"merged":[]}
[]
[null,null,null,null,null,null,null,null,null,"                               Discrete Sample DBP Trends",null,null,null,null,"DBP LRAA Trends (recent 8 quarters)",null,null,null,null,null,"Discrete Sample Cl2 Residual, pH, and Temperature Trends",null,null,null,null,null,null,"Monthly Cl2 Residual Trends"]
[]
[]
[null,null,null,null,null,null,null,null,null,{"$f":"IF(Main!C11=\"\",\"\",Main!C11)","v":"Site 3"},null,{"$f":"IF(Main!F11=\"\",\"\",Main!F11)","v":""},null,null,null,"Enter Y if DBP Compliance Site    →",null,null,null,null,"Columns below can be modified for system specific paramters",null,null,null,null,null,null,null,null,null,null,null,"Charting Goals"]
[null,"Check Date","First TTHM Date","Month","Quarter","Year","M & Y","Q & Y","Cl2 Count",null,"Date","TTHM ppb","HAA5 ppb","THM Plus ppb","THM+ Ratio","Temp. C","pH units","Free Cl2 ppm","Total Cl2 ppm","Delta Cl2",null,null,null,null,null,null,null,null,null,null,null,null,"TTHM ppb","HAA5 ppb","THM Plus ppb","THM+ Ratio","Temp. C","pH units","Free Cl2 ppm","Total Cl2 ppm","Delta Cl2","Turbidity NTU","UV254 cm-1"]
[null,null,null,null,null,null,null,null,null,"System Defined Goals"]
[null,null,null,null,null,null,null,null,null,"Average",null,{"$f":"AVERAGE(L11:L13)","v":{"$error":"#DIV/0!"}},{"$error":"#DIV/0!"},{"$error":"#DIV/0!"},{"$error":"#DIV/0!"},{"$error":"#DIV/0!"},{"$error":"#DIV/0!"},{"$error":"#DIV/0!"},{"$error":"#DIV/0!"},{"$error":"#DIV/0!"},{"$error":"#DIV/0!"},{"$error":"#DIV/0!"},{"$error":"#DIV/0!"},{"$error":"#DIV/0!"},{"$error":"#DIV/0!"},{"$error":"#DIV/0!"},{"$error":"#DIV/0!"},{"$error":"#DIV/0!"}]
[null,null,null,null,null,null,null,null,null,"Minimum",null,{"$f":"MIN(L11:L13)","v":0},0,0,0,0,0,0,0,0,0,0,0,0,0,0,0,0]
[null,null,null,null,null,null,null,null,null,"Maximum",null,{"$f":"MAX(L11:L13)","v":0},0,0,0,0,0,0,0,0,0,0,0,0,0,0,0,0]
[null,null,null,null,null,null,"M & Y","Q & Y",null,null,null,null,null,null,null,null,null,null,null,null,null,null,null,null,null,null,null,null,"Provide comments below useful for data interpretation (e.g., flushing conducted in sample area, sample visibly red/brown after flush period)."]
[null,{"$f":"IF(L12,K12,)","v":"00:00:00"},{"$f":"IF(L12,1,IF(M12,1,))","v":0},{"$f":"MONTH(K12)","v":1},{"$f":"INT((MONTH(K12)-1)/3)+1","v":1},{"$f":"YEAR(K12)","v":1900},{"$f":"\"M\"&D12&\" \"&F12","v":"M1 1900"},{"$f":"\"Q\"&E12&\" \"&F12","v":"Q1 1900"},{"$f":"IF(R12<>\"\",IF(OR(R12=0,R12<0.2),1,\"\"),\"\")","v":""},{"$f":"J5","v":"Site 3"},null,null,null,null,{"$f":"IF(L12,IF(N12,N12/L12,\"\"),\"\")","v":""},null,null,null,null,{"$f":"IF(R12,IF(S12,S12-R12,\"\"),\"\")","v":""},null,null,null,null,null,null,null,null,null,null,null,null,{"$f":"IF($L$7,$L$7,\"\")","v":""},{"$f":"IF($M$7,$M$7,\"\")","v":""},{"$f":"IF($N$7,$N$7,\"\")","v":""},null,null,{"$f":"IF($Q$7,$Q$7,\"\")","v":""},{"$f":"IF($R$7,$R$7,\"\")","v":""},{"$f":"IF($S$7,$S$7,\"\")","v":""},null,{"$f":"IF($U$7,$U$7,\"\")","v":""},{"$f":"IF($V$7,$V$7,\"\")","v":""},{"$f":"IF($W$7,$W$7,\"\")","v":""},{"$f":"IF($X$7,$X$7,\"\")","v":""},{"$f":"IF($Y$7,$Y$7,\"\")","v":""},{"$f":"IF($Z$7,$Z$7,\"\")","v":""},{"$f":"IF($AA$7,$AA$7,\"\")","v":""},{"$f":"IF($AB$7,$AB$7,\"\")","v":""}]
[{"$f":"MAX(K11:K13)","v":"00:00:00"}]

{"sheet":"Site 2","index":35,"n_rows":13,"n_cols":49,"rows_kept":13,"cut":false,"hidden":true,"merged":[]}
[]
[null,null,null,null,null,null,null,null,null,"                               Discrete Sample DBP Trends",null,null,null,null,"DBP LRAA Trends (recent 8 quarters)",null,null,null,null,null,"Discrete Sample Cl2 Residual, pH, and Temperature Trends",null,null,null,null,null,null,"Monthly Cl2 Residual Trends"]
[]
[]
[null,null,null,null,null,null,null,null,null,{"$f":"IF(Main!C10=\"\",\"\",Main!C10)","v":"Site 2"},null,{"$f":"IF(Main!F10=\"\",\"\",Main!F10)","v":""},null,null,null,"Enter Y if DBP Compliance Site    →",null,null,null,null,"Columns below can be modified for system specific paramters",null,null,null,null,null,null,null,null,null,null,null,"Charting Goals"]
[null,"Check Date","First TTHM Date","Month","Quarter","Year","M & Y","Q & Y","Cl2 Count",null,"Date","TTHM ppb","HAA5 ppb","THM Plus ppb","THM+ Ratio","Temp. C","pH units","Free Cl2 ppm","Total Cl2 ppm","Delta Cl2",null,null,null,null,null,null,null,null,null,null,null,null,"TTHM ppb","HAA5 ppb","THM Plus ppb","THM+ Ratio","Temp. C","pH units","Free Cl2 ppm","Total Cl2 ppm","Delta Cl2","Turbidity NTU","UV254 cm-1"]
[null,null,null,null,null,null,null,null,null,"System Defined Goals"]
[null,null,null,null,null,null,null,null,null,"Average",null,{"$f":"AVERAGE(L11:L13)","v":{"$error":"#DIV/0!"}},{"$error":"#DIV/0!"},{"$error":"#DIV/0!"},{"$error":"#DIV/0!"},{"$error":"#DIV/0!"},{"$error":"#DIV/0!"},{"$error":"#DIV/0!"},{"$error":"#DIV/0!"},{"$error":"#DIV/0!"},{"$error":"#DIV/0!"},{"$error":"#DIV/0!"},{"$error":"#DIV/0!"},{"$error":"#DIV/0!"},{"$error":"#DIV/0!"},{"$error":"#DIV/0!"},{"$error":"#DIV/0!"},{"$error":"#DIV/0!"}]
[null,null,null,null,null,null,null,null,null,"Minimum",null,{"$f":"MIN(L11:L13)","v":0},0,0,0,0,0,0,0,0,0,0,0,0,0,0,0,0]
[null,null,null,null,null,null,null,null,null,"Maximum",null,{"$f":"MAX(L11:L13)","v":0},0,0,0,0,0,0,0,0,0,0,0,0,0,0,0,0]
[null,null,null,null,null,null,"M & Y","Q & Y",null,null,null,null,null,null,null,null,null,null,null,null,null,null,null,null,null,null,null,null,"Provide comments below useful for data interpretation (e.g., flushing conducted in sample area, sample visibly red/brown after flush period)."]
[null,{"$f":"IF(L12,K12,)","v":"00:00:00"},{"$f":"IF(L12,1,IF(M12,1,))","v":0},{"$f":"MONTH(K12)","v":1},{"$f":"INT((MONTH(K12)-1)/3)+1","v":1},{"$f":"YEAR(K12)","v":1900},{"$f":"\"M\"&D12&\" \"&F12","v":"M1 1900"},{"$f":"\"Q\"&E12&\" \"&F12","v":"Q1 1900"},{"$f":"IF(R12<>\"\",IF(OR(R12=0,R12<0.2),1,\"\"),\"\")","v":""},{"$f":"J5","v":"Site 2"},null,null,null,null,{"$f":"IF(L12,IF(N12,N12/L12,\"\"),\"\")","v":""},null,null,null,null,{"$f":"IF(R12,IF(S12,S12-R12,\"\"),\"\")","v":""},null,null,null,null,null,null,null,null,null,null,null,null,{"$f":"IF($L$7,$L$7,\"\")","v":""},{"$f":"IF($M$7,$M$7,\"\")","v":""},{"$f":"IF($N$7,$N$7,\"\")","v":""},null,null,{"$f":"IF($Q$7,$Q$7,\"\")","v":""},{"$f":"IF($R$7,$R$7,\"\")","v":""},{"$f":"IF($S$7,$S$7,\"\")","v":""},null,{"$f":"IF($U$7,$U$7,\"\")","v":""},{"$f":"IF($V$7,$V$7,\"\")","v":""},{"$f":"IF($W$7,$W$7,\"\")","v":""},{"$f":"IF($X$7,$X$7,\"\")","v":""},{"$f":"IF($Y$7,$Y$7,\"\")","v":""},{"$f":"IF($Z$7,$Z$7,\"\")","v":""},{"$f":"IF($AA$7,$AA$7,\"\")","v":""},{"$f":"IF($AB$7,$AB$7,\"\")","v":""}]
[{"$f":"MAX(K11:K13)","v":"00:00:00"}]

{"sheet":"Cl2 Trends","index":36,"n_rows":213,"n_cols":136,"rows_kept":213,"cut":false,"hidden":true,"merged":[]}
[]
[]
[]
[]
[]
[]
[]
[]
[]
[]
[]
[]
[]
[]
[]
[]
[]
[]
[]
[]
[]
[]
[]
[]
[]
[]
[]
[]
[]
[]
[]
[]
[]
[]
[]
[]
[]
[]
[]
[]
[]
[]
[]
[]
[]
[]
[null,"Monthly Cl2 Data for Plotting"]
["All Data",null,{"$f":"C58","v":"3795-02-01"},{"$f":"D58","v":"3795-03-01"},"3795-04-01","3795-05-01","3795-06-01","3795-07-01","3795-08-01","3795-09-01","3795-10-01","3795-11-01","3795-12-01","3796-01-01","3796-02-01","3796-03-01","3796-04-01","3796-05-01","3796-06-01","3796-07-01","3796-08-01","3796-09-01","3796-10-01","3796-11-01","3796-12-01","3797-01-01","3797-02-01","3797-03-01","3797-04-01","3797-05-01","3797-06-01","3797-07-01","3797-08-01","3797-09-01","3797-10-01","3797-11-01","3797-12-01","3798-01-01","3798-02-01","3798-03-01","3798-04-01","3798-05-01","3798-06-01","3798-07-01","3798-08-01","3798-09-01","3798-10-01","3798-11-01","3798-12-01","3799-01-01","3799-02-01","3799-03-01","3799-04-01","3799-05-01","3799-06-01","3799-07-01","3799-08-01","3799-09-01","3799-10-01","3799-11-01","3799-12-01","1900-01-01"]
[null,"Average All Sites",{"$f":"IF(ISERROR(C142),NA(),C142)","v":{"$error":"#N/A"}},{"$f":"IF(ISERROR(D142),NA(),D142)","v":{"$error":"#N/A"}},{"$error":"#N/A"},{"$error":"#N/A"},{"$error":"#N/A"},{"$error":"#N/A"},{"$error":"#N/A"},{"$error":"#N/A"},{"$error":"#N/A"},{"$error":"#N/A"},{"$error":"#N/A"},{"$error":"#N/A"},{"$error":"#N/A"},{"$error":"#N/A"},{"$error":"#N/A"},{"$error":"#N/A"},{"$error":"#N/A"},{"$error":"#N/A"},{"$error":"#N/A"},{"$error":"#N/A"},{"$error":"#N/A"},{"$error":"#N/A"},{"$error":"#N/A"},{"$error":"#N/A"},{"$error":"#N/A"},{"$error":"#N/A"},{"$error":"#N/A"},{"$error":"#N/A"},{"$error":"#N/A"},{"$error":"#N/A"},{"$error":"#N/A"},{"$error":"#N/A"},{"$error":"#N/A"},{"$error":"#N/A"},{"$error":"#N/A"},{"$error":"#N/A"},{"$error":"#N/A"},{"$error":"#N/A"},{"$error":"#N/A"},{"$error":"#N/A"},{"$error":"#N/A"},{"$error":"#N/A"},{"$error":"#N/A"},{"$error":"#N/A"},{"$error":"#N/A"},{"$error":"#N/A"},{"$error":"#N/A"},{"$error":"#N/A"},{"$error":"#N/A"},{"$error":"#N/A"},{"$error":"#N/A"},{"$error":"#N/A"},{"$error":"#N/A"},{"$error":"#N/A"},{"$error":"#N/A"},{"$error":"#N/A"},{"$error":"#N/A"},{"$error":"#N/A"},{"$error":"#N/A"},{"$error":"#N/A"}]
[null,"Minimum Site",{"$f":"IF(ISERROR(C142),NA(),C143)","v":{"$error":"#N/A"}},{"$f":"IF(ISERROR(D142),NA(),D143)","v":{"$error":"#N/A"}},{"$error":"#N/A"},{"$error":"#N/A"},{"$error":"#N/A"},{"$error":"#N/A"},{"$error":"#N/A"},{"$error":"#N/A"},{"$error":"#N/A"},{"$error":"#N/A"},{"$error":"#N/A"},{"$error":"#N/A"},{"$error":"#N/A"},{"$error":"#N/A"},{"$error":"#N/A"},{"$error":"#N/A"},{"$error":"#N/A"},{"$error":"#N/A"},{"$error":"#N/A"},{"$error":"#N/A"},{"$error":"#N/A"},{"$error":"#N/A"},{"$error":"#N/A"},{"$error":"#N/A"},{"$error":"#N/A"},{"$error":"#N/A"},{"$error":"#N/A"},{"$error":"#N/A"},{"$error":"#N/A"},{"$error":"#N/A"},{"$error":"#N/A"},{"$error":"#N/A"},{"$error":"#N/A"},{"$error":"#N/A"},{"$error":"#N/A"},{"$error":"#N/A"},{"$error":"#N/A"},{"$error":"#N/A"},{"$error":"#N/A"},{"$error":"#N/A"},{"$error":"#N/A"},{"$error":"#N/A"},{"$error":"#N/A"},{"$error":"#N/A"},{"$error":"#N/A"},{"$error":"#N/A"},{"$error":"#N/A"},{"$error":"#N/A"},{"$error":"#N/A"},{"$error":"#N/A"},{"$error":"#N/A"},{"$error":"#N/A"},{"$error":"#N/A"},{"$error":"#N/A"},{"$error":"#N/A"},{"$error":"#N/A"},{"$error":"#N/A"},{"$error":"#N/A"},{"$error":"#N/A"},{"$error":"#N/A"}]
[null,"Maximum Site",{"$f":"IF(ISERROR(C142),NA(),C144)","v":{"$error":"#N/A"}},{"$f":"IF(ISERROR(D142),NA(),D144)","v":{"$error":"#N/A"}},{"$error":"#N/A"},{"$error":"#N/A"},{"$error":"#N/A"},{"$error":"#N/A"},{"$error":"#N/A"},{"$error":"#N/A"},{"$error":"#N/A"},{"$error":"#N/A"},{"$error":"#N/A"},{"$error":"#N/A"},{"$error":"#N/A"},{"$error":"#N/A"},{"$error":"#N/A"},{"$error":"#N/A"},{"$error":"#N/A"},{"$error":"#N/A"},{"$error":"#N/A"},{"$error":"#N/A"},{"$error":"#N/A"},{"$error":"#N/A"},{"$error":"#N/A"},{"$error":"#N/A"},{"$error":"#N/A"},{"$error":"#N/A"},{"$error":"#N/A"},{"$error":"#N/A"},{"$error":"#N/A"},{"$error":"#N/A"},{"$error":"#N/A"},{"$error":"#N/A"},{"$error":"#N/A"},{"$error":"#N/A"},{"$error":"#N/A"},{"$error":"#N/A"},{"$error":"#N/A"},{"$error":"#N/A"},{"$error":"#N/A"},{"$error":"#N/A"},{"$error":"#N/A"},{"$error":"#N/A"},{"$error":"#N/A"},{"$error":"#N/A"},{"$error":"#N/A"},{"$error":"#N/A"},{"$error":"#N/A"},{"$error":"#N/A"},{"$error":"#N/A"},{"$error":"#N/A"},{"$error":"#N/A"},{"$error":"#N/A"},{"$error":"#N/A"},{"$error":"#N/A"},{"$error":"#N/A"},{"$error":"#N/A"},{"$error":"#N/A"},{"$error":"#N/A"},{"$error":"#N/A"},{"$error":"#N/A"}]
[null,"Count < 0.2"]
[]
[null,"Macro Calcs below",null,"Macro Name:  Cl2MonthData"]
[null,null,1,1,1,1,1,1,1,1,1,1,1,1,1,1,1,1,1,1,1,1,1,1,1,1,1,1,1,1,1,1,1,1,1,1,1,1,1,1,1,1,1,1,1,1,1,1,1,1,1,1,1,1,1,1,1,1,1,1,1,1,"Max Date"]
[null,null,{"$f":"IF(D56=1,12,D56-1)","v":2},{"$f":"IF(E56=1,12,E56-1)","v":3},{"$f":"IF(F56=1,12,F56-1)","v":4},{"$f":"IF(G56=1,12,G56-1)","v":5},{"$f":"IF(H56=1,12,H56-1)","v":6},7,8,9,10,11,12,1,2,3,4,5,6,7,8,9,10,11,12,{"$f":"IF(AA56=1,12,AA56-1)","v":1},2,3,4,5,6,7,8,9,10,11,{"$f":"IF(AL56=1,12,AL56-1)","v":12},1,2,3,4,5,6,7,8,9,10,11,12,1,2,3,{"$f":"IF(BB56=1,12,BB56-1)","v":4},5,6,7,8,9,10,11,12,{"$f":"MONTH(BK56)","v":1},{"$f":"MAX(BL146:BL175)","v":"00:00:00"}]
[null,null,{"$f":"IF(C56<D56,D57,D57-1)","v":1895},{"$f":"IF(D56<E56,E57,E57-1)","v":1895},{"$f":"IF(E56<F56,F57,F57-1)","v":1895},{"$f":"IF(F56<G56,G57,G57-1)","v":1895},{"$f":"IF(G56<H56,H57,H57-1)","v":1895},1895,1895,1895,1895,1895,1895,1896,1896,1896,1896,1896,1896,1896,1896,1896,1896,1896,1896,{"$f":"IF(Z56<AA56,AA57,AA57-1)","v":1897},1897,1897,1897,1897,1897,1897,1897,1897,{"$f":"IF(AI56<AJ56,AJ57,AJ57-1)","v":1897},1897,1897,1898,1898,1898,1898,1898,1898,1898,1898,1898,1898,1898,1898,1899,1899,1899,1899,{"$f":"IF(BB56<BC56,BC57,BC57-1)","v":1899},1899,1899,1899,1899,1899,1899,{"$f":"IF(BI56<BJ56,BJ57,BJ57-1)","v":1899},{"$f":"YEAR(BK56)","v":1900},null,null,null,null,null,null,null,null,null,null,null,null,null,null,null,null,null,null,null,null,null,null,null,null,null,null,null,null,null,null,null,null,null,null,null,null,null,null,null,null,null,null,null,null,null,null,null,null,null,null,null,null,null,null,null,null,null,null,null,null,null,null,null,null,null,null,null,null,null,null,"AW27:AZ35 = data table"]
[null,null,{"$f":"DATE(C57,C56,C55)","v":"3795-02-01"},"3795-03-01","3795-04-01","3795-05-01","3795-06-01","3795-07-01","3795-08-01","3795-09-01","3795-10-01","3795-11-01","3795-12-01","3796-01-01","3796-02-01","3796-03-01","3796-04-01","3796-05-01","3796-06-01","3796-07-01","3796-08-01","3796-09-01","3796-10-01","3796-11-01","3796-12-01","3797-01-01","3797-02-01","3797-03-01","3797-04-01","3797-05-01","3797-06-01","3797-07-01","3797-08-01","3797-09-01",{"$f":"DATE(AI57,AI56,AI55)","v":"3797-10-01"},"3797-11-01","3797-12-01","3798-01-01","3798-02-01","3798-03-01","3798-04-01","3798-05-01","3798-06-01","3798-07-01","3798-08-01","3798-09-01","3798-10-01","3798-11-01","3798-12-01","3799-01-01","3799-02-01","3799-03-01","3799-04-01","3799-05-01","3799-06-01","3799-07-01","3799-08-01","3799-09-01","3799-10-01","3799-11-01","3799-12-01","1900-01-01"]
[null,"Average",{"$f":"IF(ISERROR(VLOOKUP(C56&C57,$D$65:$P$134,13,FALSE)),NA(),VLOOKUP(C56&C57,$D$65:$P$134,13,FALSE))","v":{"$error":"#N/A"}},{"$f":"IF(ISERROR(VLOOKUP(D56&D57,$D$65:$P$134,13,FALSE)),NA(),VLOOKUP(D56&D57,$D$65:$P$134,13,FALSE))","v":{"$error":"#N/A"}},{"$error":"#N/A"},{"$error":"#N/A"},{"$error":"#N/A"},{"$error":"#N/A"},{"$error":"#N/A"},{"$error":"#N/A"},{"$error":"#N/A"},{"$error":"#N/A"},{"$error":"#N/A"},{"$error":"#N/A"},{"$error":"#N/A"},{"$error":"#N/A"},{"$error":"#N/A"},{"$error":"#N/A"},{"$error":"#N/A"},{"$error":"#N/A"},{"$error":"#N/A"},{"$error":"#N/A"},{"$error":"#N/A"},{"$error":"#N/A"},{"$error":"#N/A"},{"$error":"#N/A"},{"$error":"#N/A"},{"$error":"#N/A"},{"$error":"#N/A"},{"$error":"#N/A"},{"$error":"#N/A"},{"$error":"#N/A"},{"$error":"#N/A"},{"$error":"#N/A"},{"$error":"#N/A"},{"$error":"#N/A"},{"$error":"#N/A"},{"$error":"#N/A"},{"$error":"#N/A"},{"$error":"#N/A"},{"$error":"#N/A"},{"$error":"#N/A"},{"$error":"#N/A"},{"$error":"#N/A"},{"$error":"#N/A"},{"$error":"#N/A"},{"$error":"#N/A"},{"$error":"#N/A"},{"$error":"#N/A"},{"$error":"#N/A"},{"$error":"#N/A"},{"$error":"#N/A"},{"$error":"#N/A"},{"$error":"#N/A"},{"$error":"#N/A"},{"$error":"#N/A"},{"$error":"#N/A"},{"$error":"#N/A"},{"$error":"#N/A"},{"$error":"#N/A"},{"$error":"#N/A"},{"$error":"#N/A"},null,null,null,null,null,null,null,null,null,null,null,null,null,null,null,null,null,null,null,null,null,null,null,null,null,null,null,null,null,null,null,null,null,null,null,null,null,null,null,null,null,null,null,null,null,null,null,null,null,null,null,null,null,null,null,null,null,null,null,null,null,null,null,null,null,null,null,null,null,null,"F2 = lookup value = 34377007"]
[null,"Maximum",{"$f":"IF(ISERROR(VLOOKUP(C56&C57,$T$65:$AF$134,13,FALSE)),\"\",VLOOKUP(C56&C57,$T$65:$AF$134,13,FALSE))","v":""},{"$f":"IF(ISERROR(VLOOKUP(D56&D57,$T$65:$AF$134,13,FALSE)),\"\",VLOOKUP(D56&D57,$T$65:$AF$134,13,FALSE))","v":""},"","","","","","","","","","","","","","","","","","","","","","","","","","","","","","","","","","","","","","","","","","","","","","","","","","","","","","","","","","",null,null,null,null,null,null,null,null,null,null,null,null,null,null,null,null,null,null,null,null,null,null,null,null,null,null,null,null,null,null,null,null,null,null,null,null,null,null,null,null,null,null,null,null,null,null,null,null,null,null,null,null,null,null,null,null,null,null,null,null,null,null,null,null,null,null,null,null,null,null,"G2 = instance number = 2"]
[null,"Minimum",{"$f":"IF(ISERROR(VLOOKUP(C56&C57,$AJ$65:$AV$134,13,FALSE)),\"\",VLOOKUP(C56&C57,$AJ$65:$AV$134,13,FALSE))","v":""},{"$f":"IF(ISERROR(VLOOKUP(D56&D57,$AJ$65:$AV$134,13,FALSE)),\"\",VLOOKUP(D56&D57,$AJ$65:$AV$134,13,FALSE))","v":""},"","","","","","","","","","","","","","","","","","","","","","","","","","","","","","","","","","","","","","","","","","","","","","","","","","","","","","","","","",""]
[null,"Count < 0.2",{"$f":"IF(ISERROR(VLOOKUP(C56&C57,$AZ$65:$BL$134,4,FALSE)),\"\",VLOOKUP(C56&C57,$AZ$65:$BL$134,4,FALSE))","v":""},"","","","","","","","","","","","","","",{"$f":"IF(ISERROR(VLOOKUP(R56&R57,$AZ$65:$BL$134,4,FALSE)),\"\",VLOOKUP(R56&R57,$AZ$65:$BL$134,4,FALSE))","v":""},"","","","","","","","","","","","","","","","","","","","","","","","","","","","","","","","","","","",{"$f":"IF(ISERROR(VLOOKUP(BB56&BB57,$AZ$65:$BL$134,4,FALSE)),\"\",VLOOKUP(BB56&BB57,$AZ$65:$BL$134,4,FALSE))","v":""},"","","","","","","",0,null,null,null,null,null,null,null,null,null,null,null,null,null,null,null,null,null,null,null,null,null,null,null,null,null,null,null,null,null,null,null,null,null,null,null,null,null,null,null,null,null,null,null,null,null,null,null,null,null,null,null,null,null,null,null,null,null,null,null,null,null,null,null,null,null,null,null,null,null,null,{"$f":"INDEX(EF69:EF77,MATCH(EC66,EC69:EC77,0)+EC67-1)","v":4758766}]
[null,null,null,null,"Chlorine Average Table",null,null,null,null,null,null,null,null,null,null,null,null,null,null,null,"Chlorine Max Table (currently not used)",null,null,null,null,null,null,null,null,null,null,null,null,null,null,null,"Chlorine Min Table (currently not used)",null,null,null,null,null,null,null,null,null,null,null,null,null,"Chlorine Count < .2 Table"]
[null,null,null,"Identifier","M & Y","Q & Y","Cl2 Count",null,"Date","TTHM ppb","HAA5 ppb","THM Plus ppb","THM+ Ratio","Temp. C","pH units","Free Cl2 ppm",null,null,null,"Identifier","M & Y","Q & Y","Cl2 Count",null,"Date","TTHM ppb","HAA5 ppb","THM Plus ppb","THM+ Ratio","Temp. C","pH units","Free Cl2 ppm",null,null,null,"Identifier","M & Y","Q & Y","Cl2 Count",null,"Date","TTHM ppb","HAA5 ppb","THM Plus ppb","THM+ Ratio","Temp. C","pH units","Free Cl2 ppm",null,null,null,"Identifier","M & Y","Q & Y","Cl2 Count",null,"Date","TTHM ppb","HAA5 ppb","THM Plus ppb","THM+ Ratio","Temp. C","pH units","Free Cl2 ppm",null,null,null,null,null,null,null,null,null,null,null,null,null,null,null,null,null,null,null,null,null,null,null,null,null,null,null,null,null,null,null,null,null,null,null,null,null,null,null,null,null,null,null,null,null,null,null,null,null,null,null,null,null,null,null,null,null,null,null,null,null,null,null,null,null,null,null,null,"Result = 5313312"]
[1,null,null,{"$f":"IF(LEN(E65)=15,RIGHT(LEFT(E65,2),1)&RIGHT(LEFT(E65,7),4),RIGHT(LEFT(E65,3),2)&RIGHT(LEFT(E65,8),4))","v":" & & Y"},"M & Y","Q & Y",null,null,null,null,null,null,null,null,null,null,"",null,null,{"$f":"IF(LEN(U65)=11,RIGHT(LEFT(U65,2),1)&RIGHT(LEFT(U65,7),4),RIGHT(LEFT(U65,3),2)&RIGHT(LEFT(U65,8),4))","v":""},null,null,null,null,null,null,null,null,null,null,null,null,null,null,null,{"$f":"IF(LEN(AK65)=11,RIGHT(LEFT(AK65,2),1)&RIGHT(LEFT(AK65,7),4),RIGHT(LEFT(AK65,3),2)&RIGHT(LEFT(AK65,8),4))","v":""},null,null,null,null,null,null,null,null,null,null,null,null,null,null,null,{"$f":"IF(LEN(BA65)=13,RIGHT(LEFT(BA65,2),1)&RIGHT(LEFT(BA65,7),4),RIGHT(LEFT(BA65,3),2)&RIGHT(LEFT(BA65,8),4))","v":" & & Y"},"M & Y","Q & Y"]
[{"$f":"A65+1","v":2},null,null,{"$f":"IF(LEN(E66)=15,RIGHT(LEFT(E66,2),1)&RIGHT(LEFT(E66,7),4),RIGHT(LEFT(E66,3),2)&RIGHT(LEFT(E66,8),4))","v":"11900"},"M1 1900 Average",null,null,null,null,null,null,null,null,null,null,{"$error":"#DIV/0!"},null,null,null,{"$f":"IF(LEN(U66)=11,RIGHT(LEFT(U66,2),1)&RIGHT(LEFT(U66,7),4),RIGHT(LEFT(U66,3),2)&RIGHT(LEFT(U66,8),4))","v":""},null,null,null,null,null,null,null,null,null,null,null,null,null,null,null,{"$f":"IF(LEN(AK66)=11,RIGHT(LEFT(AK66,2),1)&RIGHT(LEFT(AK66,7),4),RIGHT(LEFT(AK66,3),2)&RIGHT(LEFT(AK66,8),4))","v":""},null,null,null,null,null,null,null,null,null,null,null,null,null,null,null,{"$f":"IF(LEN(BA66)=13,RIGHT(LEFT(BA66,2),1)&RIGHT(LEFT(BA66,7),4),RIGHT(LEFT(BA66,3),2)&RIGHT(LEFT(BA66,8),4))","v":"11900"},"M1 1900 Total",null,0,null,null,null,null,null,null,null,null,null,null,null,null,null,null,null,null,null,null,null,null,null,null,null,null,null,null,null,null,null,null,null,null,null,null,null,null,null,null,null,null,null,null,null,null,null,null,null,null,null,null,null,null,null,null,null,null,null,null,null,null,null,null,null,null,null,null,null,null,null,null,null,null,null,null,null,null,null,34377007]
[{"$f":"A66+1","v":3},null,null,{"$f":"IF(LEN(E67)=15,RIGHT(LEFT(E67,2),1)&RIGHT(LEFT(E67,7),4),RIGHT(LEFT(E67,3),2)&RIGHT(LEFT(E67,8),4))","v":"rad Av"},"Grand Average",null,null,null,null,null,null,null,null,null,null,{"$error":"#DIV/0!"},null,null,null,{"$f":"IF(LEN(U67)=11,RIGHT(LEFT(U67,2),1)&RIGHT(LEFT(U67,7),4),RIGHT(LEFT(U67,3),2)&RIGHT(LEFT(U67,8),4))","v":""},null,null,null,null,null,null,null,null,null,null,null,null,null,null,null,"",null,null,null,null,null,null,null,null,null,null,null,null,null,null,null,"rad To","Grand Total",null,0,null,null,null,null,null,null,null,null,null,null,null,null,null,null,null,null,null,null,null,null,null,null,null,null,null,null,null,null,null,null,null,null,null,null,null,null,null,null,null,null,null,null,null,null,null,null,null,null,null,null,null,null,null,null,null,null,null,null,null,null,null,null,null,null,null,null,null,null,null,null,null,null,null,null,null,null,null,3]
[4,null,null,"",null,null,null,null,null,null,null,null,null,null,null,null,null,null,null,"",null,null,null,null,null,null,null,null,null,null,null,null,null,null,null,"",null,null,null,null,null,null,null,null,null,null,null,null,null,null,null,""]
[5,null,null,"",null,null,null,null,null,null,null,null,null,null,null,null,null,null,null,"",null,null,null,null,null,null,null,null,null,null,null,null,null,null,null,"",null,null,null,null,null,null,null,null,null,null,null,null,null,null,null,"",null,null,null,null,null,null,null,null,null,null,null,null,null,null,null,null,null,null,null,null,null,null,null,null,null,null,null,null,null,null,null,null,null,null,null,null,null,null,null,null,null,null,null,null,null,null,null,null,null,null,null,null,null,null,null,null,null,null,null,null,null,null,null,null,null,null,null,null,null,null,null,null,null,null,null,null,null,null,null,null,36134008,"R","AA","Z34116-1"]
[6,null,null,"",null,null,null,null,null,null,null,null,null,null,null,null,null,null,null,"",null,null,null,null,null,null,null,null,null,null,null,null,null,null,null,"",null,null,null,null,null,null,null,null,null,null,null,null,null,null,null,"",null,null,null,null,null,null,null,null,null,null,null,null,null,null,null,null,null,null,null,null,null,null,null,null,null,null,null,null,null,null,null,null,null,null,null,null,null,null,null,null,null,null,null,null,null,null,null,null,null,null,null,null,null,null,null,null,null,null,null,null,null,null,null,null,null,null,null,null,null,null,null,null,null,null,null,null,null,null,null,null,36153004,"R","AA","Z33021-1"]
[7,null,null,"",null,null,null,null,null,null,null,null,null,null,null,null,null,null,null,"",null,null,null,null,null,null,null,null,null,null,null,null,null,null,null,"",null,null,null,null,null,null,null,null,null,null,null,null,null,null,null,"",null,null,null,null,null,null,null,null,null,null,null,null,null,null,null,null,null,null,null,null,null,null,null,null,null,null,null,null,null,null,null,null,null,null,null,null,null,null,null,null,null,null,null,null,null,null,null,null,null,null,null,null,null,null,null,null,null,null,null,null,null,null,null,null,null,null,null,null,null,null,null,null,null,null,null,null,null,null,null,null,34377007,"P","AA","Z28031-1"]
[8,null,null,"",null,null,null,null,null,null,null,null,null,null,null,null,null,null,null,"",null,null,null,null,null,null,null,null,null,null,null,null,null,null,null,"",null,null,null,null,null,null,null,null,null,null,null,null,null,null,null,"",null,null,null,null,null,null,null,null,null,null,null,null,null,null,null,null,null,null,null,null,null,null,null,null,null,null,null,null,null,null,null,null,null,null,null,null,null,null,null,null,null,null,null,null,null,null,null,null,null,null,null,null,null,null,null,null,null,null,null,null,null,null,null,null,null,null,null,null,null,null,null,null,null,null,null,null,null,null,null,null,"34377007 P ZZ 5313312","P","ZZ",5313312]
[9,null,null,"",null,null,null,null,null,null,null,null,null,null,null,null,null,null,null,"",null,null,null,null,null,null,null,null,null,null,null,null,null,null,null,"",null,null,null,null,null,null,null,null,null,null,null,null,null,null,null,"",null,null,null,null,null,null,null,null,null,null,null,null,null,null,null,null,null,null,null,null,null,null,null,null,null,null,null,null,null,null,null,null,null,null,null,null,null,null,null,null,null,null,null,null,null,null,null,null,null,null,null,null,null,null,null,null,null,null,null,null,null,null,null,null,null,null,null,null,null,null,null,null,null,null,null,null,null,null,null,null,"34377007 P ZZ 4758766","P","ZZ",4758766]
[10,null,null,"",null,null,null,null,null,null,null,null,null,null,null,null,null,null,null,"",null,null,null,null,null,null,null,null,null,null,null,null,null,null,null,"",null,null,null,null,null,null,null,null,null,null,null,null,null,null,null,"",null,null,null,null,null,null,null,null,null,null,null,null,null,null,null,null,null,null,null,null,null,null,null,null,null,null,null,null,null,null,null,null,null,null,null,null,null,null,null,null,null,null,null,null,null,null,null,null,null,null,null,null,null,null,null,null,null,null,null,null,null,null,null,null,null,null,null,null,null,null,null,null,null,null,null,null,null,null,null,null,"36321027 P AA Z00000-1","P","AA","Z00000-1"]
[11,null,null,"",null,null,null,null,null,null,null,null,null,null,null,null,null,null,null,"",null,null,null,null,null,null,null,null,null,null,null,null,null,null,null,"",null,null,null,null,null,null,null,null,null,null,null,null,null,null,null,"",null,null,null,null,null,null,null,null,null,null,null,null,null,null,null,null,null,null,null,null,null,null,null,null,null,null,null,null,null,null,null,null,null,null,null,null,null,null,null,null,null,null,null,null,null,null,null,null,null,null,null,null,null,null,null,null,null,null,null,null,null,null,null,null,null,null,null,null,null,null,null,null,null,null,null,null,null,null,null,null,"36321027 P AA Z30918-1","P","AA","Z30918-1"]
[12,null,null,"",null,null,null,null,null,null,null,null,null,null,null,null,null,null,null,"",null,null,null,null,null,null,null,null,null,null,null,null,null,null,null,"",null,null,null,null,null,null,null,null,null,null,null,null,null,null,null,"",null,null,null,null,null,null,null,null,null,null,null,null,null,null,null,null,null,null,null,null,null,null,null,null,null,null,null,null,null,null,null,null,null,null,null,null,null,null,null,null,null,null,null,null,null,null,null,null,null,null,null,null,null,null,null,null,null,null,null,null,null,null,null,null,null,null,null,null,null,null,null,null,null,null,null,null,null,null,null,null,"36416003 P AA X32118-1","P","AA","X32118-1"]
[13,null,null,"",null,null,null,null,null,null,null,null,null,null,null,null,null,null,null,"",null,null,null,null,null,null,null,null,null,null,null,null,null,null,null,"",null,null,null,null,null,null,null,null,null,null,null,null,null,null,null,"",null,null,null,null,null,null,null,null,null,null,null,null,null,null,null,null,null,null,null,null,null,null,null,null,null,null,null,null,null,null,null,null,null,null,null,null,null,null,null,null,null,null,null,null,null,null,null,null,null,null,null,null,null,null,null,null,null,null,null,null,null,null,null,null,null,null,null,null,null,null,null,null,null,null,null,null,null,null,null,null,"36421026 P ZZ 2394200","P","ZZ",2394200]
[14,null,null,"",null,null,null,null,null,null,null,null,null,null,null,null,null,null,null,"",null,null,null,null,null,null,null,null,null,null,null,null,null,null,null,"",null,null,null,null,null,null,null,null,null,null,null,null,null,null,null,""]
[15,null,null,"",null,null,null,null,null,null,null,null,null,null,null,null,null,null,null,"",null,null,null,null,null,null,null,null,null,null,null,null,null,null,null,"",null,null,null,null,null,null,null,null,null,null,null,null,null,null,null,"",null,null,null,null,null,null,null,null,null,null,null,null,null,null,null,null,null,null,null,null,null,null,null,null,null,null,null,null,null,null,null,null,null,null,null,null,null,null,null,null,null,null,null,null,null,null,null,null,null,null,null,null,null,null,null,null,null,null,null,null,null,null,null,null,null,null,null,null,null,null,null,null,null,null,null,null,null,null,null,null,"Delete after formula check"]
[16,null,null,"",null,null,null,null,null,null,null,null,null,null,null,null,null,null,null,"",null,null,null,null,null,null,null,null,null,null,null,null,null,null,null,"",null,null,null,null,null,null,null,null,null,null,null,null,null,null,null,""]
[17,null,null,"",null,null,null,null,null,null,null,null,null,null,null,null,null,null,null,"",null,null,null,null,null,null,null,null,null,null,null,null,null,null,null,"",null,null,null,null,null,null,null,null,null,null,null,null,null,null,null,""]
[18,null,null,"",null,null,null,null,null,null,null,null,null,null,null,null,null,null,null,"",null,null,null,null,null,null,null,null,null,null,null,null,null,null,null,"",null,null,null,null,null,null,null,null,null,null,null,null,null,null,null,""]
[19,null,null,"",null,null,null,null,null,null,null,null,null,null,null,null,null,null,null,"",null,null,null,null,null,null,null,null,null,null,null,null,null,null,null,"",null,null,null,null,null,null,null,null,null,null,null,null,null,null,null,""]
[20,null,null,"",null,null,null,null,null,null,null,null,null,null,null,null,null,null,null,"",null,null,null,null,null,null,null,null,null,null,null,null,null,null,null,"",null,null,null,null,null,null,null,null,null,null,null,null,null,null,null,""]
[21,null,null,"",null,null,null,null,null,null,null,null,null,null,null,null,null,null,null,"",null,null,null,null,null,null,null,null,null,null,null,null,null,null,null,"",null,null,null,null,null,null,null,null,null,null,null,null,null,null,null,""]
[22,null,null,"",null,null,null,null,null,null,null,null,null,null,null,null,null,null,null,"",null,null,null,null,null,null,null,null,null,null,null,null,null,null,null,"",null,null,null,null,null,null,null,null,null,null,null,null,null,null,null,""]
[23,null,null,"",null,null,null,null,null,null,null,null,null,null,null,null,null,null,null,"",null,null,null,null,null,null,null,null,null,null,null,null,null,null,null,"",null,null,null,null,null,null,null,null,null,null,null,null,null,null,null,""]
[24,null,null,"",null,null,null,null,null,null,null,null,null,null,null,null,null,null,null,"",null,null,null,null,null,null,null,null,null,null,null,null,null,null,null,"",null,null,null,null,null,null,null,null,null,null,null,null,null,null,null,""]
[25,null,null,"",null,null,null,null,null,null,null,null,null,null,null,null,null,null,null,"",null,null,null,null,null,null,null,null,null,null,null,null,null,null,null,"",null,null,null,null,null,null,null,null,null,null,null,null,null,null,null,""]
[26,null,null,"",null,null,null,null,null,null,null,null,null,null,null,null,null,null,null,"",null,null,null,null,null,null,null,null,null,null,null,null,null,null,null,"",null,null,null,null,null,null,null,null,null,null,null,null,null,null,null,""]
[27,null,null,"",null,null,null,null,null,null,null,null,null,null,null,null,null,null,null,"",null,null,null,null,null,null,null,null,null,null,null,null,null,null,null,"",null,null,null,null,null,null,null,null,null,null,null,null,null,null,null,""]
[28,null,null,"",null,null,null,null,null,null,null,null,null,null,null,null,null,null,null,"",null,null,null,null,null,null,null,null,null,null,null,null,null,null,null,"",null,null,null,null,null,null,null,null,null,null,null,null,null,null,null,""]
[29,null,null,"",null,null,null,null,null,null,null,null,null,null,null,null,null,null,null,"",null,null,null,null,null,null,null,null,null,null,null,null,null,null,null,"",null,null,null,null,null,null,null,null,null,null,null,null,null,null,null,""]
[30,null,null,"",null,null,null,null,null,null,null,null,null,null,null,null,null,null,null,"",null,null,null,null,null,null,null,null,null,null,null,null,null,null,null,"",null,null,null,null,null,null,null,null,null,null,null,null,null,null,null,""]
[31,null,null,"",null,null,null,null,null,null,null,null,null,null,null,null,null,null,null,"",null,null,null,null,null,null,null,null,null,null,null,null,null,null,null,"",null,null,null,null,null,null,null,null,null,null,null,null,null,null,null,""]
[32,null,null,"",null,null,null,null,null,null,null,null,null,null,null,null,null,null,null,"",null,null,null,null,null,null,null,null,null,null,null,null,null,null,null,"",null,null,null,null,null,null,null,null,null,null,null,null,null,null,null,""]
[33,null,null,"",null,null,null,null,null,null,null,null,null,null,null,null,null,null,null,"",null,null,null,null,null,null,null,null,null,null,null,null,null,null,null,"",null,null,null,null,null,null,null,null,null,null,null,null,null,null,null,""]
[34,null,null,"",null,null,null,null,null,null,null,null,null,null,null,null,null,null,null,"",null,null,null,null,null,null,null,null,null,null,null,null,null,null,null,"",null,null,null,null,null,null,null,null,null,null,null,null,null,null,null,""]
[35,null,null,"",null,null,null,null,null,null,null,null,null,null,null,null,null,null,null,"",null,null,null,null,null,null,null,null,null,null,null,null,null,null,null,"",null,null,null,null,null,null,null,null,null,null,null,null,null,null,null,""]
[36,null,null,"",null,null,null,null,null,null,null,null,null,null,null,null,null,null,null,"",null,null,null,null,null,null,null,null,null,null,null,null,null,null,null,"",null,null,null,null,null,null,null,null,null,null,null,null,null,null,null,""]
[37,null,null,"",null,null,null,null,null,null,null,null,null,null,null,null,null,null,null,"",null,null,null,null,null,null,null,null,null,null,null,null,null,null,null,"",null,null,null,null,null,null,null,null,null,null,null,null,null,null,null,""]
[38,null,null,"",null,null,null,null,null,null,null,null,null,null,null,null,null,null,null,"",null,null,null,null,null,null,null,null,null,null,null,null,null,null,null,"",null,null,null,null,null,null,null,null,null,null,null,null,null,null,null,""]
[39,null,null,"",null,null,null,null,null,null,null,null,null,null,null,null,null,null,null,"",null,null,null,null,null,null,null,null,null,null,null,null,null,null,null,"",null,null,null,null,null,null,null,null,null,null,null,null,null,null,null,""]
[40,null,null,"",null,null,null,null,null,null,null,null,null,null,null,null,null,null,null,"",null,null,null,null,null,null,null,null,null,null,null,null,null,null,null,"",null,null,null,null,null,null,null,null,null,null,null,null,null,null,null,""]
[41,null,null,"",null,null,null,null,null,null,null,null,null,null,null,null,null,null,null,"",null,null,null,null,null,null,null,null,null,null,null,null,null,null,null,"",null,null,null,null,null,null,null,null,null,null,null,null,null,null,null,""]
[42,null,null,"",null,null,null,null,null,null,null,null,null,null,null,null,null,null,null,"",null,null,null,null,null,null,null,null,null,null,null,null,null,null,null,"",null,null,null,null,null,null,null,null,null,null,null,null,null,null,null,""]
[43,null,null,"",null,null,null,null,null,null,null,null,null,null,null,null,null,null,null,"",null,null,null,null,null,null,null,null,null,null,null,null,null,null,null,"",null,null,null,null,null,null,null,null,null,null,null,null,null,null,null,""]
[44,null,null,"",null,null,null,null,null,null,null,null,null,null,null,null,null,null,null,"",null,null,null,null,null,null,null,null,null,null,null,null,null,null,null,"",null,null,null,null,null,null,null,null,null,null,null,null,null,null,null,""]
[45,null,null,"",null,null,null,null,null,null,null,null,null,null,null,null,null,null,null,"",null,null,null,null,null,null,null,null,null,null,null,null,null,null,null,"",null,null,null,null,null,null,null,null,null,null,null,null,null,null,null,""]
[46,null,null,"",null,null,null,null,null,null,null,null,null,null,null,null,null,null,null,"",null,null,null,null,null,null,null,null,null,null,null,null,null,null,null,"",null,null,null,null,null,null,null,null,null,null,null,null,null,null,null,""]
[47,null,null,"",null,null,null,null,null,null,null,null,null,null,null,null,null,null,null,"",null,null,null,null,null,null,null,null,null,null,null,null,null,null,null,"",null,null,null,null,null,null,null,null,null,null,null,null,null,null,null,""]
[48,null,null,"",null,null,null,null,null,null,null,null,null,null,null,null,null,null,null,"",null,null,null,null,null,null,null,null,null,null,null,null,null,null,null,"",null,null,null,null,null,null,null,null,null,null,null,null,null,null,null,""]
[49,null,null,"",null,null,null,null,null,null,null,null,null,null,null,null,null,null,null,"",null,null,null,null,null,null,null,null,null,null,null,null,null,null,null,"",null,null,null,null,null,null,null,null,null,null,null,null,null,null,null,""]
[50,null,null,"",null,null,null,null,null,null,null,null,null,null,null,null,null,null,null,"",null,null,null,null,null,null,null,null,null,null,null,null,null,null,null,"",null,null,null,null,null,null,null,null,null,null,null,null,null,null,null,""]
[51,null,null,"",null,null,null,null,null,null,null,null,null,null,null,null,null,null,null,"",null,null,null,null,null,null,null,null,null,null,null,null,null,null,null,"",null,null,null,null,null,null,null,null,null,null,null,null,null,null,null,""]
[52,null,null,"",null,null,null,null,null,null,null,null,null,null,null,null,null,null,null,"",null,null,null,null,null,null,null,null,null,null,null,null,null,null,null,"",null,null,null,null,null,null,null,null,null,null,null,null,null,null,null,""]
[53,null,null,"",null,null,null,null,null,null,null,null,null,null,null,null,null,null,null,"",null,null,null,null,null,null,null,null,null,null,null,null,null,null,null,"",null,null,null,null,null,null,null,null,null,null,null,null,null,null,null,""]
[54,null,null,"",null,null,null,null,null,null,null,null,null,null,null,null,null,null,null,"",null,null,null,null,null,null,null,null,null,null,null,null,null,null,null,"",null,null,null,null,null,null,null,null,null,null,null,null,null,null,null,""]
[55,null,null,"",null,null,null,null,null,null,null,null,null,null,null,null,null,null,null,"",null,null,null,null,null,null,null,null,null,null,null,null,null,null,null,"",null,null,null,null,null,null,null,null,null,null,null,null,null,null,null,""]
[56,null,null,"",null,null,null,null,null,null,null,null,null,null,null,null,null,null,null,"",null,null,null,null,null,null,null,null,null,null,null,null,null,null,null,"",null,null,null,null,null,null,null,null,null,null,null,null,null,null,null,""]
[57,null,null,"",null,null,null,null,null,null,null,null,null,null,null,null,null,null,null,"",null,null,null,null,null,null,null,null,null,null,null,null,null,null,null,"",null,null,null,null,null,null,null,null,null,null,null,null,null,null,null,""]
[58,null,null,"",null,null,null,null,null,null,null,null,null,null,null,null,null,null,null,"",null,null,null,null,null,null,null,null,null,null,null,null,null,null,null,"",null,null,null,null,null,null,null,null,null,null,null,null,null,null,null,""]
[59,null,null,"",null,null,null,null,null,null,null,null,null,null,null,null,null,null,null,"",null,null,null,null,null,null,null,null,null,null,null,null,null,null,null,"",null,null,null,null,null,null,null,null,null,null,null,null,null,null,null,""]
[60,null,null,"",null,null,null,null,null,null,null,null,null,null,null,null,null,null,null,"",null,null,null,null,null,null,null,null,null,null,null,null,null,null,null,"",null,null,null,null,null,null,null,null,null,null,null,null,null,null,null,""]
[61,null,null,"",null,null,null,null,null,null,null,null,null,null,null,null,null,null,null,"",null,null,null,null,null,null,null,null,null,null,null,null,null,null,null,"",null,null,null,null,null,null,null,null,null,null,null,null,null,null,null,""]
[62,null,null,"",null,null,null,null,null,null,null,null,null,null,null,null,null,null,null,"",null,null,null,null,null,null,null,null,null,null,null,null,null,null,null,"",null,null,null,null,null,null,null,null,null,null,null,null,null,null,null,""]
[63,null,null,"",null,null,null,null,null,null,null,null,null,null,null,null,null,null,null,"",null,null,null,null,null,null,null,null,null,null,null,null,null,null,null,"",null,null,null,null,null,null,null,null,null,null,null,null,null,null,null,""]
[64,null,null,"",null,null,null,null,null,null,null,null,null,null,null,null,null,null,null,"",null,null,null,null,null,null,null,null,null,null,null,null,null,null,null,"",null,null,null,null,null,null,null,null,null,null,null,null,null,null,null,""]
[65,null,null,"",null,null,null,null,null,null,null,null,null,null,null,null,null,null,null,"",null,null,null,null,null,null,null,null,null,null,null,null,null,null,null,"",null,null,null,null,null,null,null,null,null,null,null,null,null,null,null,""]
[66,null,null,"",null,null,null,null,null,null,null,null,null,null,null,null,null,null,null,"",null,null,null,null,null,null,null,null,null,null,null,null,null,null,null,{"$f":"IF(LEN(AK130)=11,RIGHT(LEFT(AK130,2),1)&RIGHT(LEFT(AK130,7),4),RIGHT(LEFT(AK130,3),2)&RIGHT(LEFT(AK130,8),4))","v":""},null,null,null,null,null,null,null,null,null,null,null,null,null,null,null,{"$f":"IF(LEN(BA130)=13,RIGHT(LEFT(BA130,2),1)&RIGHT(LEFT(BA130,7),4),RIGHT(LEFT(BA130,3),2)&RIGHT(LEFT(BA130,8),4))","v":""}]
[{"$f":"A130+1","v":67},null,null,{"$f":"IF(LEN(E131)=15,RIGHT(LEFT(E131,2),1)&RIGHT(LEFT(E131,7),4),RIGHT(LEFT(E131,3),2)&RIGHT(LEFT(E131,8),4))","v":""},null,null,null,null,null,null,null,null,null,null,null,null,null,null,null,{"$f":"IF(LEN(U131)=11,RIGHT(LEFT(U131,2),1)&RIGHT(LEFT(U131,7),4),RIGHT(LEFT(U131,3),2)&RIGHT(LEFT(U131,8),4))","v":""},null,null,null,null,null,null,null,null,null,null,null,null,null,null,null,{"$f":"IF(LEN(AK131)=11,RIGHT(LEFT(AK131,2),1)&RIGHT(LEFT(AK131,7),4),RIGHT(LEFT(AK131,3),2)&RIGHT(LEFT(AK131,8),4))","v":""},null,null,null,null,null,null,null,null,null,null,null,null,null,null,null,{"$f":"IF(LEN(BA131)=13,RIGHT(LEFT(BA131,2),1)&RIGHT(LEFT(BA131,7),4),RIGHT(LEFT(BA131,3),2)&RIGHT(LEFT(BA131,8),4))","v":""}]
[{"$f":"A131+1","v":68},null,null,{"$f":"IF(LEN(E132)=15,RIGHT(LEFT(E132,2),1)&RIGHT(LEFT(E132,7),4),RIGHT(LEFT(E132,3),2)&RIGHT(LEFT(E132,8),4))","v":""},null,null,null,null,null,null,null,null,null,null,null,null,null,null,null,{"$f":"IF(LEN(U132)=11,RIGHT(LEFT(U132,2),1)&RIGHT(LEFT(U132,7),4),RIGHT(LEFT(U132,3),2)&RIGHT(LEFT(U132,8),4))","v":""},null,null,null,null,null,null,null,null,null,null,null,null,null,null,null,{"$f":"IF(LEN(AK132)=11,RIGHT(LEFT(AK132,2),1)&RIGHT(LEFT(AK132,7),4),RIGHT(LEFT(AK132,3),2)&RIGHT(LEFT(AK132,8),4))","v":""},null,null,null,null,null,null,null,null,null,null,null,null,null,null,null,{"$f":"IF(LEN(BA132)=13,RIGHT(LEFT(BA132,2),1)&RIGHT(LEFT(BA132,7),4),RIGHT(LEFT(BA132,3),2)&RIGHT(LEFT(BA132,8),4))","v":""}]
[{"$f":"A132+1","v":69},null,null,{"$f":"IF(LEN(E133)=15,RIGHT(LEFT(E133,2),1)&RIGHT(LEFT(E133,7),4),RIGHT(LEFT(E133,3),2)&RIGHT(LEFT(E133,8),4))","v":""},null,null,null,null,null,null,null,null,null,null,null,null,null,null,null,{"$f":"IF(LEN(U133)=11,RIGHT(LEFT(U133,2),1)&RIGHT(LEFT(U133,7),4),RIGHT(LEFT(U133,3),2)&RIGHT(LEFT(U133,8),4))","v":""},null,null,null,null,null,null,null,null,null,null,null,null,null,null,null,{"$f":"IF(LEN(AK133)=11,RIGHT(LEFT(AK133,2),1)&RIGHT(LEFT(AK133,7),4),RIGHT(LEFT(AK133,3),2)&RIGHT(LEFT(AK133,8),4))","v":""},null,null,null,null,null,null,null,null,null,null,null,null,null,null,null,{"$f":"IF(LEN(BA133)=13,RIGHT(LEFT(BA133,2),1)&RIGHT(LEFT(BA133,7),4),RIGHT(LEFT(BA133,3),2)&RIGHT(LEFT(BA133,8),4))","v":""}]
[{"$f":"A133+1","v":70},null,null,{"$f":"IF(LEN(E134)=15,RIGHT(LEFT(E134,2),1)&RIGHT(LEFT(E134,7),4),RIGHT(LEFT(E134,3),2)&RIGHT(LEFT(E134,8),4))","v":""},null,null,null,null,null,null,null,null,null,null,null,null,null,null,null,{"$f":"IF(LEN(U134)=11,RIGHT(LEFT(U134,2),1)&RIGHT(LEFT(U134,7),4),RIGHT(LEFT(U134,3),2)&RIGHT(LEFT(U134,8),4))","v":""},null,null,null,null,null,null,null,null,null,null,null,null,null,null,null,{"$f":"IF(LEN(AK134)=11,RIGHT(LEFT(AK134,2),1)&RIGHT(LEFT(AK134,7),4),RIGHT(LEFT(AK134,3),2)&RIGHT(LEFT(AK134,8),4))","v":""},null,null,null,null,null,null,null,null,null,null,null,null,null,null,null,{"$f":"IF(LEN(BA134)=13,RIGHT(LEFT(BA134,2),1)&RIGHT(LEFT(BA134,7),4),RIGHT(LEFT(BA134,3),2)&RIGHT(LEFT(BA134,8),4))","v":""}]
[]
[]
[]
[]
[]
[null,"Monthly average Cl2 data summarized for all sites below:"]
[]
[null,"Average All Sites",{"$f":"AVERAGE(IF(ISNUMBER(C146:C175),C146:C175))","v":{"$error":"#DIV/0!"}},{"$f":"AVERAGE(IF(ISNUMBER(D146:D175),D146:D175))","v":{"$error":"#DIV/0!"}},{"$f":"AVERAGE(IF(ISNUMBER(E146:E175),E146:E175))","v":{"$error":"#DIV/0!"}},{"$f":"AVERAGE(IF(ISNUMBER(F146:F175),F146:F175))","v":{"$error":"#DIV/0!"}},{"$f":"AVERAGE(IF(ISNUMBER(G146:G175),G146:G175))","v":{"$error":"#DIV/0!"}},{"$f":"AVERAGE(IF(ISNUMBER(H146:H175),H146:H175))","v":{"$error":"#DIV/0!"}},{"$f":"AVERAGE(IF(ISNUMBER(I146:I175),I146:I175))","v":{"$error":"#DIV/0!"}},{"$f":"AVERAGE(IF(ISNUMBER(J146:J175),J146:J175))","v":{"$error":"#DIV/0!"}},{"$f":"AVERAGE(IF(ISNUMBER(K146:K175),K146:K175))","v":{"$error":"#DIV/0!"}},{"$f":"AVERAGE(IF(ISNUMBER(L146:L175),L146:L175))","v":{"$error":"#DIV/0!"}},{"$f":"AVERAGE(IF(ISNUMBER(M146:M175),M146:M175))","v":{"$error":"#DIV/0!"}},{"$f":"AVERAGE(IF(ISNUMBER(N146:N175),N146:N175))","v":{"$error":"#DIV/0!"}},{"$f":"AVERAGE(IF(ISNUMBER(O146:O175),O146:O175))","v":{"$error":"#DIV/0!"}},{"$f":"AVERAGE(IF(ISNUMBER(P146:P175),P146:P175))","v":{"$error":"#DIV/0!"}},{"$f":"AVERAGE(IF(ISNUMBER(Q146:Q175),Q146:Q175))","v":{"$error":"#DIV/0!"}},{"$f":"AVERAGE(IF(ISNUMBER(R146:R175),R146:R175))","v":{"$error":"#DIV/0!"}},{"$f":"AVERAGE(IF(ISNUMBER(S146:S175),S146:S175))","v":{"$error":"#DIV/0!"}},{"$f":"AVERAGE(IF(ISNUMBER(T146:T175),T146:T175))","v":{"$error":"#DIV/0!"}},{"$f":"AVERAGE(IF(ISNUMBER(U146:U175),U146:U175))","v":{"$error":"#DIV/0!"}},{"$f":"AVERAGE(IF(ISNUMBER(V146:V175),V146:V175))","v":{"$error":"#DIV/0!"}},{"$f":"AVERAGE(IF(ISNUMBER(W146:W175),W146:W175))","v":{"$error":"#DIV/0!"}},{"$f":"AVERAGE(IF(ISNUMBER(X146:X175),X146:X175))","v":{"$error":"#DIV/0!"}},{"$f":"AVERAGE(IF(ISNUMBER(Y146:Y175),Y146:Y175))","v":{"$error":"#DIV/0!"}},{"$f":"AVERAGE(IF(ISNUMBER(Z146:Z175),Z146:Z175))","v":{"$error":"#DIV/0!"}},{"$f":"AVERAGE(IF(ISNUMBER(AA146:AA175),AA146:AA175))","v":{"$error":"#DIV/0!"}},{"$f":"AVERAGE(IF(ISNUMBER(AB146:AB175),AB146:AB175))","v":{"$error":"#DIV/0!"}},{"$f":"AVERAGE(IF(ISNUMBER(AC146:AC175),AC146:AC175))","v":{"$error":"#DIV/0!"}},{"$f":"AVERAGE(IF(ISNUMBER(AD146:AD175),AD146:AD175))","v":{"$error":"#DIV/0!"}},{"$f":"AVERAGE(IF(ISNUMBER(AE146:AE175),AE146:AE175))","v":{"$error":"#DIV/0!"}},{"$f":"AVERAGE(IF(ISNUMBER(AF146:AF175),AF146:AF175))","v":{"$error":"#DIV/0!"}},{"$f":"AVERAGE(IF(ISNUMBER(AG146:AG175),AG146:AG175))","v":{"$error":"#DIV/0!"}},{"$f":"AVERAGE(IF(ISNUMBER(AH146:AH175),AH146:AH175))","v":{"$error":"#DIV/0!"}},{"$f":"AVERAGE(IF(ISNUMBER(AI146:AI175),AI146:AI175))","v":{"$error":"#DIV/0!"}},{"$f":"AVERAGE(IF(ISNUMBER(AJ146:AJ175),AJ146:AJ175))","v":{"$error":"#DIV/0!"}},{"$f":"AVERAGE(IF(ISNUMBER(AK146:AK175),AK146:AK175))","v":{"$error":"#DIV/0!"}},{"$f":"AVERAGE(IF(ISNUMBER(AL146:AL175),AL146:AL175))","v":{"$error":"#DIV/0!"}},{"$f":"AVERAGE(IF(ISNUMBER(AM146:AM175),AM146:AM175))","v":{"$error":"#DIV/0!"}},{"$f":"AVERAGE(IF(ISNUMBER(AN146:AN175),AN146:AN175))","v":{"$error":"#DIV/0!"}},{"$f":"AVERAGE(IF(ISNUMBER(AO146:AO175),AO146:AO175))","v":{"$error":"#DIV/0!"}},{"$f":"AVERAGE(IF(ISNUMBER(AP146:AP175),AP146:AP175))","v":{"$error":"#DIV/0!"}},{"$f":"AVERAGE(IF(ISNUMBER(AQ146:AQ175),AQ146:AQ175))","v":{"$error":"#DIV/0!"}},{"$f":"AVERAGE(IF(ISNUMBER(AR146:AR175),AR146:AR175))","v":{"$error":"#DIV/0!"}},{"$f":"AVERAGE(IF(ISNUMBER(AS146:AS175),AS146:AS175))","v":{"$error":"#DIV/0!"}},{"$f":"AVERAGE(IF(ISNUMBER(AT146:AT175),AT146:AT175))","v":{"$error":"#DIV/0!"}},{"$f":"AVERAGE(IF(ISNUMBER(AU146:AU175),AU146:AU175))","v":{"$error":"#DIV/0!"}},{"$f":"AVERAGE(IF(ISNUMBER(AV146:AV175),AV146:AV175))","v":{"$error":"#DIV/0!"}},{"$f":"AVERAGE(IF(ISNUMBER(AW146:AW175),AW146:AW175))","v":{"$error":"#DIV/0!"}},{"$f":"AVERAGE(IF(ISNUMBER(AX146:AX175),AX146:AX175))","v":{"$error":"#DIV/0!"}},{"$f":"AVERAGE(IF(ISNUMBER(AY146:AY175),AY146:AY175))","v":{"$error":"#DIV/0!"}},{"$f":"AVERAGE(IF(ISNUMBER(AZ146:AZ175),AZ146:AZ175))","v":{"$error":"#DIV/0!"}},{"$f":"AVERAGE(IF(ISNUMBER(BA146:BA175),BA146:BA175))","v":{"$error":"#DIV/0!"}},{"$f":"AVERAGE(IF(ISNUMBER(BB146:BB175),BB146:BB175))","v":{"$error":"#DIV/0!"}},{"$f":"AVERAGE(IF(ISNUMBER(BC146:BC175),BC146:BC175))","v":{"$error":"#DIV/0!"}},{"$f":"AVERAGE(IF(ISNUMBER(BD146:BD175),BD146:BD175))","v":{"$error":"#DIV/0!"}},{"$f":"AVERAGE(IF(ISNUMBER(BE146:BE175),BE146:BE175))","v":{"$error":"#DIV/0!"}},{"$f":"AVERAGE(IF(ISNUMBER(BF146:BF175),BF146:BF175))","v":{"$error":"#DIV/0!"}},{"$f":"AVERAGE(IF(ISNUMBER(BG146:BG175),BG146:BG175))","v":{"$error":"#DIV/0!"}},{"$f":"AVERAGE(IF(ISNUMBER(BH146:BH175),BH146:BH175))","v":{"$error":"#DIV/0!"}},{"$f":"AVERAGE(IF(ISNUMBER(BI146:BI175),BI146:BI175))","v":{"$error":"#DIV/0!"}},{"$f":"AVERAGE(IF(ISNUMBER(BJ146:BJ175),BJ146:BJ175))","v":{"$error":"#DIV/0!"}}]
[null,"Minumum Site",{"$f":"MIN(IF(ISNUMBER(C146:C175),C146:C175))","v":0},{"$f":"MIN(IF(ISNUMBER(D146:D175),D146:D175))","v":0},{"$f":"MIN(IF(ISNUMBER(E146:E175),E146:E175))","v":0},{"$f":"MIN(IF(ISNUMBER(F146:F175),F146:F175))","v":0},{"$f":"MIN(IF(ISNUMBER(G146:G175),G146:G175))","v":0},{"$f":"MIN(IF(ISNUMBER(H146:H175),H146:H175))","v":0},{"$f":"MIN(IF(ISNUMBER(I146:I175),I146:I175))","v":0},{"$f":"MIN(IF(ISNUMBER(J146:J175),J146:J175))","v":0},{"$f":"MIN(IF(ISNUMBER(K146:K175),K146:K175))","v":0},{"$f":"MIN(IF(ISNUMBER(L146:L175),L146:L175))","v":0},{"$f":"MIN(IF(ISNUMBER(M146:M175),M146:M175))","v":0},{"$f":"MIN(IF(ISNUMBER(N146:N175),N146:N175))","v":0},{"$f":"MIN(IF(ISNUMBER(O146:O175),O146:O175))","v":0},{"$f":"MIN(IF(ISNUMBER(P146:P175),P146:P175))","v":0},{"$f":"MIN(IF(ISNUMBER(Q146:Q175),Q146:Q175))","v":0},{"$f":"MIN(IF(ISNUMBER(R146:R175),R146:R175))","v":0},{"$f":"MIN(IF(ISNUMBER(S146:S175),S146:S175))","v":0},{"$f":"MIN(IF(ISNUMBER(T146:T175),T146:T175))","v":0},{"$f":"MIN(IF(ISNUMBER(U146:U175),U146:U175))","v":0},{"$f":"MIN(IF(ISNUMBER(V146:V175),V146:V175))","v":0},{"$f":"MIN(IF(ISNUMBER(W146:W175),W146:W175))","v":0},{"$f":"MIN(IF(ISNUMBER(X146:X175),X146:X175))","v":0},{"$f":"MIN(IF(ISNUMBER(Y146:Y175),Y146:Y175))","v":0},{"$f":"MIN(IF(ISNUMBER(Z146:Z175),Z146:Z175))","v":0},{"$f":"MIN(IF(ISNUMBER(AA146:AA175),AA146:AA175))","v":0},{"$f":"MIN(IF(ISNUMBER(AB146:AB175),AB146:AB175))","v":0},{"$f":"MIN(IF(ISNUMBER(AC146:AC175),AC146:AC175))","v":0},{"$f":"MIN(IF(ISNUMBER(AD146:AD175),AD146:AD175))","v":0},{"$f":"MIN(IF(ISNUMBER(AE146:AE175),AE146:AE175))","v":0},{"$f":"MIN(IF(ISNUMBER(AF146:AF175),AF146:AF175))","v":0},{"$f":"MIN(IF(ISNUMBER(AG146:AG175),AG146:AG175))","v":0},{"$f":"MIN(IF(ISNUMBER(AH146:AH175),AH146:AH175))","v":0},{"$f":"MIN(IF(ISNUMBER(AI146:AI175),AI146:AI175))","v":0},{"$f":"MIN(IF(ISNUMBER(AJ146:AJ175),AJ146:AJ175))","v":0},{"$f":"MIN(IF(ISNUMBER(AK146:AK175),AK146:AK175))","v":0},{"$f":"MIN(IF(ISNUMBER(AL146:AL175),AL146:AL175))","v":0},{"$f":"MIN(IF(ISNUMBER(AM146:AM175),AM146:AM175))","v":0},{"$f":"MIN(IF(ISNUMBER(AN146:AN175),AN146:AN175))","v":0},{"$f":"MIN(IF(ISNUMBER(AO146:AO175),AO146:AO175))","v":0},{"$f":"MIN(IF(ISNUMBER(AP146:AP175),AP146:AP175))","v":0},{"$f":"MIN(IF(ISNUMBER(AQ146:AQ175),AQ146:AQ175))","v":0},{"$f":"MIN(IF(ISNUMBER(AR146:AR175),AR146:AR175))","v":0},{"$f":"MIN(IF(ISNUMBER(AS146:AS175),AS146:AS175))","v":0},{"$f":"MIN(IF(ISNUMBER(AT146:AT175),AT146:AT175))","v":0},{"$f":"MIN(IF(ISNUMBER(AU146:AU175),AU146:AU175))","v":0},{"$f":"MIN(IF(ISNUMBER(AV146:AV175),AV146:AV175))","v":0},{"$f":"MIN(IF(ISNUMBER(AW146:AW175),AW146:AW175))","v":0},{"$f":"MIN(IF(ISNUMBER(AX146:AX175),AX146:AX175))","v":0},{"$f":"MIN(IF(ISNUMBER(AY146:AY175),AY146:AY175))","v":0},{"$f":"MIN(IF(ISNUMBER(AZ146:AZ175),AZ146:AZ175))","v":0},{"$f":"MIN(IF(ISNUMBER(BA146:BA175),BA146:BA175))","v":0},{"$f":"MIN(IF(ISNUMBER(BB146:BB175),BB146:BB175))","v":0},{"$f":"MIN(IF(ISNUMBER(BC146:BC175),BC146:BC175))","v":0},{"$f":"MIN(IF(ISNUMBER(BD146:BD175),BD146:BD175))","v":0},{"$f":"MIN(IF(ISNUMBER(BE146:BE175),BE146:BE175))","v":0},{"$f":"MIN(IF(ISNUMBER(BF146:BF175),BF146:BF175))","v":0},{"$f":"MIN(IF(ISNUMBER(BG146:BG175),BG146:BG175))","v":0},{"$f":"MIN(IF(ISNUMBER(BH146:BH175),BH146:BH175))","v":0},{"$f":"MIN(IF(ISNUMBER(BI146:BI175),BI146:BI175))","v":0},{"$f":"MIN(IF(ISNUMBER(BJ146:BJ175),BJ146:BJ175))","v":0},null,null,null,"=AVERAGE(IF(ISNUMBER(AY146:BJ146),AY146:BJ146))"]
[null,"Maximum Site",{"$f":"MAX(IF(ISNUMBER(C146:C175),C146:C175))","v":0},{"$f":"MAX(IF(ISNUMBER(D146:D175),D146:D175))","v":0},{"$f":"MAX(IF(ISNUMBER(E146:E175),E146:E175))","v":0},{"$f":"MAX(IF(ISNUMBER(F146:F175),F146:F175))","v":0},{"$f":"MAX(IF(ISNUMBER(G146:G175),G146:G175))","v":0},{"$f":"MAX(IF(ISNUMBER(H146:H175),H146:H175))","v":0},{"$f":"MAX(IF(ISNUMBER(I146:I175),I146:I175))","v":0},{"$f":"MAX(IF(ISNUMBER(J146:J175),J146:J175))","v":0},{"$f":"MAX(IF(ISNUMBER(K146:K175),K146:K175))","v":0},{"$f":"MAX(IF(ISNUMBER(L146:L175),L146:L175))","v":0},{"$f":"MAX(IF(ISNUMBER(M146:M175),M146:M175))","v":0},{"$f":"MAX(IF(ISNUMBER(N146:N175),N146:N175))","v":0},{"$f":"MAX(IF(ISNUMBER(O146:O175),O146:O175))","v":0},{"$f":"MAX(IF(ISNUMBER(P146:P175),P146:P175))","v":0},{"$f":"MAX(IF(ISNUMBER(Q146:Q175),Q146:Q175))","v":0},{"$f":"MAX(IF(ISNUMBER(R146:R175),R146:R175))","v":0},{"$f":"MAX(IF(ISNUMBER(S146:S175),S146:S175))","v":0},{"$f":"MAX(IF(ISNUMBER(T146:T175),T146:T175))","v":0},{"$f":"MAX(IF(ISNUMBER(U146:U175),U146:U175))","v":0},{"$f":"MAX(IF(ISNUMBER(V146:V175),V146:V175))","v":0},{"$f":"MAX(IF(ISNUMBER(W146:W175),W146:W175))","v":0},{"$f":"MAX(IF(ISNUMBER(X146:X175),X146:X175))","v":0},{"$f":"MAX(IF(ISNUMBER(Y146:Y175),Y146:Y175))","v":0},{"$f":"MAX(IF(ISNUMBER(Z146:Z175),Z146:Z175))","v":0},{"$f":"MAX(IF(ISNUMBER(AA146:AA175),AA146:AA175))","v":0},{"$f":"MAX(IF(ISNUMBER(AB146:AB175),AB146:AB175))","v":0},{"$f":"MAX(IF(ISNUMBER(AC146:AC175),AC146:AC175))","v":0},{"$f":"MAX(IF(ISNUMBER(AD146:AD175),AD146:AD175))","v":0},{"$f":"MAX(IF(ISNUMBER(AE146:AE175),AE146:AE175))","v":0},{"$f":"MAX(IF(ISNUMBER(AF146:AF175),AF146:AF175))","v":0},{"$f":"MAX(IF(ISNUMBER(AG146:AG175),AG146:AG175))","v":0},{"$f":"MAX(IF(ISNUMBER(AH146:AH175),AH146:AH175))","v":0},{"$f":"MAX(IF(ISNUMBER(AI146:AI175),AI146:AI175))","v":0},{"$f":"MAX(IF(ISNUMBER(AJ146:AJ175),AJ146:AJ175))","v":0},{"$f":"MAX(IF(ISNUMBER(AK146:AK175),AK146:AK175))","v":0},{"$f":"MAX(IF(ISNUMBER(AL146:AL175),AL146:AL175))","v":0},{"$f":"MAX(IF(ISNUMBER(AM146:AM175),AM146:AM175))","v":0},{"$f":"MAX(IF(ISNUMBER(AN146:AN175),AN146:AN175))","v":0},{"$f":"MAX(IF(ISNUMBER(AO146:AO175),AO146:AO175))","v":0},{"$f":"MAX(IF(ISNUMBER(AP146:AP175),AP146:AP175))","v":0},{"$f":"MAX(IF(ISNUMBER(AQ146:AQ175),AQ146:AQ175))","v":0},{"$f":"MAX(IF(ISNUMBER(AR146:AR175),AR146:AR175))","v":0},{"$f":"MAX(IF(ISNUMBER(AS146:AS175),AS146:AS175))","v":0},{"$f":"MAX(IF(ISNUMBER(AT146:AT175),AT146:AT175))","v":0},{"$f":"MAX(IF(ISNUMBER(AU146:AU175),AU146:AU175))","v":0},{"$f":"MAX(IF(ISNUMBER(AV146:AV175),AV146:AV175))","v":0},{"$f":"MAX(IF(ISNUMBER(AW146:AW175),AW146:AW175))","v":0},{"$f":"MAX(IF(ISNUMBER(AX146:AX175),AX146:AX175))","v":0},{"$f":"MAX(IF(ISNUMBER(AY146:AY175),AY146:AY175))","v":0},{"$f":"MAX(IF(ISNUMBER(AZ146:AZ175),AZ146:AZ175))","v":0},{"$f":"MAX(IF(ISNUMBER(BA146:BA175),BA146:BA175))","v":0},{"$f":"MAX(IF(ISNUMBER(BB146:BB175),BB146:BB175))","v":0},{"$f":"MAX(IF(ISNUMBER(BC146:BC175),BC146:BC175))","v":0},{"$f":"MAX(IF(ISNUMBER(BD146:BD175),BD146:BD175))","v":0},{"$f":"MAX(IF(ISNUMBER(BE146:BE175),BE146:BE175))","v":0},{"$f":"MAX(IF(ISNUMBER(BF146:BF175),BF146:BF175))","v":0},{"$f":"MAX(IF(ISNUMBER(BG146:BG175),BG146:BG175))","v":0},{"$f":"MAX(IF(ISNUMBER(BH146:BH175),BH146:BH175))","v":0},{"$f":"MAX(IF(ISNUMBER(BI146:BI175),BI146:BI175))","v":0},{"$f":"MAX(IF(ISNUMBER(BJ146:BJ175),BJ146:BJ175))","v":0}]
[null,null,{"$f":"C58","v":"3795-02-01"},{"$f":"D58","v":"3795-03-01"},"3795-04-01","3795-05-01","3795-06-01","3795-07-01","3795-08-01","3795-09-01","3795-10-01","3795-11-01","3795-12-01","3796-01-01","3796-02-01","3796-03-01","3796-04-01","3796-05-01","3796-06-01","3796-07-01","3796-08-01","3796-09-01","3796-10-01","3796-11-01","3796-12-01","3797-01-01","3797-02-01","3797-03-01","3797-04-01","3797-05-01","3797-06-01","3797-07-01","3797-08-01","3797-09-01","3797-10-01","3797-11-01","3797-12-01","3798-01-01","3798-02-01","3798-03-01","3798-04-01","3798-05-01","3798-06-01","3798-07-01","3798-08-01","3798-09-01","3798-10-01","3798-11-01","3798-12-01","3799-01-01","3799-02-01","3799-03-01","3799-04-01","3799-05-01","3799-06-01","3799-07-01","3799-08-01","3799-09-01","3799-10-01","3799-11-01","3799-12-01","1900-01-01",null,"Max Date",null,"Average Cl2 last 12 months"]
["Site 1","Monthly Avg. Residual",{"$error":"#N/A"},{"$error":"#N/A"},{"$error":"#N/A"},{"$error":"#N/A"},{"$error":"#N/A"},{"$error":"#N/A"},{"$error":"#N/A"},{"$error":"#N/A"},{"$error":"#N/A"},{"$error":"#N/A"},{"$error":"#N/A"},{"$error":"#N/A"},{"$error":"#N/A"},{"$error":"#N/A"},{"$error":"#N/A"},{"$error":"#N/A"},{"$error":"#N/A"},{"$error":"#N/A"},{"$error":"#N/A"},{"$error":"#N/A"},{"$error":"#N/A"},{"$error":"#N/A"},{"$error":"#N/A"},{"$error":"#N/A"},{"$error":"#N/A"},{"$error":"#N/A"},{"$error":"#N/A"},{"$error":"#N/A"},{"$error":"#N/A"},{"$error":"#N/A"},{"$error":"#N/A"},{"$error":"#N/A"},{"$error":"#N/A"},{"$error":"#N/A"},{"$error":"#N/A"},{"$error":"#N/A"},{"$error":"#N/A"},{"$error":"#N/A"},{"$error":"#N/A"},{"$error":"#N/A"},{"$error":"#N/A"},{"$error":"#N/A"},{"$error":"#N/A"},{"$error":"#N/A"},{"$error":"#N/A"},{"$error":"#N/A"},{"$error":"#N/A"},{"$error":"#N/A"},{"$error":"#N/A"},{"$error":"#N/A"},{"$error":"#N/A"},{"$error":"#N/A"},{"$error":"#N/A"},{"$error":"#N/A"},{"$error":"#N/A"},{"$error":"#N/A"},{"$error":"#N/A"},{"$error":"#N/A"},{"$error":"#N/A"},{"$error":"#N/A"},null,{"$f":"'Site 1'!A13","v":"00:00:00"},null,{"$f":"AVERAGE(IF(ISNUMBER(AY146:BJ146),AY146:BJ146))","v":{"$error":"#DIV/0!"}}]
["Site 2","Monthly Avg. Residual",{"$error":"#N/A"},{"$error":"#N/A"},{"$error":"#N/A"},{"$error":"#N/A"},{"$error":"#N/A"},{"$error":"#N/A"},{"$error":"#N/A"},{"$error":"#N/A"},{"$error":"#N/A"},{"$error":"#N/A"},{"$error":"#N/A"},{"$error":"#N/A"},{"$error":"#N/A"},{"$error":"#N/A"},{"$error":"#N/A"},{"$error":"#N/A"},{"$error":"#N/A"},{"$error":"#N/A"},{"$error":"#N/A"},{"$error":"#N/A"},{"$error":"#N/A"},{"$error":"#N/A"},{"$error":"#N/A"},{"$error":"#N/A"},{"$error":"#N/A"},{"$error":"#N/A"},{"$error":"#N/A"},{"$error":"#N/A"},{"$error":"#N/A"},{"$error":"#N/A"},{"$error":"#N/A"},{"$error":"#N/A"},{"$error":"#N/A"},{"$error":"#N/A"},{"$error":"#N/A"},{"$error":"#N/A"},{"$error":"#N/A"},{"$error":"#N/A"},{"$error":"#N/A"},{"$error":"#N/A"},{"$error":"#N/A"},{"$error":"#N/A"},{"$error":"#N/A"},{"$error":"#N/A"},{"$error":"#N/A"},{"$error":"#N/A"},{"$error":"#N/A"},{"$error":"#N/A"},{"$error":"#N/A"},{"$error":"#N/A"},{"$error":"#N/A"},{"$error":"#N/A"},{"$error":"#N/A"},{"$error":"#N/A"},{"$error":"#N/A"},{"$error":"#N/A"},{"$error":"#N/A"},{"$error":"#N/A"},{"$error":"#N/A"},{"$error":"#N/A"},null,{"$f":"'Site 2'!A13","v":"00:00:00"},null,{"$f":"AVERAGE(IF(ISNUMBER(AY147:BJ147),AY147:BJ147))","v":{"$error":"#DIV/0!"}}]
["Site 3","Monthly Avg. Residual",{"$error":"#N/A"},{"$error":"#N/A"},{"$error":"#N/A"},{"$error":"#N/A"},{"$error":"#N/A"},{"$error":"#N/A"},{"$error":"#N/A"},{"$error":"#N/A"},{"$error":"#N/A"},{"$error":"#N/A"},{"$error":"#N/A"},{"$error":"#N/A"},{"$error":"#N/A"},{"$error":"#N/A"},{"$error":"#N/A"},{"$error":"#N/A"},{"$error":"#N/A"},{"$error":"#N/A"},{"$error":"#N/A"},{"$error":"#N/A"},{"$error":"#N/A"},{"$error":"#N/A"},{"$error":"#N/A"},{"$error":"#N/A"},{"$error":"#N/A"},{"$error":"#N/A"},{"$error":"#N/A"},{"$error":"#N/A"},{"$error":"#N/A"},{"$error":"#N/A"},{"$error":"#N/A"},{"$error":"#N/A"},{"$error":"#N/A"},{"$error":"#N/A"},{"$error":"#N/A"},{"$error":"#N/A"},{"$error":"#N/A"},{"$error":"#N/A"},{"$error":"#N/A"},{"$error":"#N/A"},{"$error":"#N/A"},{"$error":"#N/A"},{"$error":"#N/A"},{"$error":"#N/A"},{"$error":"#N/A"},{"$error":"#N/A"},{"$error":"#N/A"},{"$error":"#N/A"},{"$error":"#N/A"},{"$error":"#N/A"},{"$error":"#N/A"},{"$error":"#N/A"},{"$error":"#N/A"},{"$error":"#N/A"},{"$error":"#N/A"},{"$error":"#N/A"},{"$error":"#N/A"},{"$error":"#N/A"},{"$error":"#N/A"},{"$error":"#N/A"},null,{"$f":"'Site 3'!A13","v":"00:00:00"},null,{"$f":"AVERAGE(IF(ISNUMBER(AY148:BJ148),AY148:BJ148))","v":{"$error":"#DIV/0!"}}]
["Site 4","Monthly Avg. Residual",{"$error":"#N/A"},{"$error":"#N/A"},{"$error":"#N/A"},{"$error":"#N/A"},{"$error":"#N/A"},{"$error":"#N/A"},{"$error":"#N/A"},{"$error":"#N/A"},{"$error":"#N/A"},{"$error":"#N/A"},{"$error":"#N/A"},{"$error":"#N/A"},{"$error":"#N/A"},{"$error":"#N/A"},{"$error":"#N/A"},{"$error":"#N/A"},{"$error":"#N/A"},{"$error":"#N/A"},{"$error":"#N/A"},{"$error":"#N/A"},{"$error":"#N/A"},{"$error":"#N/A"},{"$error":"#N/A"},{"$error":"#N/A"},{"$error":"#N/A"},{"$error":"#N/A"},{"$error":"#N/A"},{"$error":"#N/A"},{"$error":"#N/A"},{"$error":"#N/A"},{"$error":"#N/A"},{"$error":"#N/A"},{"$error":"#N/A"},{"$error":"#N/A"},{"$error":"#N/A"},{"$error":"#N/A"},{"$error":"#N/A"},{"$error":"#N/A"},{"$error":"#N/A"},{"$error":"#N/A"},{"$error":"#N/A"},{"$error":"#N/A"},{"$error":"#N/A"},{"$error":"#N/A"},{"$error":"#N/A"},{"$error":"#N/A"},{"$error":"#N/A"},{"$error":"#N/A"},{"$error":"#N/A"},{"$error":"#N/A"},{"$error":"#N/A"},{"$error":"#N/A"},{"$error":"#N/A"},{"$error":"#N/A"},{"$error":"#N/A"},{"$error":"#N/A"},{"$error":"#N/A"},{"$error":"#N/A"},{"$error":"#N/A"},{"$error":"#N/A"},null,{"$f":"'Site 4'!A13","v":"00:00:00"},null,{"$f":"AVERAGE(IF(ISNUMBER(AY149:BJ149),AY149:BJ149))","v":{"$error":"#DIV/0!"}}]
["Site 5","Monthly Avg. Residual",{"$error":"#N/A"},{"$error":"#N/A"},{"$error":"#N/A"},{"$error":"#N/A"},{"$error":"#N/A"},{"$error":"#N/A"},{"$error":"#N/A"},{"$error":"#N/A"},{"$error":"#N/A"},{"$error":"#N/A"},{"$error":"#N/A"},{"$error":"#N/A"},{"$error":"#N/A"},{"$error":"#N/A"},{"$error":"#N/A"},{"$error":"#N/A"},{"$error":"#N/A"},{"$error":"#N/A"},{"$error":"#N/A"},{"$error":"#N/A"},{"$error":"#N/A"},{"$error":"#N/A"},{"$error":"#N/A"},{"$error":"#N/A"},{"$error":"#N/A"},{"$error":"#N/A"},{"$error":"#N/A"},{"$error":"#N/A"},{"$error":"#N/A"},{"$error":"#N/A"},{"$error":"#N/A"},{"$error":"#N/A"},{"$error":"#N/A"},{"$error":"#N/A"},{"$error":"#N/A"},{"$error":"#N/A"},{"$error":"#N/A"},{"$error":"#N/A"},{"$error":"#N/A"},{"$error":"#N/A"},{"$error":"#N/A"},{"$error":"#N/A"},{"$error":"#N/A"},{"$error":"#N/A"},{"$error":"#N/A"},{"$error":"#N/A"},{"$error":"#N/A"},{"$error":"#N/A"},{"$error":"#N/A"},{"$error":"#N/A"},{"$error":"#N/A"},{"$error":"#N/A"},{"$error":"#N/A"},{"$error":"#N/A"},{"$error":"#N/A"},{"$error":"#N/A"},{"$error":"#N/A"},{"$error":"#N/A"},{"$error":"#N/A"},{"$error":"#N/A"},null,{"$f":"'Site 5'!A13","v":"00:00:00"},null,{"$f":"AVERAGE(IF(ISNUMBER(AY150:BJ150),AY150:BJ150))","v":{"$error":"#DIV/0!"}}]
["Site 6","Monthly Avg. Residual",{"$error":"#N/A"},{"$error":"#N/A"},{"$error":"#N/A"},{"$error":"#N/A"},{"$error":"#N/A"},{"$error":"#N/A"},{"$error":"#N/A"},{"$error":"#N/A"},{"$error":"#N/A"},{"$error":"#N/A"},{"$error":"#N/A"},{"$error":"#N/A"},{"$error":"#N/A"},{"$error":"#N/A"},{"$error":"#N/A"},{"$error":"#N/A"},{"$error":"#N/A"},{"$error":"#N/A"},{"$error":"#N/A"},{"$error":"#N/A"},{"$error":"#N/A"},{"$error":"#N/A"},{"$error":"#N/A"},{"$error":"#N/A"},{"$error":"#N/A"},{"$error":"#N/A"},{"$error":"#N/A"},{"$error":"#N/A"},{"$error":"#N/A"},{"$error":"#N/A"},{"$error":"#N/A"},{"$error":"#N/A"},{"$error":"#N/A"},{"$error":"#N/A"},{"$error":"#N/A"},{"$error":"#N/A"},{"$error":"#N/A"},{"$error":"#N/A"},{"$error":"#N/A"},{"$error":"#N/A"},{"$error":"#N/A"},{"$error":"#N/A"},{"$error":"#N/A"},{"$error":"#N/A"},{"$error":"#N/A"},{"$error":"#N/A"},{"$error":"#N/A"},{"$error":"#N/A"},{"$error":"#N/A"},{"$error":"#N/A"},{"$error":"#N/A"},{"$error":"#N/A"},{"$error":"#N/A"},{"$error":"#N/A"},{"$error":"#N/A"},{"$error":"#N/A"},{"$error":"#N/A"},{"$error":"#N/A"},{"$error":"#N/A"},{"$error":"#N/A"},null,{"$f":"'Site 6'!A13","v":"00:00:00"},null,{"$f":"AVERAGE(IF(ISNUMBER(AY151:BJ151),AY151:BJ151))","v":{"$error":"#DIV/0!"}}]
["Site 7","Monthly Avg. Residual",{"$error":"#N/A"},{"$error":"#N/A"},{"$error":"#N/A"},{"$error":"#N/A"},{"$error":"#N/A"},{"$error":"#N/A"},{"$error":"#N/A"},{"$error":"#N/A"},{"$error":"#N/A"},{"$error":"#N/A"},{"$error":"#N/A"},{"$error":"#N/A"},{"$error":"#N/A"},{"$error":"#N/A"},{"$error":"#N/A"},{"$error":"#N/A"},{"$error":"#N/A"},{"$error":"#N/A"},{"$error":"#N/A"},{"$error":"#N/A"},{"$error":"#N/A"},{"$error":"#N/A"},{"$error":"#N/A"},{"$error":"#N/A"},{"$error":"#N/A"},{"$error":"#N/A"},{"$error":"#N/A"},{"$error":"#N/A"},{"$error":"#N/A"},{"$error":"#N/A"},{"$error":"#N/A"},{"$error":"#N/A"},{"$error":"#N/A"},{"$error":"#N/A"},{"$error":"#N/A"},{"$error":"#N/A"},{"$error":"#N/A"},{"$error":"#N/A"},{"$error":"#N/A"},{"$error":"#N/A"},{"$error":"#N/A"},{"$error":"#N/A"},{"$error":"#N/A"},{"$error":"#N/A"},{"$error":"#N/A"},{"$error":"#N/A"},{"$error":"#N/A"},{"$error":"#N/A"},{"$error":"#N/A"},{"$error":"#N/A"},{"$error":"#N/A"},{"$error":"#N/A"},{"$error":"#N/A"},{"$error":"#N/A"},{"$error":"#N/A"},{"$error":"#N/A"},{"$error":"#N/A"},{"$error":"#N/A"},{"$error":"#N/A"},{"$error":"#N/A"},null,{"$f":"'Site 7'!A13","v":"00:00:00"},null,{"$f":"AVERAGE(IF(ISNUMBER(AY152:BJ152),AY152:BJ152))","v":{"$error":"#DIV/0!"}}]
["Site 8","Monthly Avg. Residual",{"$error":"#N/A"},{"$error":"#N/A"},{"$error":"#N/A"},{"$error":"#N/A"},{"$error":"#N/A"},{"$error":"#N/A"},{"$error":"#N/A"},{"$error":"#N/A"},{"$error":"#N/A"},{"$error":"#N/A"},{"$error":"#N/A"},{"$error":"#N/A"},{"$error":"#N/A"},{"$error":"#N/A"},{"$error":"#N/A"},{"$error":"#N/A"},{"$error":"#N/A"},{"$error":"#N/A"},{"$error":"#N/A"},{"$error":"#N/A"},{"$error":"#N/A"},{"$error":"#N/A"},{"$error":"#N/A"},{"$error":"#N/A"},{"$error":"#N/A"},{"$error":"#N/A"},{"$error":"#N/A"},{"$error":"#N/A"},{"$error":"#N/A"},{"$error":"#N/A"},{"$error":"#N/A"},{"$error":"#N/A"},{"$error":"#N/A"},{"$error":"#N/A"},{"$error":"#N/A"},{"$error":"#N/A"},{"$error":"#N/A"},{"$error":"#N/A"},{"$error":"#N/A"},{"$error":"#N/A"},{"$error":"#N/A"},{"$error":"#N/A"},{"$error":"#N/A"},{"$error":"#N/A"},{"$error":"#N/A"},{"$error":"#N/A"},{"$error":"#N/A"},{"$error":"#N/A"},{"$error":"#N/A"},{"$error":"#N/A"},{"$error":"#N/A"},{"$error":"#N/A"},{"$error":"#N/A"},{"$error":"#N/A"},{"$error":"#N/A"},{"$error":"#N/A"},{"$error":"#N/A"},{"$error":"#N/A"},{"$error":"#N/A"},{"$error":"#N/A"},null,{"$f":"'Site 8'!A13","v":"00:00:00"},null,{"$f":"AVERAGE(IF(ISNUMBER(AY153:BJ153),AY153:BJ153))","v":{"$error":"#DIV/0!"}}]
["Site 9","Monthly Avg. Residual",{"$error":"#N/A"},{"$error":"#N/A"},{"$error":"#N/A"},{"$error":"#N/A"},{"$error":"#N/A"},{"$error":"#N/A"},{"$error":"#N/A"},{"$error":"#N/A"},{"$error":"#N/A"},{"$error":"#N/A"},{"$error":"#N/A"},{"$error":"#N/A"},{"$error":"#N/A"},{"$error":"#N/A"},{"$error":"#N/A"},{"$error":"#N/A"},{"$error":"#N/A"},{"$error":"#N/A"},{"$error":"#N/A"},{"$error":"#N/A"},{"$error":"#N/A"},{"$error":"#N/A"},{"$error":"#N/A"},{"$error":"#N/A"},{"$error":"#N/A"},{"$error":"#N/A"},{"$error":"#N/A"},{"$error":"#N/A"},{"$error":"#N/A"},{"$error":"#N/A"},{"$error":"#N/A"},{"$error":"#N/A"},{"$error":"#N/A"},{"$error":"#N/A"},{"$error":"#N/A"},{"$error":"#N/A"},{"$error":"#N/A"},{"$error":"#N/A"},{"$error":"#N/A"},{"$error":"#N/A"},{"$error":"#N/A"},{"$error":"#N/A"},{"$error":"#N/A"},{"$error":"#N/A"},{"$error":"#N/A"},{"$error":"#N/A"},{"$error":"#N/A"},{"$error":"#N/A"},{"$error":"#N/A"},{"$error":"#N/A"},{"$error":"#N/A"},{"$error":"#N/A"},{"$error":"#N/A"},{"$error":"#N/A"},{"$error":"#N/A"},{"$error":"#N/A"},{"$error":"#N/A"},{"$error":"#N/A"},{"$error":"#N/A"},{"$error":"#N/A"},null,{"$f":"'Site 9'!A13","v":"00:00:00"},null,{"$f":"AVERAGE(IF(ISNUMBER(AY154:BJ154),AY154:BJ154))","v":{"$error":"#DIV/0!"}}]
["Site 10","Monthly Avg. Residual",{"$error":"#N/A"},{"$error":"#N/A"},{"$error":"#N/A"},{"$error":"#N/A"},{"$error":"#N/A"},{"$error":"#N/A"},{"$error":"#N/A"},{"$error":"#N/A"},{"$error":"#N/A"},{"$error":"#N/A"},{"$error":"#N/A"},{"$error":"#N/A"},{"$error":"#N/A"},{"$error":"#N/A"},{"$error":"#N/A"},{"$error":"#N/A"},{"$error":"#N/A"},{"$error":"#N/A"},{"$error":"#N/A"},{"$error":"#N/A"},{"$error":"#N/A"},{"$error":"#N/A"},{"$error":"#N/A"},{"$error":"#N/A"},{"$error":"#N/A"},{"$error":"#N/A"},{"$error":"#N/A"},{"$error":"#N/A"},{"$error":"#N/A"},{"$error":"#N/A"},{"$error":"#N/A"},{"$error":"#N/A"},{"$error":"#N/A"},{"$error":"#N/A"},{"$error":"#N/A"},{"$error":"#N/A"},{"$error":"#N/A"},{"$error":"#N/A"},{"$error":"#N/A"},{"$error":"#N/A"},{"$error":"#N/A"},{"$error":"#N/A"},{"$error":"#N/A"},{"$error":"#N/A"},{"$error":"#N/A"},{"$error":"#N/A"},{"$error":"#N/A"},{"$error":"#N/A"},{"$error":"#N/A"},{"$error":"#N/A"},{"$error":"#N/A"},{"$error":"#N/A"},{"$error":"#N/A"},{"$error":"#N/A"},{"$error":"#N/A"},{"$error":"#N/A"},{"$error":"#N/A"},{"$error":"#N/A"},{"$error":"#N/A"},{"$error":"#N/A"},null,{"$f":"'Site 10'!A13","v":"00:00:00"},null,{"$f":"AVERAGE(IF(ISNUMBER(AY155:BJ155),AY155:BJ155))","v":{"$error":"#DIV/0!"}}]
["Site 11","Monthly Avg. Residual",{"$error":"#N/A"},{"$error":"#N/A"},{"$error":"#N/A"},{"$error":"#N/A"},{"$error":"#N/A"},{"$error":"#N/A"},{"$error":"#N/A"},{"$error":"#N/A"},{"$error":"#N/A"},{"$error":"#N/A"},{"$error":"#N/A"},{"$error":"#N/A"},{"$error":"#N/A"},{"$error":"#N/A"},{"$error":"#N/A"},{"$error":"#N/A"},{"$error":"#N/A"},{"$error":"#N/A"},{"$error":"#N/A"},{"$error":"#N/A"},{"$error":"#N/A"},{"$error":"#N/A"},{"$error":"#N/A"},{"$error":"#N/A"},{"$error":"#N/A"},{"$error":"#N/A"},{"$error":"#N/A"},{"$error":"#N/A"},{"$error":"#N/A"},{"$error":"#N/A"},{"$error":"#N/A"},{"$error":"#N/A"},{"$error":"#N/A"},{"$error":"#N/A"},{"$error":"#N/A"},{"$error":"#N/A"},{"$error":"#N/A"},{"$error":"#N/A"},{"$error":"#N/A"},{"$error":"#N/A"},{"$error":"#N/A"},{"$error":"#N/A"},{"$error":"#N/A"},{"$error":"#N/A"},{"$error":"#N/A"},{"$error":"#N/A"},{"$error":"#N/A"},{"$error":"#N/A"},{"$error":"#N/A"},{"$error":"#N/A"},{"$error":"#N/A"},{"$error":"#N/A"},{"$error":"#N/A"},{"$error":"#N/A"},{"$error":"#N/A"},{"$error":"#N/A"},{"$error":"#N/A"},{"$error":"#N/A"},{"$error":"#N/A"},{"$error":"#N/A"},null,{"$f":"'Site 11'!A13","v":"00:00:00"},null,{"$f":"AVERAGE(IF(ISNUMBER(AY156:BJ156),AY156:BJ156))","v":{"$error":"#DIV/0!"}}]
["Site 12","Monthly Avg. Residual",{"$error":"#N/A"},{"$error":"#N/A"},{"$error":"#N/A"},{"$error":"#N/A"},{"$error":"#N/A"},{"$error":"#N/A"},{"$error":"#N/A"},{"$error":"#N/A"},{"$error":"#N/A"},{"$error":"#N/A"},{"$error":"#N/A"},{"$error":"#N/A"},{"$error":"#N/A"},{"$error":"#N/A"},{"$error":"#N/A"},{"$error":"#N/A"},{"$error":"#N/A"},{"$error":"#N/A"},{"$error":"#N/A"},{"$error":"#N/A"},{"$error":"#N/A"},{"$error":"#N/A"},{"$error":"#N/A"},{"$error":"#N/A"},{"$error":"#N/A"},{"$error":"#N/A"},{"$error":"#N/A"},{"$error":"#N/A"},{"$error":"#N/A"},{"$error":"#N/A"},{"$error":"#N/A"},{"$error":"#N/A"},{"$error":"#N/A"},{"$error":"#N/A"},{"$error":"#N/A"},{"$error":"#N/A"},{"$error":"#N/A"},{"$error":"#N/A"},{"$error":"#N/A"},{"$error":"#N/A"},{"$error":"#N/A"},{"$error":"#N/A"},{"$error":"#N/A"},{"$error":"#N/A"},{"$error":"#N/A"},{"$error":"#N/A"},{"$error":"#N/A"},{"$error":"#N/A"},{"$error":"#N/A"},{"$error":"#N/A"},{"$error":"#N/A"},{"$error":"#N/A"},{"$error":"#N/A"},{"$error":"#N/A"},{"$error":"#N/A"},{"$error":"#N/A"},{"$error":"#N/A"},{"$error":"#N/A"},{"$error":"#N/A"},{"$error":"#N/A"},null,{"$f":"'Site 12'!A13","v":"00:00:00"},null,{"$f":"AVERAGE(IF(ISNUMBER(AY157:BJ157),AY157:BJ157))","v":{"$error":"#DIV/0!"}}]
["Site 13","Monthly Avg. Residual",{"$error":"#N/A"},{"$error":"#N/A"},{"$error":"#N/A"},{"$error":"#N/A"},{"$error":"#N/A"},{"$error":"#N/A"},{"$error":"#N/A"},{"$error":"#N/A"},{"$error":"#N/A"},{"$error":"#N/A"},{"$error":"#N/A"},{"$error":"#N/A"},{"$error":"#N/A"},{"$error":"#N/A"},{"$error":"#N/A"},{"$error":"#N/A"},{"$error":"#N/A"},{"$error":"#N/A"},{"$error":"#N/A"},{"$error":"#N/A"},{"$error":"#N/A"},{"$error":"#N/A"},{"$error":"#N/A"},{"$error":"#N/A"},{"$error":"#N/A"},{"$error":"#N/A"},{"$error":"#N/A"},{"$error":"#N/A"},{"$error":"#N/A"},{"$error":"#N/A"},{"$error":"#N/A"},{"$error":"#N/A"},{"$error":"#N/A"},{"$error":"#N/A"},{"$error":"#N/A"},{"$error":"#N/A"},{"$error":"#N/A"},{"$error":"#N/A"},{"$error":"#N/A"},{"$error":"#N/A"},{"$error":"#N/A"},{"$error":"#N/A"},{"$error":"#N/A"},{"$error":"#N/A"},{"$error":"#N/A"},{"$error":"#N/A"},{"$error":"#N/A"},{"$error":"#N/A"},{"$error":"#N/A"},{"$error":"#N/A"},{"$error":"#N/A"},{"$error":"#N/A"},{"$error":"#N/A"},{"$error":"#N/A"},{"$error":"#N/A"},{"$error":"#N/A"},{"$error":"#N/A"},{"$error":"#N/A"},{"$error":"#N/A"},{"$error":"#N/A"},null,{"$f":"'Site 13'!A13","v":"00:00:00"},null,{"$f":"AVERAGE(IF(ISNUMBER(AY158:BJ158),AY158:BJ158))","v":{"$error":"#DIV/0!"}}]
["Site 14","Monthly Avg. Residual",{"$error":"#N/A"},{"$error":"#N/A"},{"$error":"#N/A"},{"$error":"#N/A"},{"$error":"#N/A"},{"$error":"#N/A"},{"$error":"#N/A"},{"$error":"#N/A"},{"$error":"#N/A"},{"$error":"#N/A"},{"$error":"#N/A"},{"$error":"#N/A"},{"$error":"#N/A"},{"$error":"#N/A"},{"$error":"#N/A"},{"$error":"#N/A"},{"$error":"#N/A"},{"$error":"#N/A"},{"$error":"#N/A"},{"$error":"#N/A"},{"$error":"#N/A"},{"$error":"#N/A"},{"$error":"#N/A"},{"$error":"#N/A"},{"$error":"#N/A"},{"$error":"#N/A"},{"$error":"#N/A"},{"$error":"#N/A"},{"$error":"#N/A"},{"$error":"#N/A"},{"$error":"#N/A"},{"$error":"#N/A"},{"$error":"#N/A"},{"$error":"#N/A"},{"$error":"#N/A"},{"$error":"#N/A"},{"$error":"#N/A"},{"$error":"#N/A"},{"$error":"#N/A"},{"$error":"#N/A"},{"$error":"#N/A"},{"$error":"#N/A"},{"$error":"#N/A"},{"$error":"#N/A"},{"$error":"#N/A"},{"$error":"#N/A"},{"$error":"#N/A"},{"$error":"#N/A"},{"$error":"#N/A"},{"$error":"#N/A"},{"$error":"#N/A"},{"$error":"#N/A"},{"$error":"#N/A"},{"$error":"#N/A"},{"$error":"#N/A"},{"$error":"#N/A"},{"$error":"#N/A"},{"$error":"#N/A"},{"$error":"#N/A"},{"$error":"#N/A"},null,{"$f":"'Site 14'!A13","v":"00:00:00"},null,{"$f":"AVERAGE(IF(ISNUMBER(AY159:BJ159),AY159:BJ159))","v":{"$error":"#DIV/0!"}}]
["Site 15","Monthly Avg. Residual",{"$error":"#N/A"},{"$error":"#N/A"},{"$error":"#N/A"},{"$error":"#N/A"},{"$error":"#N/A"},{"$error":"#N/A"},{"$error":"#N/A"},{"$error":"#N/A"},{"$error":"#N/A"},{"$error":"#N/A"},{"$error":"#N/A"},{"$error":"#N/A"},{"$error":"#N/A"},{"$error":"#N/A"},{"$error":"#N/A"},{"$error":"#N/A"},{"$error":"#N/A"},{"$error":"#N/A"},{"$error":"#N/A"},{"$error":"#N/A"},{"$error":"#N/A"},{"$error":"#N/A"},{"$error":"#N/A"},{"$error":"#N/A"},{"$error":"#N/A"},{"$error":"#N/A"},{"$error":"#N/A"},{"$error":"#N/A"},{"$error":"#N/A"},{"$error":"#N/A"},{"$error":"#N/A"},{"$error":"#N/A"},{"$error":"#N/A"},{"$error":"#N/A"},{"$error":"#N/A"},{"$error":"#N/A"},{"$error":"#N/A"},{"$error":"#N/A"},{"$error":"#N/A"},{"$error":"#N/A"},{"$error":"#N/A"},{"$error":"#N/A"},{"$error":"#N/A"},{"$error":"#N/A"},{"$error":"#N/A"},{"$error":"#N/A"},{"$error":"#N/A"},{"$error":"#N/A"},{"$error":"#N/A"},{"$error":"#N/A"},{"$error":"#N/A"},{"$error":"#N/A"},{"$error":"#N/A"},{"$error":"#N/A"},{"$error":"#N/A"},{"$error":"#N/A"},{"$error":"#N/A"},{"$error":"#N/A"},{"$error":"#N/A"},{"$error":"#N/A"},null,{"$f":"'Site 15'!A13","v":"00:00:00"},null,{"$f":"AVERAGE(IF(ISNUMBER(AY160:BJ160),AY160:BJ160))","v":{"$error":"#DIV/0!"}}]
["Site 16","Monthly Avg. Residual",{"$error":"#N/A"},{"$error":"#N/A"},{"$error":"#N/A"},{"$error":"#N/A"},{"$error":"#N/A"},{"$error":"#N/A"},{"$error":"#N/A"},{"$error":"#N/A"},{"$error":"#N/A"},{"$error":"#N/A"},{"$error":"#N/A"},{"$error":"#N/A"},{"$error":"#N/A"},{"$error":"#N/A"},{"$error":"#N/A"},{"$error":"#N/A"},{"$error":"#N/A"},{"$error":"#N/A"},{"$error":"#N/A"},{"$error":"#N/A"},{"$error":"#N/A"},{"$error":"#N/A"},{"$error":"#N/A"},{"$error":"#N/A"},{"$error":"#N/A"},{"$error":"#N/A"},{"$error":"#N/A"},{"$error":"#N/A"},{"$error":"#N/A"},{"$error":"#N/A"},{"$error":"#N/A"},{"$error":"#N/A"},{"$error":"#N/A"},{"$error":"#N/A"},{"$error":"#N/A"},{"$error":"#N/A"},{"$error":"#N/A"},{"$error":"#N/A"},{"$error":"#N/A"},{"$error":"#N/A"},{"$error":"#N/A"},{"$error":"#N/A"},{"$error":"#N/A"},{"$error":"#N/A"},{"$error":"#N/A"},{"$error":"#N/A"},{"$error":"#N/A"},{"$error":"#N/A"},{"$error":"#N/A"},{"$error":"#N/A"},{"$error":"#N/A"},{"$error":"#N/A"},{"$error":"#N/A"},{"$error":"#N/A"},{"$error":"#N/A"},{"$error":"#N/A"},{"$error":"#N/A"},{"$error":"#N/A"},{"$error":"#N/A"},{"$error":"#N/A"},null,{"$f":"'Site 16'!A13","v":"00:00:00"},null,{"$f":"AVERAGE(IF(ISNUMBER(AY161:BJ161),AY161:BJ161))","v":{"$error":"#DIV/0!"}}]
["Site 17","Monthly Avg. Residual",{"$error":"#N/A"},{"$error":"#N/A"},{"$error":"#N/A"},{"$error":"#N/A"},{"$error":"#N/A"},{"$error":"#N/A"},{"$error":"#N/A"},{"$error":"#N/A"},{"$error":"#N/A"},{"$error":"#N/A"},{"$error":"#N/A"},{"$error":"#N/A"},{"$error":"#N/A"},{"$error":"#N/A"},{"$error":"#N/A"},{"$error":"#N/A"},{"$error":"#N/A"},{"$error":"#N/A"},{"$error":"#N/A"},{"$error":"#N/A"},{"$error":"#N/A"},{"$error":"#N/A"},{"$error":"#N/A"},{"$error":"#N/A"},{"$error":"#N/A"},{"$error":"#N/A"},{"$error":"#N/A"},{"$error":"#N/A"},{"$error":"#N/A"},{"$error":"#N/A"},{"$error":"#N/A"},{"$error":"#N/A"},{"$error":"#N/A"},{"$error":"#N/A"},{"$error":"#N/A"},{"$error":"#N/A"},{"$error":"#N/A"},{"$error":"#N/A"},{"$error":"#N/A"},{"$error":"#N/A"},{"$error":"#N/A"},{"$error":"#N/A"},{"$error":"#N/A"},{"$error":"#N/A"},{"$error":"#N/A"},{"$error":"#N/A"},{"$error":"#N/A"},{"$error":"#N/A"},{"$error":"#N/A"},{"$error":"#N/A"},{"$error":"#N/A"},{"$error":"#N/A"},{"$error":"#N/A"},{"$error":"#N/A"},{"$error":"#N/A"},{"$error":"#N/A"},{"$error":"#N/A"},{"$error":"#N/A"},{"$error":"#N/A"},{"$error":"#N/A"},null,{"$f":"'Site 17'!A13","v":"00:00:00"},null,{"$f":"AVERAGE(IF(ISNUMBER(AY162:BJ162),AY162:BJ162))","v":{"$error":"#DIV/0!"}}]
["Site 18","Monthly Avg. Residual",{"$error":"#N/A"},{"$error":"#N/A"},{"$error":"#N/A"},{"$error":"#N/A"},{"$error":"#N/A"},{"$error":"#N/A"},{"$error":"#N/A"},{"$error":"#N/A"},{"$error":"#N/A"},{"$error":"#N/A"},{"$error":"#N/A"},{"$error":"#N/A"},{"$error":"#N/A"},{"$error":"#N/A"},{"$error":"#N/A"},{"$error":"#N/A"},{"$error":"#N/A"},{"$error":"#N/A"},{"$error":"#N/A"},{"$error":"#N/A"},{"$error":"#N/A"},{"$error":"#N/A"},{"$error":"#N/A"},{"$error":"#N/A"},{"$error":"#N/A"},{"$error":"#N/A"},{"$error":"#N/A"},{"$error":"#N/A"},{"$error":"#N/A"},{"$error":"#N/A"},{"$error":"#N/A"},{"$error":"#N/A"},{"$error":"#N/A"},{"$error":"#N/A"},{"$error":"#N/A"},{"$error":"#N/A"},{"$error":"#N/A"},{"$error":"#N/A"},{"$error":"#N/A"},{"$error":"#N/A"},{"$error":"#N/A"},{"$error":"#N/A"},{"$error":"#N/A"},{"$error":"#N/A"},{"$error":"#N/A"},{"$error":"#N/A"},{"$error":"#N/A"},{"$error":"#N/A"},{"$error":"#N/A"},{"$error":"#N/A"},{"$error":"#N/A"},{"$error":"#N/A"},{"$error":"#N/A"},{"$error":"#N/A"},{"$error":"#N/A"},{"$error":"#N/A"},{"$error":"#N/A"},{"$error":"#N/A"},{"$error":"#N/A"},{"$error":"#N/A"},null,{"$f":"'Site 18'!A13","v":"00:00:00"},null,{"$f":"AVERAGE(IF(ISNUMBER(AY163:BJ163),AY163:BJ163))","v":{"$error":"#DIV/0!"}}]
["Site 19","Monthly Avg. Residual",{"$error":"#N/A"},{"$error":"#N/A"},{"$error":"#N/A"},{"$error":"#N/A"},{"$error":"#N/A"},{"$error":"#N/A"},{"$error":"#N/A"},{"$error":"#N/A"},{"$error":"#N/A"},{"$error":"#N/A"},{"$error":"#N/A"},{"$error":"#N/A"},{"$error":"#N/A"},{"$error":"#N/A"},{"$error":"#N/A"},{"$error":"#N/A"},{"$error":"#N/A"},{"$error":"#N/A"},{"$error":"#N/A"},{"$error":"#N/A"},{"$error":"#N/A"},{"$error":"#N/A"},{"$error":"#N/A"},{"$error":"#N/A"},{"$error":"#N/A"},{"$error":"#N/A"},{"$error":"#N/A"},{"$error":"#N/A"},{"$error":"#N/A"},{"$error":"#N/A"},{"$error":"#N/A"},{"$error":"#N/A"},{"$error":"#N/A"},{"$error":"#N/A"},{"$error":"#N/A"},{"$error":"#N/A"},{"$error":"#N/A"},{"$error":"#N/A"},{"$error":"#N/A"},{"$error":"#N/A"},{"$error":"#N/A"},{"$error":"#N/A"},{"$error":"#N/A"},{"$error":"#N/A"},{"$error":"#N/A"},{"$error":"#N/A"},{"$error":"#N/A"},{"$error":"#N/A"},{"$error":"#N/A"},{"$error":"#N/A"},{"$error":"#N/A"},{"$error":"#N/A"},{"$error":"#N/A"},{"$error":"#N/A"},{"$error":"#N/A"},{"$error":"#N/A"},{"$error":"#N/A"},{"$error":"#N/A"},{"$error":"#N/A"},{"$error":"#N/A"},null,{"$f":"'Site 19'!A13","v":"00:00:00"},null,{"$f":"AVERAGE(IF(ISNUMBER(AY164:BJ164),AY164:BJ164))","v":{"$error":"#DIV/0!"}}]
["Site 20","Monthly Avg. Residual",{"$error":"#N/A"},{"$error":"#N/A"},{"$error":"#N/A"},{"$error":"#N/A"},{"$error":"#N/A"},{"$error":"#N/A"},{"$error":"#N/A"},{"$error":"#N/A"},{"$error":"#N/A"},{"$error":"#N/A"},{"$error":"#N/A"},{"$error":"#N/A"},{"$error":"#N/A"},{"$error":"#N/A"},{"$error":"#N/A"},{"$error":"#N/A"},{"$error":"#N/A"},{"$error":"#N/A"},{"$error":"#N/A"},{"$error":"#N/A"},{"$error":"#N/A"},{"$error":"#N/A"},{"$error":"#N/A"},{"$error":"#N/A"},{"$error":"#N/A"},{"$error":"#N/A"},{"$error":"#N/A"},{"$error":"#N/A"},{"$error":"#N/A"},{"$error":"#N/A"},{"$error":"#N/A"},{"$error":"#N/A"},{"$error":"#N/A"},{"$error":"#N/A"},{"$error":"#N/A"},{"$error":"#N/A"},{"$error":"#N/A"},{"$error":"#N/A"},{"$error":"#N/A"},{"$error":"#N/A"},{"$error":"#N/A"},{"$error":"#N/A"},{"$error":"#N/A"},{"$error":"#N/A"},{"$error":"#N/A"},{"$error":"#N/A"},{"$error":"#N/A"},{"$error":"#N/A"},{"$error":"#N/A"},{"$error":"#N/A"},{"$error":"#N/A"},{"$error":"#N/A"},{"$error":"#N/A"},{"$error":"#N/A"},{"$error":"#N/A"},{"$error":"#N/A"},{"$error":"#N/A"},{"$error":"#N/A"},{"$error":"#N/A"},{"$error":"#N/A"},null,{"$f":"'Site 20'!A13","v":"00:00:00"},null,{"$f":"AVERAGE(IF(ISNUMBER(AY165:BJ165),AY165:BJ165))","v":{"$error":"#DIV/0!"}}]
["Site 21","Monthly Avg. Residual",{"$error":"#N/A"},{"$error":"#N/A"},{"$error":"#N/A"},{"$error":"#N/A"},{"$error":"#N/A"},{"$error":"#N/A"},{"$error":"#N/A"},{"$error":"#N/A"},{"$error":"#N/A"},{"$error":"#N/A"},{"$error":"#N/A"},{"$error":"#N/A"},{"$error":"#N/A"},{"$error":"#N/A"},{"$error":"#N/A"},{"$error":"#N/A"},{"$error":"#N/A"},{"$error":"#N/A"},{"$error":"#N/A"},{"$error":"#N/A"},{"$error":"#N/A"},{"$error":"#N/A"},{"$error":"#N/A"},{"$error":"#N/A"},{"$error":"#N/A"},{"$error":"#N/A"},{"$error":"#N/A"},{"$error":"#N/A"},{"$error":"#N/A"},{"$error":"#N/A"},{"$error":"#N/A"},{"$error":"#N/A"},{"$error":"#N/A"},{"$error":"#N/A"},{"$error":"#N/A"},{"$error":"#N/A"},{"$error":"#N/A"},{"$error":"#N/A"},{"$error":"#N/A"},{"$error":"#N/A"},{"$error":"#N/A"},{"$error":"#N/A"},{"$error":"#N/A"},{"$error":"#N/A"},{"$error":"#N/A"},{"$error":"#N/A"},{"$error":"#N/A"},{"$error":"#N/A"},{"$error":"#N/A"},{"$error":"#N/A"},{"$error":"#N/A"},{"$error":"#N/A"},{"$error":"#N/A"},{"$error":"#N/A"},{"$error":"#N/A"},{"$error":"#N/A"},{"$error":"#N/A"},{"$error":"#N/A"},{"$error":"#N/A"},{"$error":"#N/A"},null,{"$f":"'Site 21'!A13","v":"00:00:00"},null,{"$f":"AVERAGE(IF(ISNUMBER(AY166:BJ166),AY166:BJ166))","v":{"$error":"#DIV/0!"}}]
["Site 22","Monthly Avg. Residual",{"$error":"#N/A"},{"$error":"#N/A"},{"$error":"#N/A"},{"$error":"#N/A"},{"$error":"#N/A"},{"$error":"#N/A"},{"$error":"#N/A"},{"$error":"#N/A"},{"$error":"#N/A"},{"$error":"#N/A"},{"$error":"#N/A"},{"$error":"#N/A"},{"$error":"#N/A"},{"$error":"#N/A"},{"$error":"#N/A"},{"$error":"#N/A"},{"$error":"#N/A"},{"$error":"#N/A"},{"$error":"#N/A"},{"$error":"#N/A"},{"$error":"#N/A"},{"$error":"#N/A"},{"$error":"#N/A"},{"$error":"#N/A"},{"$error":"#N/A"},{"$error":"#N/A"},{"$error":"#N/A"},{"$error":"#N/A"},{"$error":"#N/A"},{"$error":"#N/A"},{"$error":"#N/A"},{"$error":"#N/A"},{"$error":"#N/A"},{"$error":"#N/A"},{"$error":"#N/A"},{"$error":"#N/A"},{"$error":"#N/A"},{"$error":"#N/A"},{"$error":"#N/A"},{"$error":"#N/A"},{"$error":"#N/A"},{"$error":"#N/A"},{"$error":"#N/A"},{"$error":"#N/A"},{"$error":"#N/A"},{"$error":"#N/A"},{"$error":"#N/A"},{"$error":"#N/A"},{"$error":"#N/A"},{"$error":"#N/A"},{"$error":"#N/A"},{"$error":"#N/A"},{"$error":"#N/A"},{"$error":"#N/A"},{"$error":"#N/A"},{"$error":"#N/A"},{"$error":"#N/A"},{"$error":"#N/A"},{"$error":"#N/A"},{"$error":"#N/A"},null,{"$f":"'Site 22'!A13","v":"00:00:00"},null,{"$f":"AVERAGE(IF(ISNUMBER(AY167:BJ167),AY167:BJ167))","v":{"$error":"#DIV/0!"}}]
["Site 23","Monthly Avg. Residual",{"$error":"#N/A"},{"$error":"#N/A"},{"$error":"#N/A"},{"$error":"#N/A"},{"$error":"#N/A"},{"$error":"#N/A"},{"$error":"#N/A"},{"$error":"#N/A"},{"$error":"#N/A"},{"$error":"#N/A"},{"$error":"#N/A"},{"$error":"#N/A"},{"$error":"#N/A"},{"$error":"#N/A"},{"$error":"#N/A"},{"$error":"#N/A"},{"$error":"#N/A"},{"$error":"#N/A"},{"$error":"#N/A"},{"$error":"#N/A"},{"$error":"#N/A"},{"$error":"#N/A"},{"$error":"#N/A"},{"$error":"#N/A"},{"$error":"#N/A"},{"$error":"#N/A"},{"$error":"#N/A"},{"$error":"#N/A"},{"$error":"#N/A"},{"$error":"#N/A"},{"$error":"#N/A"},{"$error":"#N/A"},{"$error":"#N/A"},{"$error":"#N/A"},{"$error":"#N/A"},{"$error":"#N/A"},{"$error":"#N/A"},{"$error":"#N/A"},{"$error":"#N/A"},{"$error":"#N/A"},{"$error":"#N/A"},{"$error":"#N/A"},{"$error":"#N/A"},{"$error":"#N/A"},{"$error":"#N/A"},{"$error":"#N/A"},{"$error":"#N/A"},{"$error":"#N/A"},{"$error":"#N/A"},{"$error":"#N/A"},{"$error":"#N/A"},{"$error":"#N/A"},{"$error":"#N/A"},{"$error":"#N/A"},{"$error":"#N/A"},{"$error":"#N/A"},{"$error":"#N/A"},{"$error":"#N/A"},{"$error":"#N/A"},{"$error":"#N/A"},null,{"$f":"'Site 23'!A13","v":"00:00:00"},null,{"$f":"AVERAGE(IF(ISNUMBER(AY168:BJ168),AY168:BJ168))","v":{"$error":"#DIV/0!"}}]
["Site 24","Monthly Avg. Residual",{"$error":"#N/A"},{"$error":"#N/A"},{"$error":"#N/A"},{"$error":"#N/A"},{"$error":"#N/A"},{"$error":"#N/A"},{"$error":"#N/A"},{"$error":"#N/A"},{"$error":"#N/A"},{"$error":"#N/A"},{"$error":"#N/A"},{"$error":"#N/A"},{"$error":"#N/A"},{"$error":"#N/A"},{"$error":"#N/A"},{"$error":"#N/A"},{"$error":"#N/A"},{"$error":"#N/A"},{"$error":"#N/A"},{"$error":"#N/A"},{"$error":"#N/A"},{"$error":"#N/A"},{"$error":"#N/A"},{"$error":"#N/A"},{"$error":"#N/A"},{"$error":"#N/A"},{"$error":"#N/A"},{"$error":"#N/A"},{"$error":"#N/A"},{"$error":"#N/A"},{"$error":"#N/A"},{"$error":"#N/A"},{"$error":"#N/A"},{"$error":"#N/A"},{"$error":"#N/A"},{"$error":"#N/A"},{"$error":"#N/A"},{"$error":"#N/A"},{"$error":"#N/A"},{"$error":"#N/A"},{"$error":"#N/A"},{"$error":"#N/A"},{"$error":"#N/A"},{"$error":"#N/A"},{"$error":"#N/A"},{"$error":"#N/A"},{"$error":"#N/A"},{"$error":"#N/A"},{"$error":"#N/A"},{"$error":"#N/A"},{"$error":"#N/A"},{"$error":"#N/A"},{"$error":"#N/A"},{"$error":"#N/A"},{"$error":"#N/A"},{"$error":"#N/A"},{"$error":"#N/A"},{"$error":"#N/A"},{"$error":"#N/A"},{"$error":"#N/A"},null,{"$f":"'Site 24'!A13","v":"00:00:00"},null,{"$f":"AVERAGE(IF(ISNUMBER(AY169:BJ169),AY169:BJ169))","v":{"$error":"#DIV/0!"}}]
["Site 25","Monthly Avg. Residual",{"$error":"#N/A"},{"$error":"#N/A"},{"$error":"#N/A"},{"$error":"#N/A"},{"$error":"#N/A"},{"$error":"#N/A"},{"$error":"#N/A"},{"$error":"#N/A"},{"$error":"#N/A"},{"$error":"#N/A"},{"$error":"#N/A"},{"$error":"#N/A"},{"$error":"#N/A"},{"$error":"#N/A"},{"$error":"#N/A"},{"$error":"#N/A"},{"$error":"#N/A"},{"$error":"#N/A"},{"$error":"#N/A"},{"$error":"#N/A"},{"$error":"#N/A"},{"$error":"#N/A"},{"$error":"#N/A"},{"$error":"#N/A"},{"$error":"#N/A"},{"$error":"#N/A"},{"$error":"#N/A"},{"$error":"#N/A"},{"$error":"#N/A"},{"$error":"#N/A"},{"$error":"#N/A"},{"$error":"#N/A"},{"$error":"#N/A"},{"$error":"#N/A"},{"$error":"#N/A"},{"$error":"#N/A"},{"$error":"#N/A"},{"$error":"#N/A"},{"$error":"#N/A"},{"$error":"#N/A"},{"$error":"#N/A"},{"$error":"#N/A"},{"$error":"#N/A"},{"$error":"#N/A"},{"$error":"#N/A"},{"$error":"#N/A"},{"$error":"#N/A"},{"$error":"#N/A"},{"$error":"#N/A"},{"$error":"#N/A"},{"$error":"#N/A"},{"$error":"#N/A"},{"$error":"#N/A"},{"$error":"#N/A"},{"$error":"#N/A"},{"$error":"#N/A"},{"$error":"#N/A"},{"$error":"#N/A"},{"$error":"#N/A"},{"$error":"#N/A"},null,{"$f":"'Site 25'!A13","v":"00:00:00"},null,{"$f":"AVERAGE(IF(ISNUMBER(AY170:BJ170),AY170:BJ170))","v":{"$error":"#DIV/0!"}}]
["Site 26","Monthly Avg. Residual",{"$error":"#N/A"},{"$error":"#N/A"},{"$error":"#N/A"},{"$error":"#N/A"},{"$error":"#N/A"},{"$error":"#N/A"},{"$error":"#N/A"},{"$error":"#N/A"},{"$error":"#N/A"},{"$error":"#N/A"},{"$error":"#N/A"},{"$error":"#N/A"},{"$error":"#N/A"},{"$error":"#N/A"},{"$error":"#N/A"},{"$error":"#N/A"},{"$error":"#N/A"},{"$error":"#N/A"},{"$error":"#N/A"},{"$error":"#N/A"},{"$error":"#N/A"},{"$error":"#N/A"},{"$error":"#N/A"},{"$error":"#N/A"},{"$error":"#N/A"},{"$error":"#N/A"},{"$error":"#N/A"},{"$error":"#N/A"},{"$error":"#N/A"},{"$error":"#N/A"},{"$error":"#N/A"},{"$error":"#N/A"},{"$error":"#N/A"},{"$error":"#N/A"},{"$error":"#N/A"},{"$error":"#N/A"},{"$error":"#N/A"},{"$error":"#N/A"},{"$error":"#N/A"},{"$error":"#N/A"},{"$error":"#N/A"},{"$error":"#N/A"},{"$error":"#N/A"},{"$error":"#N/A"},{"$error":"#N/A"},{"$error":"#N/A"},{"$error":"#N/A"},{"$error":"#N/A"},{"$error":"#N/A"},{"$error":"#N/A"},{"$error":"#N/A"},{"$error":"#N/A"},{"$error":"#N/A"},{"$error":"#N/A"},{"$error":"#N/A"},{"$error":"#N/A"},{"$error":"#N/A"},{"$error":"#N/A"},{"$error":"#N/A"},{"$error":"#N/A"},null,{"$f":"'Site 26'!A13","v":"00:00:00"},null,{"$f":"AVERAGE(IF(ISNUMBER(AY171:BJ171),AY171:BJ171))","v":{"$error":"#DIV/0!"}}]
["Site 27","Monthly Avg. Residual",{"$error":"#N/A"},{"$error":"#N/A"},{"$error":"#N/A"},{"$error":"#N/A"},{"$error":"#N/A"},{"$error":"#N/A"},{"$error":"#N/A"},{"$error":"#N/A"},{"$error":"#N/A"},{"$error":"#N/A"},{"$error":"#N/A"},{"$error":"#N/A"},{"$error":"#N/A"},{"$error":"#N/A"},{"$error":"#N/A"},{"$error":"#N/A"},{"$error":"#N/A"},{"$error":"#N/A"},{"$error":"#N/A"},{"$error":"#N/A"},{"$error":"#N/A"},{"$error":"#N/A"},{"$error":"#N/A"},{"$error":"#N/A"},{"$error":"#N/A"},{"$error":"#N/A"},{"$error":"#N/A"},{"$error":"#N/A"},{"$error":"#N/A"},{"$error":"#N/A"},{"$error":"#N/A"},{"$error":"#N/A"},{"$error":"#N/A"},{"$error":"#N/A"},{"$error":"#N/A"},{"$error":"#N/A"},{"$error":"#N/A"},{"$error":"#N/A"},{"$error":"#N/A"},{"$error":"#N/A"},{"$error":"#N/A"},{"$error":"#N/A"},{"$error":"#N/A"},{"$error":"#N/A"},{"$error":"#N/A"},{"$error":"#N/A"},{"$error":"#N/A"},{"$error":"#N/A"},{"$error":"#N/A"},{"$error":"#N/A"},{"$error":"#N/A"},{"$error":"#N/A"},{"$error":"#N/A"},{"$error":"#N/A"},{"$error":"#N/A"},{"$error":"#N/A"},{"$error":"#N/A"},{"$error":"#N/A"},{"$error":"#N/A"},{"$error":"#N/A"},null,{"$f":"'Site 27'!A13","v":"00:00:00"},null,{"$f":"AVERAGE(IF(ISNUMBER(AY172:BJ172),AY172:BJ172))","v":{"$error":"#DIV/0!"}}]
["Site 28","Monthly Avg. Residual",{"$error":"#N/A"},{"$error":"#N/A"},{"$error":"#N/A"},{"$error":"#N/A"},{"$error":"#N/A"},{"$error":"#N/A"},{"$error":"#N/A"},{"$error":"#N/A"},{"$error":"#N/A"},{"$error":"#N/A"},{"$error":"#N/A"},{"$error":"#N/A"},{"$error":"#N/A"},{"$error":"#N/A"},{"$error":"#N/A"},{"$error":"#N/A"},{"$error":"#N/A"},{"$error":"#N/A"},{"$error":"#N/A"},{"$error":"#N/A"},{"$error":"#N/A"},{"$error":"#N/A"},{"$error":"#N/A"},{"$error":"#N/A"},{"$error":"#N/A"},{"$error":"#N/A"},{"$error":"#N/A"},{"$error":"#N/A"},{"$error":"#N/A"},{"$error":"#N/A"},{"$error":"#N/A"},{"$error":"#N/A"},{"$error":"#N/A"},{"$error":"#N/A"},{"$error":"#N/A"},{"$error":"#N/A"},{"$error":"#N/A"},{"$error":"#N/A"},{"$error":"#N/A"},{"$error":"#N/A"},{"$error":"#N/A"},{"$error":"#N/A"},{"$error":"#N/A"},{"$error":"#N/A"},{"$error":"#N/A"},{"$error":"#N/A"},{"$error":"#N/A"},{"$error":"#N/A"},{"$error":"#N/A"},{"$error":"#N/A"},{"$error":"#N/A"},{"$error":"#N/A"},{"$error":"#N/A"},{"$error":"#N/A"},{"$error":"#N/A"},{"$error":"#N/A"},{"$error":"#N/A"},{"$error":"#N/A"},{"$error":"#N/A"},{"$error":"#N/A"},null,{"$f":"'Site 28'!A13","v":"00:00:00"},null,{"$f":"AVERAGE(IF(ISNUMBER(AY173:BJ173),AY173:BJ173))","v":{"$error":"#DIV/0!"}}]
["Site 29","Monthly Avg. Residual",{"$error":"#N/A"},{"$error":"#N/A"},{"$error":"#N/A"},{"$error":"#N/A"},{"$error":"#N/A"},{"$error":"#N/A"},{"$error":"#N/A"},{"$error":"#N/A"},{"$error":"#N/A"},{"$error":"#N/A"},{"$error":"#N/A"},{"$error":"#N/A"},{"$error":"#N/A"},{"$error":"#N/A"},{"$error":"#N/A"},{"$error":"#N/A"},{"$error":"#N/A"},{"$error":"#N/A"},{"$error":"#N/A"},{"$error":"#N/A"},{"$error":"#N/A"},{"$error":"#N/A"},{"$error":"#N/A"},{"$error":"#N/A"},{"$error":"#N/A"},{"$error":"#N/A"},{"$error":"#N/A"},{"$error":"#N/A"},{"$error":"#N/A"},{"$error":"#N/A"},{"$error":"#N/A"},{"$error":"#N/A"},{"$error":"#N/A"},{"$error":"#N/A"},{"$error":"#N/A"},{"$error":"#N/A"},{"$error":"#N/A"},{"$error":"#N/A"},{"$error":"#N/A"},{"$error":"#N/A"},{"$error":"#N/A"},{"$error":"#N/A"},{"$error":"#N/A"},{"$error":"#N/A"},{"$error":"#N/A"},{"$error":"#N/A"},{"$error":"#N/A"},{"$error":"#N/A"},{"$error":"#N/A"},{"$error":"#N/A"},{"$error":"#N/A"},{"$error":"#N/A"},{"$error":"#N/A"},{"$error":"#N/A"},{"$error":"#N/A"},{"$error":"#N/A"},{"$error":"#N/A"},{"$error":"#N/A"},{"$error":"#N/A"},{"$error":"#N/A"},null,{"$f":"'Site 29'!A13","v":"00:00:00"},null,{"$f":"AVERAGE(IF(ISNUMBER(AY174:BJ174),AY174:BJ174))","v":{"$error":"#DIV/0!"}}]
["Site 30","Monthly Avg. Residual",{"$error":"#N/A"},{"$error":"#N/A"},{"$error":"#N/A"},{"$error":"#N/A"},{"$error":"#N/A"},{"$error":"#N/A"},{"$error":"#N/A"},{"$error":"#N/A"},{"$error":"#N/A"},{"$error":"#N/A"},{"$error":"#N/A"},{"$error":"#N/A"},{"$error":"#N/A"},{"$error":"#N/A"},{"$error":"#N/A"},{"$error":"#N/A"},{"$error":"#N/A"},{"$error":"#N/A"},{"$error":"#N/A"},{"$error":"#N/A"},{"$error":"#N/A"},{"$error":"#N/A"},{"$error":"#N/A"},{"$error":"#N/A"},{"$error":"#N/A"},{"$error":"#N/A"},{"$error":"#N/A"},{"$error":"#N/A"},{"$error":"#N/A"},{"$error":"#N/A"},{"$error":"#N/A"},{"$error":"#N/A"},{"$error":"#N/A"},{"$error":"#N/A"},{"$error":"#N/A"},{"$error":"#N/A"},{"$error":"#N/A"},{"$error":"#N/A"},{"$error":"#N/A"},{"$error":"#N/A"},{"$error":"#N/A"},{"$error":"#N/A"},{"$error":"#N/A"},{"$error":"#N/A"},{"$error":"#N/A"},{"$error":"#N/A"},{"$error":"#N/A"},{"$error":"#N/A"},{"$error":"#N/A"},{"$error":"#N/A"},{"$error":"#N/A"},{"$error":"#N/A"},{"$error":"#N/A"},{"$error":"#N/A"},{"$error":"#N/A"},{"$error":"#N/A"},{"$error":"#N/A"},{"$error":"#N/A"},{"$error":"#N/A"},{"$error":"#N/A"},null,{"$f":"'Site 30'!A13","v":"00:00:00"},null,{"$f":"AVERAGE(IF(ISNUMBER(AY175:BJ175),AY175:BJ175))","v":{"$error":"#DIV/0!"}}]
[]
[]
[]
[]
[]
[null,"Monthly count < 0.2 Cl2 data summarized for all sites below:"]
[null,"# < 0.2 mg/L All Sites",{"$f":"SUM(C184:C213)","v":0},{"$f":"SUM(D184:D213)","v":0},0,0,0,0,0,0,0,0,0,0,0,0,0,0,0,0,0,0,0,0,0,0,0,0,0,0,0,0,0,0,0,0,0,0,0,0,0,0,0,0,0,0,0,0,0,0,0,0,0,0,0,0,0,0,0,0,0,0,null,null,"# < 0.2 last 12 months"]
[null,null,{"$f":"C58","v":"3795-02-01"},{"$f":"D58","v":"3795-03-01"},"3795-04-01","3795-05-01","3795-06-01","3795-07-01","3795-08-01","3795-09-01","3795-10-01","3795-11-01","3795-12-01","3796-01-01","3796-02-01","3796-03-01","3796-04-01","3796-05-01","3796-06-01","3796-07-01","3796-08-01","3796-09-01","3796-10-01","3796-11-01","3796-12-01","3797-01-01","3797-02-01","3797-03-01","3797-04-01","3797-05-01","3797-06-01","3797-07-01","3797-08-01","3797-09-01","3797-10-01","3797-11-01","3797-12-01","3798-01-01","3798-02-01","3798-03-01","3798-04-01","3798-05-01","3798-06-01","3798-07-01","3798-08-01","3798-09-01","3798-10-01","3798-11-01","3798-12-01","3799-01-01","3799-02-01","3799-03-01","3799-04-01","3799-05-01","3799-06-01","3799-07-01","3799-08-01","3799-09-01","3799-10-01","3799-11-01","3799-12-01","1900-01-01"]
["Site 1","# < 0.2 mg/L","","","","","","","","","","","","","","","","","","","","","","","","","","","","","","","","","","","","","","","","","","","","","","","","","","","","","","","","","","","",0,null,null,{"$f":"SUM(AY184:BJ184)","v":0}]
["Site 2","# < 0.2 mg/L","","","","","","","","","","","","","","","","","","","","","","","","","","","","","","","","","","","","","","","","","","","","","","","","","","","","","","","","","","","",0,null,null,{"$f":"SUM(AY185:BJ185)","v":0}]
["Site 3","# < 0.2 mg/L","","","","","","","","","","","","","","","","","","","","","","","","","","","","","","","","","","","","","","","","","","","","","","","","","","","","","","","","","","","",0,null,null,0]
["Site 4","# < 0.2 mg/L","","","","","","","","","","","","","","","","","","","","","","","","","","","","","","","","","","","","","","","","","","","","","","","","","","","","","","","","","","","",0,null,null,0]
["Site 5","# < 0.2 mg/L","","","","","","","","","","","","","","","","","","","","","","","","","","","","","","","","","","","","","","","","","","","","","","","","","","","","","","","","","","","",0,null,null,0]
["Site 6","# < 0.2 mg/L","","","","","","","","","","","","","","","","","","","","","","","","","","","","","","","","","","","","","","","","","","","","","","","","","","","","","","","","","","","",0,null,null,0]
["Site 7","# < 0.2 mg/L","","","","","","","","","","","","","","","","","","","","","","","","","","","","","","","","","","","","","","","","","","","","","","","","","","","","","","","","","","","",0,null,null,0]
["Site 8","# < 0.2 mg/L","","","","","","","","","","","","","","","","","","","","","","","","","","","","","","","","","","","","","","","","","","","","","","","","","","","","","","","","","","","",0,null,null,0]
["Site 9","# < 0.2 mg/L","","","","","","","","","","","","","","","","","","","","","","","","","","","","","","","","","","","","","","","","","","","","","","","","","","","","","","","","","","","",0,null,null,0]
["Site 10","# < 0.2 mg/L","","","","","","","","","","","","","","","","","","","","","","","","","","","","","","","","","","","","","","","","","","","","","","","","","","","","","","","","","","","",0,null,null,0]
["Site 11","# < 0.2 mg/L","","","","","","","","","","","","","","","","","","","","","","","","","","","","","","","","","","","","","","","","","","","","","","","","","","","","","","","","","","","",0,null,null,0]
["Site 12","# < 0.2 mg/L","","","","","","","","","","","","","","","","","","","","","","","","","","","","","","","","","","","","","","","","","","","","","","","","","","","","","","","","","","","",0,null,null,0]
["Site 13","# < 0.2 mg/L","","","","","","","","","","","","","","","","","","","","","","","","","","","","","","","","","","","","","","","","","","","","","","","","","","","","","","","","","","","",0,null,null,0]
["Site 14","# < 0.2 mg/L","","","","","","","","","","","","","","","","","","","","","","","","","","","","","","","","","","","","","","","","","","","","","","","","","","","","","","","","","","","",0,null,null,0]
["Site 15","# < 0.2 mg/L","","","","","","","","","","","","","","","","","","","","","","","","","","","","","","","","","","","","","","","","","","","","","","","","","","","","","","","","","","","",0,null,null,0]
["Site 16","# < 0.2 mg/L","","","","","","","","","","","","","","","","","","","","","","","","","","","","","","","","","","","","","","","","","","","","","","","","","","","","","","","","","","","",0,null,null,0]
["Site 17","# < 0.2 mg/L","","","","","","","","","","","","","","","","","","","","","","","","","","","","","","","","","","","","","","","","","","","","","","","","","","","","","","","","","","","",0,null,null,0]
["Site 18","# < 0.2 mg/L","","","","","","","","","","","","","","","","","","","","","","","","","","","","","","","","","","","","","","","","","","","","","","","","","","","","","","","","","","","",0,null,null,0]
["Site 19","# < 0.2 mg/L","","","","","","","","","","","","","","","","","","","","","","","","","","","","","","","","","","","","","","","","","","","","","","","","","","","","","","","","","","","",0,null,null,0]
["Site 20","# < 0.2 mg/L","","","","","","","","","","","","","","","","","","","","","","","","","","","","","","","","","","","","","","","","","","","","","","","","","","","","","","","","","","","",0,null,null,0]
["Site 21","# < 0.2 mg/L","","","","","","","","","","","","","","","","","","","","","","","","","","","","","","","","","","","","","","","","","","","","","","","","","","","","","","","","","","","",0,null,null,0]
["Site 22","# < 0.2 mg/L","","","","","","","","","","","","","","","","","","","","","","","","","","","","","","","","","","","","","","","","","","","","","","","","","","","","","","","","","","","",0,null,null,0]
["Site 23","# < 0.2 mg/L","","","","","","","","","","","","","","","","","","","","","","","","","","","","","","","","","","","","","","","","","","","","","","","","","","","","","","","","","","","",0,null,null,0]
["Site 24","# < 0.2 mg/L","","","","","","","","","","","","","","","","","","","","","","","","","","","","","","","","","","","","","","","","","","","","","","","","","","","","","","","","","","","",0,null,null,0]
["Site 25","# < 0.2 mg/L","","","","","","","","","","","","","","","","","","","","","","","","","","","","","","","","","","","","","","","","","","","","","","","","","","","","","","","","","","","",0,null,null,0]
["Site 26","# < 0.2 mg/L","","","","","","","","","","","","","","","","","","","","","","","","","","","","","","","","","","","","","","","","","","","","","","","","","","","","","","","","","","","",0,null,null,0]
["Site 27","# < 0.2 mg/L","","","","","","","","","","","","","","","","","","","","","","","","","","","","","","","","","","","","","","","","","","","","","","","","","","","","","","","","","","","",0,null,null,0]
["Site 28","# < 0.2 mg/L","","","","","","","","","","","","","","","","","","","","","","","","","","","","","","","","","","","","","","","","","","","","","","","","","","","","","","","","","","","",0,null,null,0]
["Site 29","# < 0.2 mg/L","","","","","","","","","","","","","","","","","","","","","","","","","","","","","","","","","","","","","","","","","","","","","","","","","","","","","","","","","","","",0,null,null,0]
["Site 30","# < 0.2 mg/L","","","","","","","","","","","","","","","","","","","","","","","","","","","","","","","","","","","","","","","","","","","","","","","","","","","","","","","","","","","",0,null,null,0]

{"sheet":"Site 1","index":37,"n_rows":13,"n_cols":49,"rows_kept":13,"cut":false,"hidden":true,"merged":[]}
[null,null,null,null,null,null,null,null,null,null,null,null,null,null,null,null,null,null,null,null,null,"More Charts >>"]
[null,null,null,null,null,null,null,null,null,"                               Discrete Sample DBP Trends",null,null,null,null,"DBP LRAA Trends (recent 8 quarters)",null,null,null,null,null,"Discrete Sample Cl2 Residual, pH, and Temperature Trends",null,null,null,null,null,null,"Monthly Cl2 Residual Trends"]
[]
[]
[null,null,null,null,null,null,null,null,null,{"$f":"IF(Main!C9=\"\",\"\",Main!C9)","v":"Entry Point"},null,{"$f":"IF(Main!F9=\"\",\"\",Main!F9)","v":""},null,null,null,"Enter Y if DBP Compliance Site    →",null,null,null,null,"Columns below can be modified for system specific paramters",null,null,null,null,null,null,null,null,null,null,null,"Charting Goals"]
[null,"Check Date","First TTHM Date","Month","Quarter","Year","M & Y","Q & Y","Cl2 Count",null,"Date","TTHM ppb","HAA5 ppb","THM Plus ppb","THM+ Ratio","Temp. C","pH units","Free Cl2 ppm","Total Cl2 ppm","Delta Cl2",null,null,null,null,null,null,null,null,null,null,null,null,"TTHM ppb","HAA5 ppb","THM Plus ppb","THM+ Ratio","Temp. C","pH units","Free Cl2 ppm","Total Cl2 ppm","Delta Cl2","Turbidity NTU","UV254 cm-1"]
[null,null,null,null,null,null,null,null,null,"System Defined Goals",null,20,15]
[null,null,null,null,null,null,null,null,null,"Average",null,{"$f":"AVERAGE(L11:L13)","v":{"$error":"#DIV/0!"}},{"$error":"#DIV/0!"},{"$error":"#DIV/0!"},{"$error":"#DIV/0!"},{"$error":"#DIV/0!"},{"$error":"#DIV/0!"},{"$error":"#DIV/0!"},{"$error":"#DIV/0!"},{"$error":"#DIV/0!"},{"$error":"#DIV/0!"},{"$error":"#DIV/0!"},{"$error":"#DIV/0!"},{"$error":"#DIV/0!"},{"$error":"#DIV/0!"},{"$error":"#DIV/0!"},{"$error":"#DIV/0!"},{"$error":"#DIV/0!"}]
[null,null,null,null,null,null,null,null,null,"Minimum",null,{"$f":"MIN(L11:L13)","v":0},0,0,0,0,0,0,0,0,0,0,0,0,0,0,0,0]
[null,null,null,null,null,null,null,null,null,"Maximum",null,{"$f":"MAX(L11:L13)","v":0},0,0,0,0,0,0,0,0,0,0,0,0,0,0,0,0]
[null,null,null,null,null,null,"M & Y","Q & Y",null,null,null,null,null,null,null,null,null,null,null,null,null,null,null,null,null,null,null,null,"Provide comments below useful for data interpretation (e.g., flushing conducted in sample area, sample visibly red/brown after flush period)."]
[null,{"$f":"IF(L12,K12,)","v":"00:00:00"},{"$f":"IF(L12,1,IF(M12,1,))","v":0},{"$f":"MONTH(K12)","v":1},{"$f":"INT((MONTH(K12)-1)/3)+1","v":1},{"$f":"YEAR(K12)","v":1900},{"$f":"\"M\"&D12&\" \"&F12","v":"M1 1900"},{"$f":"\"Q\"&E12&\" \"&F12","v":"Q1 1900"},{"$f":"IF(R12<>\"\",IF(OR(R12=0,R12<0.2),1,\"\"),\"\")","v":""},"Site 1",null,null,null,null,{"$f":"IF(L12,IF(N12,N12/L12,\"\"),\"\")","v":""},null,null,null,null,{"$f":"IF(R12,IF(S12,S12-R12,\"\"),\"\")","v":""},null,null,null,null,null,null,null,null,null,null,null,null,{"$f":"IF($L$7,$L$7,\"\")","v":20},{"$f":"IF($M$7,$M$7,\"\")","v":15},{"$f":"IF($N$7,$N$7,\"\")","v":""},null,null,{"$f":"IF($Q$7,$Q$7,\"\")","v":""},{"$f":"IF($R$7,$R$7,\"\")","v":""},{"$f":"IF($S$7,$S$7,\"\")","v":""},null,{"$f":"IF($U$7,$U$7,\"\")","v":""},{"$f":"IF($V$7,$V$7,\"\")","v":""},{"$f":"IF($W$7,$W$7,\"\")","v":""},{"$f":"IF($X$7,$X$7,\"\")","v":""},{"$f":"IF($Y$7,$Y$7,\"\")","v":""},{"$f":"IF($Z$7,$Z$7,\"\")","v":""},{"$f":"IF($AA$7,$AA$7,\"\")","v":""},{"$f":"IF($AB$7,$AB$7,\"\")","v":""}]
[{"$f":"MAX(K11:K13)","v":"00:00:00"}]

{"sheet":"Plant TOC","index":38,"n_rows":96,"n_cols":39,"rows_kept":96,"cut":false,"hidden":true,"merged":[]}
[]
[]
[]
[null,null,null,null,null,"To enter data for a new system, delete data in red.",null,null,null,null,null,null,null,"Enter TOC Performance Ratio Goal ð",null,null,null,null,null,null,1.1000000000000001]
[null,null,null,null,null,"Date","Source Water Alkalinity","Source Water TOC","Settled Water TOC #1","Settled Water TOC #2","Treated Water TOC","Actual TOC Removal","Regulatory TOC Removal","Performance Ratio",null,"Plant 1 Coag. Dose (mg/L)","Plant 1 Coag. pH","Plant 2 Coag Dose (mg/L)","Plant 2 settled pH","Source UV254 Rdg  #1","Source UV254 Rdg #2","Source UV254 Rdg #3","Source UV254 Avg","Settled UV254 #1 Rdg  #1","Settled UV254 #1 Rdg  #2","Settled UV254 #1 Rdg  #3","Settled UV254 #1 Avg","Settled UV254 #2 Rdg  #1","Settled UV254 #2 Rdg  #2","Settled UV254 #2 Rdg  #3","Settled UV254 #2 Avg","Comments"]
[null,null,null,null,null,null,"mg/L","mg/L","mg/L","mg/L","mg/L","%","%","Calc.","Selected","mg/L",null,"mg/L",null,"per cm","per cm","per cm","per cm","per cm","per cm","per cm","per cm","per cm","per cm","per cm","per cm"]
[null,"Check Date","Quarter","Year","Q & Y","","","","","","","","","","","","","","","","","","","","","","","","","","",""]
[null,{"$f":"IF(G8,F8,)","v":"00:00:00"},{"$f":"INT((MONTH(F8)-1)/3)+1","v":1},{"$f":"YEAR(F8)","v":1900},{"$f":"IF(F8=\"\",\"\",\"Q\"&C8&\" \"&D8)","v":""},null,null,null,null,null,null,{"$f":"IF(K8=\"\",\"\",IF(K8>H8,\"\",(H8-K8)*100/H8))","v":""},{"$f":"IF(H8=\"\",\"\",VLOOKUP(H8,TOC,MATCH(G8,$AJ$16:$AM$16,-1)+1))","v":""},{"$f":"IF(H8>0,L8/M8,\"\")","v":""},{"$f":"IF(N8<1,IF(H8<2,1,IF(K8<2,1,N8)),N8)","v":""},null,null,null,null,null,null,null,{"$f":"IF(T8,AVERAGE(T8:V8),\"\")","v":""},null,null,null,{"$f":"IF(X8,AVERAGE(X8:Z8),\"\")","v":""},null,null,null,{"$f":"IF(AB8,AVERAGE(AB8:AD8),\"\")","v":""},null,null,null,"TOC Removal Requirements by Enhanced Coagulation"]
[null,"00:00:00",1,1900,{"$f":"IF(F9=\"\",\"\",\"Q\"&C9&\" \"&D9)","v":""},null,null,null,null,null,null,"","",{"$f":"IF(H9>0,L9/M9,\"\")","v":""},{"$f":"IF(N9<1,IF(H9<2,1,IF(K9<2,1,N9)),N9)","v":""},null,null,null,null,null,null,null,{"$f":"IF(T9,AVERAGE(T9:V9),\"\")","v":""},null,null,null,{"$f":"IF(X9,AVERAGE(X9:Z9),\"\")","v":""},null,null,null,{"$f":"IF(AB9,AVERAGE(AB9:AD9),\"\")","v":""},null,null,null,"Source Water","Source Water Alkalinity (as CaCO3)"]
[null,"00:00:00",1,1900,"",null,null,null,null,null,null,"","","","",null,null,null,null,null,null,null,"",null,null,null,"",null,null,null,"",null,null,null,"TOC","< 60 mg/L","60 - 120 mg/L",">120 mg/L"]
[null,"00:00:00",1,1900,"",null,null,null,null,null,null,"","","","",null,null,null,null,null,null,null,"",null,null,null,"",null,null,null,"",null,null,null,"> 2.0 - 4.0 mg/L",35,25,15]
[null,"00:00:00",1,1900,"",null,null,null,null,null,null,"","","","",null,null,null,null,null,null,null,"",null,null,null,"",null,null,null,"",null,null,null,"> 4.0 - 8.0 mg/L",45,35,25]
[null,"00:00:00",1,1900,"",null,null,null,null,null,null,"","","","",null,null,null,null,null,null,null,"",null,null,null,"",null,null,null,"",null,null,null,"> 8.0 mg/L",50,40,30]
[null,"00:00:00",1,1900,"",null,null,null,null,null,null,"","","","",null,null,null,null,null,null,null,"",null,null,null,"",null,null,null,""]
[null,"00:00:00",1,1900,"",null,null,null,null,null,null,"","","","",null,null,null,null,null,null,null,"",null,null,null,"",null,null,null,"",null,null,null,"Used in formula to determine regulatory TOC removal"]
[null,"00:00:00",1,1900,"",null,null,null,null,null,null,"","","","",null,null,null,null,null,null,null,"",null,null,null,"",null,null,null,"",null,null,null,"Lookup Table",1000,121,120,59]
[null,"00:00:00",1,1900,"",null,null,null,null,null,null,"","","","",null,null,null,null,null,null,null,"",null,null,null,"",null,null,null,"",null,null,null,0.1,15,15,25,35]
[null,"00:00:00",1,1900,"",null,null,null,null,null,null,"","","","",null,null,null,null,null,null,null,"",null,null,null,"",null,null,null,"",null,null,null,4,15,15,25,35]
[null,"00:00:00",1,1900,"",null,null,null,null,null,null,"","","","",null,null,null,null,null,null,null,"",null,null,null,"",null,null,null,"",null,null,null,4.01,25,25,35,45]
[null,"00:00:00",1,1900,"",null,null,null,null,null,null,"","","","",null,null,null,null,null,null,null,"",null,null,null,"",null,null,null,"",null,null,null,8,25,25,35,45]
[null,"00:00:00",1,1900,"",null,null,null,null,null,null,"","","","",null,null,null,null,null,null,null,"",null,null,null,"",null,null,null,"",null,null,null,8.01,30,30,40,50]
[null,"00:00:00",1,1900,"",null,null,null,null,null,null,"","","","",null,null,null,null,null,null,null,"",null,null,null,"",null,null,null,""]
[null,{"$f":"IF(G23,F23,)","v":"00:00:00"},{"$f":"INT((MONTH(F23)-1)/3)+1","v":1},{"$f":"YEAR(F23)","v":1900},"",null,null,null,null,null,null,{"$f":"IF(K23=\"\",\"\",IF(K23>H23,\"\",(H23-K23)*100/H23))","v":""},"","",{"$f":"IF(N23<1,IF(H23<2,1,IF(K23<2,1,N23)),N23)","v":""},null,null,null,null,null,null,null,"",null,null,null,"",null,null,null,""]
[null,{"$f":"IF(G24,F24,)","v":"00:00:00"},{"$f":"INT((MONTH(F24)-1)/3)+1","v":1},{"$f":"YEAR(F24)","v":1900},"",null,null,null,null,null,null,{"$f":"IF(K24=\"\",\"\",IF(K24>H24,\"\",(H24-K24)*100/H24))","v":""},"","",{"$f":"IF(N24<1,IF(H24<2,1,IF(K24<2,1,N24)),N24)","v":""},null,null,null,null,null,null,null,"",null,null,null,"",null,null,null,""]
[null,"00:00:00",1,1900,"",null,null,null,null,null,null,"","","","",null,null,null,null,null,null,null,"",null,null,null,"",null,null,null,""]
[null,"00:00:00",1,1900,"",null,null,null,null,null,null,"","","","",null,null,null,null,null,null,null,"",null,null,null,"",null,null,null,""]
[null,"00:00:00",1,1900,{"$f":"IF(F27=\"\",\"\",\"Q\"&C27&\" \"&D27)","v":""},null,null,null,null,null,null,"","","","",null,null,null,null,null,null,null,"",null,null,null,"",null,null,null,""]
[null,"00:00:00",1,1900,{"$f":"IF(F28=\"\",\"\",\"Q\"&C28&\" \"&D28)","v":""},null,null,null,null,null,null,"","","","",null,null,null,null,null,null,null,"",null,null,null,"",null,null,null,""]
[null,"00:00:00",1,1900,"",null,null,null,null,null,null,"","","","",null,null,null,null,null,null,null,"",null,null,null,"",null,null,null,""]
[null,"00:00:00",1,1900,"",null,null,null,null,null,null,"","","","",null,null,null,null,null,null,null,"",null,null,null,"",null,null,null,""]
[null,"00:00:00",1,1900,"",null,null,null,null,null,null,"","","","",null,null,null,null,null,null,null,"",null,null,null,"",null,null,null,""]
[null,"00:00:00",1,1900,"",null,null,null,null,null,null,"","","","",null,null,null,null,null,null,null,"",null,null,null,"",null,null,null,""]
[null,"00:00:00",1,1900,"",null,null,null,null,null,null,"","","","",null,null,null,null,null,null,null,"",null,null,null,"",null,null,null,""]
[null,"00:00:00",1,1900,"",null,null,null,null,null,null,"","","","",null,null,null,null,null,null,null,"",null,null,null,"",null,null,null,""]
[null,"00:00:00",1,1900,"",null,null,null,null,null,null,"","","","",null,null,null,null,null,null,null,"",null,null,null,"",null,null,null,""]
[null,"00:00:00",1,1900,"",null,null,null,null,null,null,"","","","",null,null,null,null,null,null,null,"",null,null,null,"",null,null,null,""]
[null,"00:00:00",1,1900,"",null,null,null,null,null,null,"","","","",null,null,null,null,null,null,null,"",null,null,null,"",null,null,null,""]
[null,"00:00:00",1,1900,"",null,null,null,null,null,null,"","","","",null,null,null,null,null,null,null,"",null,null,null,"",null,null,null,""]
[null,"00:00:00",1,1900,"",null,null,null,null,null,null,"","","","",null,null,null,null,null,null,null,"",null,null,null,"",null,null,null,""]
[null,{"$f":"IF(G40,F40,)","v":"00:00:00"},{"$f":"INT((MONTH(F40)-1)/3)+1","v":1},{"$f":"YEAR(F40)","v":1900},"",null,null,null,null,null,null,{"$f":"IF(K40=\"\",\"\",IF(K40>H40,\"\",(H40-K40)*100/H40))","v":""},"","",{"$f":"IF(N40<1,IF(H40<2,1,IF(K40<2,1,N40)),N40)","v":""},null,null,null,null,null,null,null,"",null,null,null,"",null,null,null,""]
[null,{"$f":"IF(G41,F41,)","v":"00:00:00"},{"$f":"INT((MONTH(F41)-1)/3)+1","v":1},{"$f":"YEAR(F41)","v":1900},"",null,null,null,null,null,null,{"$f":"IF(K41=\"\",\"\",IF(K41>H41,\"\",(H41-K41)*100/H41))","v":""},"","",{"$f":"IF(N41<1,IF(H41<2,1,IF(K41<2,1,N41)),N41)","v":""},null,null,null,null,null,null,null,"",null,null,null,"",null,null,null,""]
[null,{"$f":"IF(G42,F42,)","v":"00:00:00"},{"$f":"INT((MONTH(F42)-1)/3)+1","v":1},{"$f":"YEAR(F42)","v":1900},"",null,null,null,null,null,null,{"$f":"IF(K42=\"\",\"\",IF(K42>H42,\"\",(H42-K42)*100/H42))","v":""},"","",{"$f":"IF(N42<1,IF(H42<2,1,IF(K42<2,1,N42)),N42)","v":""},null,null,null,null,null,null,null,"",null,null,null,"",null,null,null,""]
[null,{"$f":"IF(G43,F43,)","v":"00:00:00"},{"$f":"INT((MONTH(F43)-1)/3)+1","v":1},{"$f":"YEAR(F43)","v":1900},"",null,null,null,null,null,null,{"$f":"IF(K43=\"\",\"\",IF(K43>H43,\"\",(H43-K43)*100/H43))","v":""},"","",{"$f":"IF(N43<1,IF(H43<2,1,IF(K43<2,1,N43)),N43)","v":""},null,null,null,null,null,null,null,"",null,null,null,"",null,null,null,""]
[]
[null,null,null,null,null,"Average",{"$f":"AVERAGE(G8:G44)","v":{"$error":"#DIV/0!"}},{"$f":"AVERAGE(H8:H44)","v":{"$error":"#DIV/0!"}},null,null,{"$f":"AVERAGE(K8:K44)","v":{"$error":"#DIV/0!"}},{"$error":"#DIV/0!"},{"$error":"#DIV/0!"},{"$error":"#DIV/0!"},{"$error":"#DIV/0!"},{"$error":"#DIV/0!"},{"$f":"MEDIAN(Q8:Q44)","v":{"$error":"#NUM!"}},{"$f":"MEDIAN(R8:R44)","v":{"$error":"#NUM!"}},{"$f":"MEDIAN(S8:S44)","v":{"$error":"#NUM!"}},null,null,null,{"$f":"MEDIAN(W8:W44)","v":{"$error":"#NUM!"}},null,null,null,{"$f":"MEDIAN(AA8:AA44)","v":{"$error":"#NUM!"}},null,null,null,{"$f":"MEDIAN(AE8:AE44)","v":{"$error":"#NUM!"}}]
[null,null,null,null,null,"Min",{"$f":"MIN(G8:G44)","v":0},{"$f":"MIN(H8:H44)","v":0},null,null,{"$f":"MIN(K8:K44)","v":0},0,0,0,0,0,0,0,0,null,null,null,{"$f":"MIN(W8:W44)","v":0},null,null,null,{"$f":"MIN(AA8:AA44)","v":0},null,null,null,{"$f":"MIN(AE8:AE44)","v":0}]
[null,null,null,null,null,"Max",{"$f":"MAX(G8:G44)","v":0},{"$f":"MAX(H8:H44)","v":0},null,null,{"$f":"MAX(K8:K44)","v":0},0,0,0,0,0,0,0,0,null,null,null,{"$f":"MAX(W8:W44)","v":0},null,null,null,{"$f":"MAX(AA8:AA44)","v":0},null,null,null,{"$f":"MAX(AE8:AE44)","v":0}]
[]
[null,null,null,null,null,"Note:  The data table is set up for 3 years (12 quarters) of TOC data assuming one data set per month."]
[null,null,null,null,null,"If additional rows are added to go beyond 12 quarters of TOC data, the TOC PR will not calculate correctly.  Suggest starting a new spreadsheet."]
[]
[]
[]
[]
[]
[]
[]
[]
[null,null,null,null,null,"TOC performance ratio plot data (calcualted by macro)"]
[null,null,null,null,null,"Q & Y","","","","","","","","","","","PR RAA",null,null,null,null,null,null,null,null,null,null,null,null,null,null,"PR Goal","Identifier"]
[null,null,null,null,null,"",null,null,null,null,null,null,"","","","",{"$f":"IF(P61=\"\",\"\",P61)","v":""},null,null,null,null,null,null,null,null,null,null,null,null,null,null,{"$f":"$U$4","v":1.1000000000000001},{"$f":"IF(F61=\"\",\"\",\"Q\"&RIGHT(LEFT(F61,2),1)&\" \"&RIGHT(LEFT(F61,7),4))","v":""}]
[null,null,null,null,null,"",null,null,null,null,null,null,"","","","",{"$f":"IF(P62=\"\",\"\",AVERAGE(P61:P62))","v":""},null,null,null,null,null,null,null,null,null,null,null,null,null,null,1.1000000000000001,{"$f":"IF(F62=\"\",\"\",\"Q\"&RIGHT(LEFT(F62,2),1)&\" \"&RIGHT(LEFT(F62,7),4))","v":""}]
[null,null,null,null,null,"",null,null,null,null,null,null,"","","","",{"$f":"IF(P63=\"\",\"\",AVERAGE(P61:P63))","v":""},null,null,null,null,null,null,null,null,null,null,null,null,null,null,1.1000000000000001,""]
[null,null,null,null,null,"",null,null,null,null,null,null,"","","","",{"$f":"IF(P64=\"\",\"\",AVERAGE(P61:P64))","v":""},null,null,null,null,null,null,null,null,null,null,null,null,null,null,1.1000000000000001,""]
[null,null,null,null,null,"",null,null,null,null,null,null,"","","","",{"$f":"IF(P65=\"\",\"\",AVERAGE(P62:P65))","v":""},null,null,null,null,null,null,null,null,null,null,null,null,null,null,1.1000000000000001,""]
[null,null,null,null,null,"",null,null,null,null,null,null,"","","","",{"$f":"IF(P66=\"\",\"\",AVERAGE(P63:P66))","v":""},null,null,null,null,null,null,null,null,null,null,null,null,null,null,1.1000000000000001,""]
[null,null,null,null,null,"",null,null,null,null,null,null,"","","","","",null,null,null,null,null,null,null,null,null,null,null,null,null,null,1.1000000000000001,""]
[null,null,null,null,null,"",null,null,null,null,null,null,"","","","","",null,null,null,null,null,null,null,null,null,null,null,null,null,null,1.1000000000000001,""]
[null,null,null,null,null,"",null,null,null,null,null,null,"","","","","",null,null,null,null,null,null,null,null,null,null,null,null,null,null,1.1000000000000001,""]
[null,null,null,null,null,"",null,null,null,null,null,null,"","","","","",null,null,null,null,null,null,null,null,null,null,null,null,null,null,1.1000000000000001,""]
[null,null,null,null,null,"",null,null,null,null,null,null,"","","","","",null,null,null,null,null,null,null,null,null,null,null,null,null,null,1.1000000000000001,""]
[null,null,null,null,null,"",null,null,null,null,null,null,"","","","","",null,null,null,null,null,null,null,null,null,null,null,null,null,null,1.1000000000000001,""]
[null,null,null,null,null,"",null,null,null,null,null,null,"","","","",{"$f":"IF(N73=\"\",\"\",N73)","v":""}]
[null,null,null,null,null,"",null,null,null,null,null,null,"","","","",{"$f":"IF(N74=\"\",\"\",N74)","v":""}]
[null,null,null,null,null,"",null,null,null,null,null,null,"","","",""]
[null,null,null,null,null,"",null,null,null,null,null,null,"","","",""]
[null,null,null,null,null,"",null,null,null,null,null,null,"","","",""]
[null,null,null,null,null,"",null,null,null,null,null,null,"","","",""]
[null,null,null,null,null,"",null,null,null,null,null,null,"","","",""]
[null,null,null,null,null,"",null,null,null,null,null,null,"","","",""]
[null,null,null,null,null,"",null,null,null,null,null,null,"","","",""]
[null,null,null,null,null,"",null,null,null,null,null,null,"","","",""]
[null,null,null,null,null,"",null,null,null,null,null,null,"","","",""]
[null,null,null,null,null,"",null,null,null,null,null,null,"","","",""]
[null,null,null,null,null,"",null,null,null,null,null,null,"","","",""]
[null,null,null,null,null,"",null,null,null,null,null,null,"","","",""]
[null,null,null,null,null,"",null,null,null,null,null,null,"","","",""]
[null,null,null,null,null,"",null,null,null,null,null,null,"","","",""]
[null,null,null,null,null,"",null,null,null,null,null,null,"","","",""]
[null,null,null,null,null,"",null,null,null,null,null,null,"","","",""]
[null,null,null,null,null,"",null,null,null,null,null,null,"","","",""]
[null,null,null,null,null,"",null,null,null,null,null,null,"","","",""]
[null,null,null,null,null,"",null,null,null,null,null,null,"","","",""]
[null,null,null,null,null,"",null,null,null,null,null,null,"","","",""]
[null,null,null,null,null,"",null,null,null,null,null,null,"","","",""]
[null,null,null,null,null,"",null,null,null,null,null,null,"","","",""]

{"sheet":"OEL Calc","index":39,"n_rows":69,"n_cols":14,"rows_kept":69,"cut":false,"hidden":true,"merged":[]}
[]
[null,"OEL exceedences are required to be reported to DEP for compliance monitoring locations only."]
[null,"Highlighted cells indicates OEL exceedance (average of 2 times current quarter plus previous 2 quarters)"]
[null,"Data for the quarter being shown must be present in order for the OEL to be calculated."]
[null,"TTHM OEL Table"]
[null,"Sample Location","Compliance Site",{"$f":"'TTHM GOAL CALC'!F18","v":"Q1 1898"},{"$f":"'TTHM GOAL CALC'!G18","v":"Q2 1898"},{"$f":"'TTHM GOAL CALC'!H18","v":"Q3 1898"},{"$f":"'TTHM GOAL CALC'!I18","v":"Q4 1898"},{"$f":"'TTHM GOAL CALC'!J18","v":"Q1 1899"},{"$f":"'TTHM GOAL CALC'!K18","v":"Q2 1899"},{"$f":"'TTHM GOAL CALC'!L18","v":"Q3 1899"},{"$f":"'TTHM GOAL CALC'!M18","v":"Q4 1899"},{"$f":"'TTHM GOAL CALC'!N18","v":"Q1 1900"}]
[null,{"$f":"'TTHM GOAL CALC'!B49","v":"Entry Point"},{"$f":"IF(ISBLANK('Site 1'!T5),\"\",'Site 1'!T5)","v":""},{"$f":"IF(ISERROR(('TTHM GOAL CALC'!F19*2+SUM('TTHM GOAL CALC'!D19:E19))/4),\"\",(('TTHM GOAL CALC'!F19*2+SUM('TTHM GOAL CALC'!D19:E19))/4))","v":""},{"$f":"IF(ISERROR(('TTHM GOAL CALC'!G19*2+SUM('TTHM GOAL CALC'!E19:F19))/4),\"\",(('TTHM GOAL CALC'!G19*2+SUM('TTHM GOAL CALC'!E19:F19))/4))","v":""},{"$f":"IF(ISERROR(('TTHM GOAL CALC'!H19*2+SUM('TTHM GOAL CALC'!F19:G19))/4),\"\",(('TTHM GOAL CALC'!H19*2+SUM('TTHM GOAL CALC'!F19:G19))/4))","v":""},{"$f":"IF(ISERROR(('TTHM GOAL CALC'!I19*2+SUM('TTHM GOAL CALC'!G19:H19))/4),\"\",(('TTHM GOAL CALC'!I19*2+SUM('TTHM GOAL CALC'!G19:H19))/4))","v":""},{"$f":"IF(ISERROR(('TTHM GOAL CALC'!J19*2+SUM('TTHM GOAL CALC'!H19:I19))/4),\"\",(('TTHM GOAL CALC'!J19*2+SUM('TTHM GOAL CALC'!H19:I19))/4))","v":""},{"$f":"IF(ISERROR(('TTHM GOAL CALC'!K19*2+SUM('TTHM GOAL CALC'!I19:J19))/4),\"\",(('TTHM GOAL CALC'!K19*2+SUM('TTHM GOAL CALC'!I19:J19))/4))","v":""},{"$f":"IF(ISERROR(('TTHM GOAL CALC'!L19*2+SUM('TTHM GOAL CALC'!J19:K19))/4),\"\",(('TTHM GOAL CALC'!L19*2+SUM('TTHM GOAL CALC'!J19:K19))/4))","v":""},{"$f":"IF(ISERROR(('TTHM GOAL CALC'!M19*2+SUM('TTHM GOAL CALC'!K19:L19))/4),\"\",(('TTHM GOAL CALC'!M19*2+SUM('TTHM GOAL CALC'!K19:L19))/4))","v":""},{"$f":"IF(ISERROR(('TTHM GOAL CALC'!N19*2+SUM('TTHM GOAL CALC'!L19:M19))/4),\"\",(('TTHM GOAL CALC'!N19*2+SUM('TTHM GOAL CALC'!L19:M19))/4))","v":""}]
[null,{"$f":"'TTHM GOAL CALC'!B50","v":"Site 2"},{"$f":"IF(ISBLANK('Site 2'!T5),\"\",'Site 2'!T5)","v":""},{"$f":"IF(ISERROR(('TTHM GOAL CALC'!F20*2+SUM('TTHM GOAL CALC'!D20:E20))/4),\"\",(('TTHM GOAL CALC'!F20*2+SUM('TTHM GOAL CALC'!D20:E20))/4))","v":""},{"$f":"IF(ISERROR(('TTHM GOAL CALC'!G20*2+SUM('TTHM GOAL CALC'!E20:F20))/4),\"\",(('TTHM GOAL CALC'!G20*2+SUM('TTHM GOAL CALC'!E20:F20))/4))","v":""},{"$f":"IF(ISERROR(('TTHM GOAL CALC'!H20*2+SUM('TTHM GOAL CALC'!F20:G20))/4),\"\",(('TTHM GOAL CALC'!H20*2+SUM('TTHM GOAL CALC'!F20:G20))/4))","v":""},{"$f":"IF(ISERROR(('TTHM GOAL CALC'!I20*2+SUM('TTHM GOAL CALC'!G20:H20))/4),\"\",(('TTHM GOAL CALC'!I20*2+SUM('TTHM GOAL CALC'!G20:H20))/4))","v":""},{"$f":"IF(ISERROR(('TTHM GOAL CALC'!J20*2+SUM('TTHM GOAL CALC'!H20:I20))/4),\"\",(('TTHM GOAL CALC'!J20*2+SUM('TTHM GOAL CALC'!H20:I20))/4))","v":""},{"$f":"IF(ISERROR(('TTHM GOAL CALC'!K20*2+SUM('TTHM GOAL CALC'!I20:J20))/4),\"\",(('TTHM GOAL CALC'!K20*2+SUM('TTHM GOAL CALC'!I20:J20))/4))","v":""},{"$f":"IF(ISERROR(('TTHM GOAL CALC'!L20*2+SUM('TTHM GOAL CALC'!J20:K20))/4),\"\",(('TTHM GOAL CALC'!L20*2+SUM('TTHM GOAL CALC'!J20:K20))/4))","v":""},{"$f":"IF(ISERROR(('TTHM GOAL CALC'!M20*2+SUM('TTHM GOAL CALC'!K20:L20))/4),\"\",(('TTHM GOAL CALC'!M20*2+SUM('TTHM GOAL CALC'!K20:L20))/4))","v":""},{"$f":"IF(ISERROR(('TTHM GOAL CALC'!N20*2+SUM('TTHM GOAL CALC'!L20:M20))/4),\"\",(('TTHM GOAL CALC'!N20*2+SUM('TTHM GOAL CALC'!L20:M20))/4))","v":""}]
[null,{"$f":"'TTHM GOAL CALC'!B51","v":"Site 3"},{"$f":"IF(ISBLANK('Site 3'!T5),\"\",'Site 3'!T5)","v":""},{"$f":"IF(ISERROR(('TTHM GOAL CALC'!F21*2+SUM('TTHM GOAL CALC'!D21:E21))/4),\"\",(('TTHM GOAL CALC'!F21*2+SUM('TTHM GOAL CALC'!D21:E21))/4))","v":""},{"$f":"IF(ISERROR(('TTHM GOAL CALC'!G21*2+SUM('TTHM GOAL CALC'!E21:F21))/4),\"\",(('TTHM GOAL CALC'!G21*2+SUM('TTHM GOAL CALC'!E21:F21))/4))","v":""},{"$f":"IF(ISERROR(('TTHM GOAL CALC'!H21*2+SUM('TTHM GOAL CALC'!F21:G21))/4),\"\",(('TTHM GOAL CALC'!H21*2+SUM('TTHM GOAL CALC'!F21:G21))/4))","v":""},{"$f":"IF(ISERROR(('TTHM GOAL CALC'!I21*2+SUM('TTHM GOAL CALC'!G21:H21))/4),\"\",(('TTHM GOAL CALC'!I21*2+SUM('TTHM GOAL CALC'!G21:H21))/4))","v":""},{"$f":"IF(ISERROR(('TTHM GOAL CALC'!J21*2+SUM('TTHM GOAL CALC'!H21:I21))/4),\"\",(('TTHM GOAL CALC'!J21*2+SUM('TTHM GOAL CALC'!H21:I21))/4))","v":""},{"$f":"IF(ISERROR(('TTHM GOAL CALC'!K21*2+SUM('TTHM GOAL CALC'!I21:J21))/4),\"\",(('TTHM GOAL CALC'!K21*2+SUM('TTHM GOAL CALC'!I21:J21))/4))","v":""},{"$f":"IF(ISERROR(('TTHM GOAL CALC'!L21*2+SUM('TTHM GOAL CALC'!J21:K21))/4),\"\",(('TTHM GOAL CALC'!L21*2+SUM('TTHM GOAL CALC'!J21:K21))/4))","v":""},{"$f":"IF(ISERROR(('TTHM GOAL CALC'!M21*2+SUM('TTHM GOAL CALC'!K21:L21))/4),\"\",(('TTHM GOAL CALC'!M21*2+SUM('TTHM GOAL CALC'!K21:L21))/4))","v":""},{"$f":"IF(ISERROR(('TTHM GOAL CALC'!N21*2+SUM('TTHM GOAL CALC'!L21:M21))/4),\"\",(('TTHM GOAL CALC'!N21*2+SUM('TTHM GOAL CALC'!L21:M21))/4))","v":""}]
[null,{"$f":"'TTHM GOAL CALC'!B52","v":"Site 4"},{"$f":"IF(ISBLANK('Site 4'!T5),\"\",'Site 4'!T5)","v":""},{"$f":"IF(ISERROR(('TTHM GOAL CALC'!F22*2+SUM('TTHM GOAL CALC'!D22:E22))/4),\"\",(('TTHM GOAL CALC'!F22*2+SUM('TTHM GOAL CALC'!D22:E22))/4))","v":""},{"$f":"IF(ISERROR(('TTHM GOAL CALC'!G22*2+SUM('TTHM GOAL CALC'!E22:F22))/4),\"\",(('TTHM GOAL CALC'!G22*2+SUM('TTHM GOAL CALC'!E22:F22))/4))","v":""},{"$f":"IF(ISERROR(('TTHM GOAL CALC'!H22*2+SUM('TTHM GOAL CALC'!F22:G22))/4),\"\",(('TTHM GOAL CALC'!H22*2+SUM('TTHM GOAL CALC'!F22:G22))/4))","v":""},{"$f":"IF(ISERROR(('TTHM GOAL CALC'!I22*2+SUM('TTHM GOAL CALC'!G22:H22))/4),\"\",(('TTHM GOAL CALC'!I22*2+SUM('TTHM GOAL CALC'!G22:H22))/4))","v":""},{"$f":"IF(ISERROR(('TTHM GOAL CALC'!J22*2+SUM('TTHM GOAL CALC'!H22:I22))/4),\"\",(('TTHM GOAL CALC'!J22*2+SUM('TTHM GOAL CALC'!H22:I22))/4))","v":""},{"$f":"IF(ISERROR(('TTHM GOAL CALC'!K22*2+SUM('TTHM GOAL CALC'!I22:J22))/4),\"\",(('TTHM GOAL CALC'!K22*2+SUM('TTHM GOAL CALC'!I22:J22))/4))","v":""},{"$f":"IF(ISERROR(('TTHM GOAL CALC'!L22*2+SUM('TTHM GOAL CALC'!J22:K22))/4),\"\",(('TTHM GOAL CALC'!L22*2+SUM('TTHM GOAL CALC'!J22:K22))/4))","v":""},{"$f":"IF(ISERROR(('TTHM GOAL CALC'!M22*2+SUM('TTHM GOAL CALC'!K22:L22))/4),\"\",(('TTHM GOAL CALC'!M22*2+SUM('TTHM GOAL CALC'!K22:L22))/4))","v":""},{"$f":"IF(ISERROR(('TTHM GOAL CALC'!N22*2+SUM('TTHM GOAL CALC'!L22:M22))/4),\"\",(('TTHM GOAL CALC'!N22*2+SUM('TTHM GOAL CALC'!L22:M22))/4))","v":""}]
[null,{"$f":"'TTHM GOAL CALC'!B53","v":"Site 5"},{"$f":"IF(ISBLANK('Site 5'!T5),\"\",'Site 5'!T5)","v":""},{"$f":"IF(ISERROR(('TTHM GOAL CALC'!F23*2+SUM('TTHM GOAL CALC'!D23:E23))/4),\"\",(('TTHM GOAL CALC'!F23*2+SUM('TTHM GOAL CALC'!D23:E23))/4))","v":""},{"$f":"IF(ISERROR(('TTHM GOAL CALC'!G23*2+SUM('TTHM GOAL CALC'!E23:F23))/4),\"\",(('TTHM GOAL CALC'!G23*2+SUM('TTHM GOAL CALC'!E23:F23))/4))","v":""},{"$f":"IF(ISERROR(('TTHM GOAL CALC'!H23*2+SUM('TTHM GOAL CALC'!F23:G23))/4),\"\",(('TTHM GOAL CALC'!H23*2+SUM('TTHM GOAL CALC'!F23:G23))/4))","v":""},{"$f":"IF(ISERROR(('TTHM GOAL CALC'!I23*2+SUM('TTHM GOAL CALC'!G23:H23))/4),\"\",(('TTHM GOAL CALC'!I23*2+SUM('TTHM GOAL CALC'!G23:H23))/4))","v":""},{"$f":"IF(ISERROR(('TTHM GOAL CALC'!J23*2+SUM('TTHM GOAL CALC'!H23:I23))/4),\"\",(('TTHM GOAL CALC'!J23*2+SUM('TTHM GOAL CALC'!H23:I23))/4))","v":""},{"$f":"IF(ISERROR(('TTHM GOAL CALC'!K23*2+SUM('TTHM GOAL CALC'!I23:J23))/4),\"\",(('TTHM GOAL CALC'!K23*2+SUM('TTHM GOAL CALC'!I23:J23))/4))","v":""},{"$f":"IF(ISERROR(('TTHM GOAL CALC'!L23*2+SUM('TTHM GOAL CALC'!J23:K23))/4),\"\",(('TTHM GOAL CALC'!L23*2+SUM('TTHM GOAL CALC'!J23:K23))/4))","v":""},{"$f":"IF(ISERROR(('TTHM GOAL CALC'!M23*2+SUM('TTHM GOAL CALC'!K23:L23))/4),\"\",(('TTHM GOAL CALC'!M23*2+SUM('TTHM GOAL CALC'!K23:L23))/4))","v":""},{"$f":"IF(ISERROR(('TTHM GOAL CALC'!N23*2+SUM('TTHM GOAL CALC'!L23:M23))/4),\"\",(('TTHM GOAL CALC'!N23*2+SUM('TTHM GOAL CALC'!L23:M23))/4))","v":""}]
[null,{"$f":"'TTHM GOAL CALC'!B54","v":"Site 6"},{"$f":"IF(ISBLANK('Site 6'!T5),\"\",'Site 6'!T5)","v":""},{"$f":"IF(ISERROR(('TTHM GOAL CALC'!F24*2+SUM('TTHM GOAL CALC'!D24:E24))/4),\"\",(('TTHM GOAL CALC'!F24*2+SUM('TTHM GOAL CALC'!D24:E24))/4))","v":""},{"$f":"IF(ISERROR(('TTHM GOAL CALC'!G24*2+SUM('TTHM GOAL CALC'!E24:F24))/4),\"\",(('TTHM GOAL CALC'!G24*2+SUM('TTHM GOAL CALC'!E24:F24))/4))","v":""},{"$f":"IF(ISERROR(('TTHM GOAL CALC'!H24*2+SUM('TTHM GOAL CALC'!F24:G24))/4),\"\",(('TTHM GOAL CALC'!H24*2+SUM('TTHM GOAL CALC'!F24:G24))/4))","v":""},{"$f":"IF(ISERROR(('TTHM GOAL CALC'!I24*2+SUM('TTHM GOAL CALC'!G24:H24))/4),\"\",(('TTHM GOAL CALC'!I24*2+SUM('TTHM GOAL CALC'!G24:H24))/4))","v":""},{"$f":"IF(ISERROR(('TTHM GOAL CALC'!J24*2+SUM('TTHM GOAL CALC'!H24:I24))/4),\"\",(('TTHM GOAL CALC'!J24*2+SUM('TTHM GOAL CALC'!H24:I24))/4))","v":""},{"$f":"IF(ISERROR(('TTHM GOAL CALC'!K24*2+SUM('TTHM GOAL CALC'!I24:J24))/4),\"\",(('TTHM GOAL CALC'!K24*2+SUM('TTHM GOAL CALC'!I24:J24))/4))","v":""},{"$f":"IF(ISERROR(('TTHM GOAL CALC'!L24*2+SUM('TTHM GOAL CALC'!J24:K24))/4),\"\",(('TTHM GOAL CALC'!L24*2+SUM('TTHM GOAL CALC'!J24:K24))/4))","v":""},{"$f":"IF(ISERROR(('TTHM GOAL CALC'!M24*2+SUM('TTHM GOAL CALC'!K24:L24))/4),\"\",(('TTHM GOAL CALC'!M24*2+SUM('TTHM GOAL CALC'!K24:L24))/4))","v":""},{"$f":"IF(ISERROR(('TTHM GOAL CALC'!N24*2+SUM('TTHM GOAL CALC'!L24:M24))/4),\"\",(('TTHM GOAL CALC'!N24*2+SUM('TTHM GOAL CALC'!L24:M24))/4))","v":""}]
[null,{"$f":"'TTHM GOAL CALC'!B55","v":"Site 7"},{"$f":"IF(ISBLANK('Site 7'!T5),\"\",'Site 7'!T5)","v":""},{"$f":"IF(ISERROR(('TTHM GOAL CALC'!F25*2+SUM('TTHM GOAL CALC'!D25:E25))/4),\"\",(('TTHM GOAL CALC'!F25*2+SUM('TTHM GOAL CALC'!D25:E25))/4))","v":""},{"$f":"IF(ISERROR(('TTHM GOAL CALC'!G25*2+SUM('TTHM GOAL CALC'!E25:F25))/4),\"\",(('TTHM GOAL CALC'!G25*2+SUM('TTHM GOAL CALC'!E25:F25))/4))","v":""},{"$f":"IF(ISERROR(('TTHM GOAL CALC'!H25*2+SUM('TTHM GOAL CALC'!F25:G25))/4),\"\",(('TTHM GOAL CALC'!H25*2+SUM('TTHM GOAL CALC'!F25:G25))/4))","v":""},{"$f":"IF(ISERROR(('TTHM GOAL CALC'!I25*2+SUM('TTHM GOAL CALC'!G25:H25))/4),\"\",(('TTHM GOAL CALC'!I25*2+SUM('TTHM GOAL CALC'!G25:H25))/4))","v":""},{"$f":"IF(ISERROR(('TTHM GOAL CALC'!J25*2+SUM('TTHM GOAL CALC'!H25:I25))/4),\"\",(('TTHM GOAL CALC'!J25*2+SUM('TTHM GOAL CALC'!H25:I25))/4))","v":""},{"$f":"IF(ISERROR(('TTHM GOAL CALC'!K25*2+SUM('TTHM GOAL CALC'!I25:J25))/4),\"\",(('TTHM GOAL CALC'!K25*2+SUM('TTHM GOAL CALC'!I25:J25))/4))","v":""},{"$f":"IF(ISERROR(('TTHM GOAL CALC'!L25*2+SUM('TTHM GOAL CALC'!J25:K25))/4),\"\",(('TTHM GOAL CALC'!L25*2+SUM('TTHM GOAL CALC'!J25:K25))/4))","v":""},{"$f":"IF(ISERROR(('TTHM GOAL CALC'!M25*2+SUM('TTHM GOAL CALC'!K25:L25))/4),\"\",(('TTHM GOAL CALC'!M25*2+SUM('TTHM GOAL CALC'!K25:L25))/4))","v":""},{"$f":"IF(ISERROR(('TTHM GOAL CALC'!N25*2+SUM('TTHM GOAL CALC'!L25:M25))/4),\"\",(('TTHM GOAL CALC'!N25*2+SUM('TTHM GOAL CALC'!L25:M25))/4))","v":""}]
[null,{"$f":"'TTHM GOAL CALC'!B56","v":"Site 8"},{"$f":"IF(ISBLANK('Site 8'!T5),\"\",'Site 8'!T5)","v":""},{"$f":"IF(ISERROR(('TTHM GOAL CALC'!F26*2+SUM('TTHM GOAL CALC'!D26:E26))/4),\"\",(('TTHM GOAL CALC'!F26*2+SUM('TTHM GOAL CALC'!D26:E26))/4))","v":""},{"$f":"IF(ISERROR(('TTHM GOAL CALC'!G26*2+SUM('TTHM GOAL CALC'!E26:F26))/4),\"\",(('TTHM GOAL CALC'!G26*2+SUM('TTHM GOAL CALC'!E26:F26))/4))","v":""},{"$f":"IF(ISERROR(('TTHM GOAL CALC'!H26*2+SUM('TTHM GOAL CALC'!F26:G26))/4),\"\",(('TTHM GOAL CALC'!H26*2+SUM('TTHM GOAL CALC'!F26:G26))/4))","v":""},{"$f":"IF(ISERROR(('TTHM GOAL CALC'!I26*2+SUM('TTHM GOAL CALC'!G26:H26))/4),\"\",(('TTHM GOAL CALC'!I26*2+SUM('TTHM GOAL CALC'!G26:H26))/4))","v":""},{"$f":"IF(ISERROR(('TTHM GOAL CALC'!J26*2+SUM('TTHM GOAL CALC'!H26:I26))/4),\"\",(('TTHM GOAL CALC'!J26*2+SUM('TTHM GOAL CALC'!H26:I26))/4))","v":""},{"$f":"IF(ISERROR(('TTHM GOAL CALC'!K26*2+SUM('TTHM GOAL CALC'!I26:J26))/4),\"\",(('TTHM GOAL CALC'!K26*2+SUM('TTHM GOAL CALC'!I26:J26))/4))","v":""},{"$f":"IF(ISERROR(('TTHM GOAL CALC'!L26*2+SUM('TTHM GOAL CALC'!J26:K26))/4),\"\",(('TTHM GOAL CALC'!L26*2+SUM('TTHM GOAL CALC'!J26:K26))/4))","v":""},{"$f":"IF(ISERROR(('TTHM GOAL CALC'!M26*2+SUM('TTHM GOAL CALC'!K26:L26))/4),\"\",(('TTHM GOAL CALC'!M26*2+SUM('TTHM GOAL CALC'!K26:L26))/4))","v":""},{"$f":"IF(ISERROR(('TTHM GOAL CALC'!N26*2+SUM('TTHM GOAL CALC'!L26:M26))/4),\"\",(('TTHM GOAL CALC'!N26*2+SUM('TTHM GOAL CALC'!L26:M26))/4))","v":""}]
[null,{"$f":"'TTHM GOAL CALC'!B57","v":"Site 9"},{"$f":"IF(ISBLANK('Site 9'!T5),\"\",'Site 9'!T5)","v":""},{"$f":"IF(ISERROR(('TTHM GOAL CALC'!F27*2+SUM('TTHM GOAL CALC'!D27:E27))/4),\"\",(('TTHM GOAL CALC'!F27*2+SUM('TTHM GOAL CALC'!D27:E27))/4))","v":""},{"$f":"IF(ISERROR(('TTHM GOAL CALC'!G27*2+SUM('TTHM GOAL CALC'!E27:F27))/4),\"\",(('TTHM GOAL CALC'!G27*2+SUM('TTHM GOAL CALC'!E27:F27))/4))","v":""},{"$f":"IF(ISERROR(('TTHM GOAL CALC'!H27*2+SUM('TTHM GOAL CALC'!F27:G27))/4),\"\",(('TTHM GOAL CALC'!H27*2+SUM('TTHM GOAL CALC'!F27:G27))/4))","v":""},{"$f":"IF(ISERROR(('TTHM GOAL CALC'!I27*2+SUM('TTHM GOAL CALC'!G27:H27))/4),\"\",(('TTHM GOAL CALC'!I27*2+SUM('TTHM GOAL CALC'!G27:H27))/4))","v":""},{"$f":"IF(ISERROR(('TTHM GOAL CALC'!J27*2+SUM('TTHM GOAL CALC'!H27:I27))/4),\"\",(('TTHM GOAL CALC'!J27*2+SUM('TTHM GOAL CALC'!H27:I27))/4))","v":""},{"$f":"IF(ISERROR(('TTHM GOAL CALC'!K27*2+SUM('TTHM GOAL CALC'!I27:J27))/4),\"\",(('TTHM GOAL CALC'!K27*2+SUM('TTHM GOAL CALC'!I27:J27))/4))","v":""},{"$f":"IF(ISERROR(('TTHM GOAL CALC'!L27*2+SUM('TTHM GOAL CALC'!J27:K27))/4),\"\",(('TTHM GOAL CALC'!L27*2+SUM('TTHM GOAL CALC'!J27:K27))/4))","v":""},{"$f":"IF(ISERROR(('TTHM GOAL CALC'!M27*2+SUM('TTHM GOAL CALC'!K27:L27))/4),\"\",(('TTHM GOAL CALC'!M27*2+SUM('TTHM GOAL CALC'!K27:L27))/4))","v":""},{"$f":"IF(ISERROR(('TTHM GOAL CALC'!N27*2+SUM('TTHM GOAL CALC'!L27:M27))/4),\"\",(('TTHM GOAL CALC'!N27*2+SUM('TTHM GOAL CALC'!L27:M27))/4))","v":""}]
[null,{"$f":"'TTHM GOAL CALC'!B58","v":"Site 10"},{"$f":"IF(ISBLANK('Site 10'!T5),\"\",'Site 10'!T5)","v":""},{"$f":"IF(ISERROR(('TTHM GOAL CALC'!F28*2+SUM('TTHM GOAL CALC'!D28:E28))/4),\"\",(('TTHM GOAL CALC'!F28*2+SUM('TTHM GOAL CALC'!D28:E28))/4))","v":""},{"$f":"IF(ISERROR(('TTHM GOAL CALC'!G28*2+SUM('TTHM GOAL CALC'!E28:F28))/4),\"\",(('TTHM GOAL CALC'!G28*2+SUM('TTHM GOAL CALC'!E28:F28))/4))","v":""},{"$f":"IF(ISERROR(('TTHM GOAL CALC'!H28*2+SUM('TTHM GOAL CALC'!F28:G28))/4),\"\",(('TTHM GOAL CALC'!H28*2+SUM('TTHM GOAL CALC'!F28:G28))/4))","v":""},{"$f":"IF(ISERROR(('TTHM GOAL CALC'!I28*2+SUM('TTHM GOAL CALC'!G28:H28))/4),\"\",(('TTHM GOAL CALC'!I28*2+SUM('TTHM GOAL CALC'!G28:H28))/4))","v":""},{"$f":"IF(ISERROR(('TTHM GOAL CALC'!J28*2+SUM('TTHM GOAL CALC'!H28:I28))/4),\"\",(('TTHM GOAL CALC'!J28*2+SUM('TTHM GOAL CALC'!H28:I28))/4))","v":""},{"$f":"IF(ISERROR(('TTHM GOAL CALC'!K28*2+SUM('TTHM GOAL CALC'!I28:J28))/4),\"\",(('TTHM GOAL CALC'!K28*2+SUM('TTHM GOAL CALC'!I28:J28))/4))","v":""},{"$f":"IF(ISERROR(('TTHM GOAL CALC'!L28*2+SUM('TTHM GOAL CALC'!J28:K28))/4),\"\",(('TTHM GOAL CALC'!L28*2+SUM('TTHM GOAL CALC'!J28:K28))/4))","v":""},{"$f":"IF(ISERROR(('TTHM GOAL CALC'!M28*2+SUM('TTHM GOAL CALC'!K28:L28))/4),\"\",(('TTHM GOAL CALC'!M28*2+SUM('TTHM GOAL CALC'!K28:L28))/4))","v":""},{"$f":"IF(ISERROR(('TTHM GOAL CALC'!N28*2+SUM('TTHM GOAL CALC'!L28:M28))/4),\"\",(('TTHM GOAL CALC'!N28*2+SUM('TTHM GOAL CALC'!L28:M28))/4))","v":""}]
[null,{"$f":"'TTHM GOAL CALC'!B59","v":"Site 11"},{"$f":"IF(ISBLANK('Site 11'!T5),\"\",'Site 11'!T5)","v":""},{"$f":"IF(ISERROR(('TTHM GOAL CALC'!F29*2+SUM('TTHM GOAL CALC'!D29:E29))/4),\"\",(('TTHM GOAL CALC'!F29*2+SUM('TTHM GOAL CALC'!D29:E29))/4))","v":""},{"$f":"IF(ISERROR(('TTHM GOAL CALC'!G29*2+SUM('TTHM GOAL CALC'!E29:F29))/4),\"\",(('TTHM GOAL CALC'!G29*2+SUM('TTHM GOAL CALC'!E29:F29))/4))","v":""},{"$f":"IF(ISERROR(('TTHM GOAL CALC'!H29*2+SUM('TTHM GOAL CALC'!F29:G29))/4),\"\",(('TTHM GOAL CALC'!H29*2+SUM('TTHM GOAL CALC'!F29:G29))/4))","v":""},{"$f":"IF(ISERROR(('TTHM GOAL CALC'!I29*2+SUM('TTHM GOAL CALC'!G29:H29))/4),\"\",(('TTHM GOAL CALC'!I29*2+SUM('TTHM GOAL CALC'!G29:H29))/4))","v":""},{"$f":"IF(ISERROR(('TTHM GOAL CALC'!J29*2+SUM('TTHM GOAL CALC'!H29:I29))/4),\"\",(('TTHM GOAL CALC'!J29*2+SUM('TTHM GOAL CALC'!H29:I29))/4))","v":""},{"$f":"IF(ISERROR(('TTHM GOAL CALC'!K29*2+SUM('TTHM GOAL CALC'!I29:J29))/4),\"\",(('TTHM GOAL CALC'!K29*2+SUM('TTHM GOAL CALC'!I29:J29))/4))","v":""},{"$f":"IF(ISERROR(('TTHM GOAL CALC'!L29*2+SUM('TTHM GOAL CALC'!J29:K29))/4),\"\",(('TTHM GOAL CALC'!L29*2+SUM('TTHM GOAL CALC'!J29:K29))/4))","v":""},{"$f":"IF(ISERROR(('TTHM GOAL CALC'!M29*2+SUM('TTHM GOAL CALC'!K29:L29))/4),\"\",(('TTHM GOAL CALC'!M29*2+SUM('TTHM GOAL CALC'!K29:L29))/4))","v":""},{"$f":"IF(ISERROR(('TTHM GOAL CALC'!N29*2+SUM('TTHM GOAL CALC'!L29:M29))/4),\"\",(('TTHM GOAL CALC'!N29*2+SUM('TTHM GOAL CALC'!L29:M29))/4))","v":""}]
[null,{"$f":"'TTHM GOAL CALC'!B60","v":"Site 12"},{"$f":"IF(ISBLANK('Site 12'!T5),\"\",'Site 12'!T5)","v":""},{"$f":"IF(ISERROR(('TTHM GOAL CALC'!F30*2+SUM('TTHM GOAL CALC'!D30:E30))/4),\"\",(('TTHM GOAL CALC'!F30*2+SUM('TTHM GOAL CALC'!D30:E30))/4))","v":""},{"$f":"IF(ISERROR(('TTHM GOAL CALC'!G30*2+SUM('TTHM GOAL CALC'!E30:F30))/4),\"\",(('TTHM GOAL CALC'!G30*2+SUM('TTHM GOAL CALC'!E30:F30))/4))","v":""},{"$f":"IF(ISERROR(('TTHM GOAL CALC'!H30*2+SUM('TTHM GOAL CALC'!F30:G30))/4),\"\",(('TTHM GOAL CALC'!H30*2+SUM('TTHM GOAL CALC'!F30:G30))/4))","v":""},{"$f":"IF(ISERROR(('TTHM GOAL CALC'!I30*2+SUM('TTHM GOAL CALC'!G30:H30))/4),\"\",(('TTHM GOAL CALC'!I30*2+SUM('TTHM GOAL CALC'!G30:H30))/4))","v":""},{"$f":"IF(ISERROR(('TTHM GOAL CALC'!J30*2+SUM('TTHM GOAL CALC'!H30:I30))/4),\"\",(('TTHM GOAL CALC'!J30*2+SUM('TTHM GOAL CALC'!H30:I30))/4))","v":""},{"$f":"IF(ISERROR(('TTHM GOAL CALC'!K30*2+SUM('TTHM GOAL CALC'!I30:J30))/4),\"\",(('TTHM GOAL CALC'!K30*2+SUM('TTHM GOAL CALC'!I30:J30))/4))","v":""},{"$f":"IF(ISERROR(('TTHM GOAL CALC'!L30*2+SUM('TTHM GOAL CALC'!J30:K30))/4),\"\",(('TTHM GOAL CALC'!L30*2+SUM('TTHM GOAL CALC'!J30:K30))/4))","v":""},{"$f":"IF(ISERROR(('TTHM GOAL CALC'!M30*2+SUM('TTHM GOAL CALC'!K30:L30))/4),\"\",(('TTHM GOAL CALC'!M30*2+SUM('TTHM GOAL CALC'!K30:L30))/4))","v":""},{"$f":"IF(ISERROR(('TTHM GOAL CALC'!N30*2+SUM('TTHM GOAL CALC'!L30:M30))/4),\"\",(('TTHM GOAL CALC'!N30*2+SUM('TTHM GOAL CALC'!L30:M30))/4))","v":""}]
[null,{"$f":"'TTHM GOAL CALC'!B61","v":"Site 13"},{"$f":"IF(ISBLANK('Site 13'!T5),\"\",'Site 13'!T5)","v":""},{"$f":"IF(ISERROR(('TTHM GOAL CALC'!F31*2+SUM('TTHM GOAL CALC'!D31:E31))/4),\"\",(('TTHM GOAL CALC'!F31*2+SUM('TTHM GOAL CALC'!D31:E31))/4))","v":""},{"$f":"IF(ISERROR(('TTHM GOAL CALC'!G31*2+SUM('TTHM GOAL CALC'!E31:F31))/4),\"\",(('TTHM GOAL CALC'!G31*2+SUM('TTHM GOAL CALC'!E31:F31))/4))","v":""},{"$f":"IF(ISERROR(('TTHM GOAL CALC'!H31*2+SUM('TTHM GOAL CALC'!F31:G31))/4),\"\",(('TTHM GOAL CALC'!H31*2+SUM('TTHM GOAL CALC'!F31:G31))/4))","v":""},{"$f":"IF(ISERROR(('TTHM GOAL CALC'!I31*2+SUM('TTHM GOAL CALC'!G31:H31))/4),\"\",(('TTHM GOAL CALC'!I31*2+SUM('TTHM GOAL CALC'!G31:H31))/4))","v":""},{"$f":"IF(ISERROR(('TTHM GOAL CALC'!J31*2+SUM('TTHM GOAL CALC'!H31:I31))/4),\"\",(('TTHM GOAL CALC'!J31*2+SUM('TTHM GOAL CALC'!H31:I31))/4))","v":""},{"$f":"IF(ISERROR(('TTHM GOAL CALC'!K31*2+SUM('TTHM GOAL CALC'!I31:J31))/4),\"\",(('TTHM GOAL CALC'!K31*2+SUM('TTHM GOAL CALC'!I31:J31))/4))","v":""},{"$f":"IF(ISERROR(('TTHM GOAL CALC'!L31*2+SUM('TTHM GOAL CALC'!J31:K31))/4),\"\",(('TTHM GOAL CALC'!L31*2+SUM('TTHM GOAL CALC'!J31:K31))/4))","v":""},{"$f":"IF(ISERROR(('TTHM GOAL CALC'!M31*2+SUM('TTHM GOAL CALC'!K31:L31))/4),\"\",(('TTHM GOAL CALC'!M31*2+SUM('TTHM GOAL CALC'!K31:L31))/4))","v":""},{"$f":"IF(ISERROR(('TTHM GOAL CALC'!N31*2+SUM('TTHM GOAL CALC'!L31:M31))/4),\"\",(('TTHM GOAL CALC'!N31*2+SUM('TTHM GOAL CALC'!L31:M31))/4))","v":""}]
[null,{"$f":"'TTHM GOAL CALC'!B62","v":"Site 14"},{"$f":"IF(ISBLANK('Site 14'!T5),\"\",'Site 14'!T5)","v":""},{"$f":"IF(ISERROR(('TTHM GOAL CALC'!F32*2+SUM('TTHM GOAL CALC'!D32:E32))/4),\"\",(('TTHM GOAL CALC'!F32*2+SUM('TTHM GOAL CALC'!D32:E32))/4))","v":""},{"$f":"IF(ISERROR(('TTHM GOAL CALC'!G32*2+SUM('TTHM GOAL CALC'!E32:F32))/4),\"\",(('TTHM GOAL CALC'!G32*2+SUM('TTHM GOAL CALC'!E32:F32))/4))","v":""},{"$f":"IF(ISERROR(('TTHM GOAL CALC'!H32*2+SUM('TTHM GOAL CALC'!F32:G32))/4),\"\",(('TTHM GOAL CALC'!H32*2+SUM('TTHM GOAL CALC'!F32:G32))/4))","v":""},{"$f":"IF(ISERROR(('TTHM GOAL CALC'!I32*2+SUM('TTHM GOAL CALC'!G32:H32))/4),\"\",(('TTHM GOAL CALC'!I32*2+SUM('TTHM GOAL CALC'!G32:H32))/4))","v":""},{"$f":"IF(ISERROR(('TTHM GOAL CALC'!J32*2+SUM('TTHM GOAL CALC'!H32:I32))/4),\"\",(('TTHM GOAL CALC'!J32*2+SUM('TTHM GOAL CALC'!H32:I32))/4))","v":""},{"$f":"IF(ISERROR(('TTHM GOAL CALC'!K32*2+SUM('TTHM GOAL CALC'!I32:J32))/4),\"\",(('TTHM GOAL CALC'!K32*2+SUM('TTHM GOAL CALC'!I32:J32))/4))","v":""},{"$f":"IF(ISERROR(('TTHM GOAL CALC'!L32*2+SUM('TTHM GOAL CALC'!J32:K32))/4),\"\",(('TTHM GOAL CALC'!L32*2+SUM('TTHM GOAL CALC'!J32:K32))/4))","v":""},{"$f":"IF(ISERROR(('TTHM GOAL CALC'!M32*2+SUM('TTHM GOAL CALC'!K32:L32))/4),\"\",(('TTHM GOAL CALC'!M32*2+SUM('TTHM GOAL CALC'!K32:L32))/4))","v":""},{"$f":"IF(ISERROR(('TTHM GOAL CALC'!N32*2+SUM('TTHM GOAL CALC'!L32:M32))/4),\"\",(('TTHM GOAL CALC'!N32*2+SUM('TTHM GOAL CALC'!L32:M32))/4))","v":""}]
[null,{"$f":"'TTHM GOAL CALC'!B63","v":"Site 15"},{"$f":"IF(ISBLANK('Site 15'!T5),\"\",'Site 15'!T5)","v":""},{"$f":"IF(ISERROR(('TTHM GOAL CALC'!F33*2+SUM('TTHM GOAL CALC'!D33:E33))/4),\"\",(('TTHM GOAL CALC'!F33*2+SUM('TTHM GOAL CALC'!D33:E33))/4))","v":""},{"$f":"IF(ISERROR(('TTHM GOAL CALC'!G33*2+SUM('TTHM GOAL CALC'!E33:F33))/4),\"\",(('TTHM GOAL CALC'!G33*2+SUM('TTHM GOAL CALC'!E33:F33))/4))","v":""},{"$f":"IF(ISERROR(('TTHM GOAL CALC'!H33*2+SUM('TTHM GOAL CALC'!F33:G33))/4),\"\",(('TTHM GOAL CALC'!H33*2+SUM('TTHM GOAL CALC'!F33:G33))/4))","v":""},{"$f":"IF(ISERROR(('TTHM GOAL CALC'!I33*2+SUM('TTHM GOAL CALC'!G33:H33))/4),\"\",(('TTHM GOAL CALC'!I33*2+SUM('TTHM GOAL CALC'!G33:H33))/4))","v":""},{"$f":"IF(ISERROR(('TTHM GOAL CALC'!J33*2+SUM('TTHM GOAL CALC'!H33:I33))/4),\"\",(('TTHM GOAL CALC'!J33*2+SUM('TTHM GOAL CALC'!H33:I33))/4))","v":""},{"$f":"IF(ISERROR(('TTHM GOAL CALC'!K33*2+SUM('TTHM GOAL CALC'!I33:J33))/4),\"\",(('TTHM GOAL CALC'!K33*2+SUM('TTHM GOAL CALC'!I33:J33))/4))","v":""},{"$f":"IF(ISERROR(('TTHM GOAL CALC'!L33*2+SUM('TTHM GOAL CALC'!J33:K33))/4),\"\",(('TTHM GOAL CALC'!L33*2+SUM('TTHM GOAL CALC'!J33:K33))/4))","v":""},{"$f":"IF(ISERROR(('TTHM GOAL CALC'!M33*2+SUM('TTHM GOAL CALC'!K33:L33))/4),\"\",(('TTHM GOAL CALC'!M33*2+SUM('TTHM GOAL CALC'!K33:L33))/4))","v":""},{"$f":"IF(ISERROR(('TTHM GOAL CALC'!N33*2+SUM('TTHM GOAL CALC'!L33:M33))/4),\"\",(('TTHM GOAL CALC'!N33*2+SUM('TTHM GOAL CALC'!L33:M33))/4))","v":""}]
[null,{"$f":"'TTHM GOAL CALC'!B64","v":"Site 16"},{"$f":"IF(ISBLANK('Site 16'!T5),\"\",'Site 16'!T5)","v":""},{"$f":"IF(ISERROR(('TTHM GOAL CALC'!F34*2+SUM('TTHM GOAL CALC'!D34:E34))/4),\"\",(('TTHM GOAL CALC'!F34*2+SUM('TTHM GOAL CALC'!D34:E34))/4))","v":""},{"$f":"IF(ISERROR(('TTHM GOAL CALC'!G34*2+SUM('TTHM GOAL CALC'!E34:F34))/4),\"\",(('TTHM GOAL CALC'!G34*2+SUM('TTHM GOAL CALC'!E34:F34))/4))","v":""},{"$f":"IF(ISERROR(('TTHM GOAL CALC'!H34*2+SUM('TTHM GOAL CALC'!F34:G34))/4),\"\",(('TTHM GOAL CALC'!H34*2+SUM('TTHM GOAL CALC'!F34:G34))/4))","v":""},{"$f":"IF(ISERROR(('TTHM GOAL CALC'!I34*2+SUM('TTHM GOAL CALC'!G34:H34))/4),\"\",(('TTHM GOAL CALC'!I34*2+SUM('TTHM GOAL CALC'!G34:H34))/4))","v":""},{"$f":"IF(ISERROR(('TTHM GOAL CALC'!J34*2+SUM('TTHM GOAL CALC'!H34:I34))/4),\"\",(('TTHM GOAL CALC'!J34*2+SUM('TTHM GOAL CALC'!H34:I34))/4))","v":""},{"$f":"IF(ISERROR(('TTHM GOAL CALC'!K34*2+SUM('TTHM GOAL CALC'!I34:J34))/4),\"\",(('TTHM GOAL CALC'!K34*2+SUM('TTHM GOAL CALC'!I34:J34))/4))","v":""},{"$f":"IF(ISERROR(('TTHM GOAL CALC'!L34*2+SUM('TTHM GOAL CALC'!J34:K34))/4),\"\",(('TTHM GOAL CALC'!L34*2+SUM('TTHM GOAL CALC'!J34:K34))/4))","v":""},{"$f":"IF(ISERROR(('TTHM GOAL CALC'!M34*2+SUM('TTHM GOAL CALC'!K34:L34))/4),\"\",(('TTHM GOAL CALC'!M34*2+SUM('TTHM GOAL CALC'!K34:L34))/4))","v":""},{"$f":"IF(ISERROR(('TTHM GOAL CALC'!N34*2+SUM('TTHM GOAL CALC'!L34:M34))/4),\"\",(('TTHM GOAL CALC'!N34*2+SUM('TTHM GOAL CALC'!L34:M34))/4))","v":""}]
[null,{"$f":"'TTHM GOAL CALC'!B65","v":"Site 17"},{"$f":"IF(ISBLANK('Site 17'!T5),\"\",'Site 17'!T5)","v":""},{"$f":"IF(ISERROR(('TTHM GOAL CALC'!F35*2+SUM('TTHM GOAL CALC'!D35:E35))/4),\"\",(('TTHM GOAL CALC'!F35*2+SUM('TTHM GOAL CALC'!D35:E35))/4))","v":""},{"$f":"IF(ISERROR(('TTHM GOAL CALC'!G35*2+SUM('TTHM GOAL CALC'!E35:F35))/4),\"\",(('TTHM GOAL CALC'!G35*2+SUM('TTHM GOAL CALC'!E35:F35))/4))","v":""},{"$f":"IF(ISERROR(('TTHM GOAL CALC'!H35*2+SUM('TTHM GOAL CALC'!F35:G35))/4),\"\",(('TTHM GOAL CALC'!H35*2+SUM('TTHM GOAL CALC'!F35:G35))/4))","v":""},{"$f":"IF(ISERROR(('TTHM GOAL CALC'!I35*2+SUM('TTHM GOAL CALC'!G35:H35))/4),\"\",(('TTHM GOAL CALC'!I35*2+SUM('TTHM GOAL CALC'!G35:H35))/4))","v":""},{"$f":"IF(ISERROR(('TTHM GOAL CALC'!J35*2+SUM('TTHM GOAL CALC'!H35:I35))/4),\"\",(('TTHM GOAL CALC'!J35*2+SUM('TTHM GOAL CALC'!H35:I35))/4))","v":""},{"$f":"IF(ISERROR(('TTHM GOAL CALC'!K35*2+SUM('TTHM GOAL CALC'!I35:J35))/4),\"\",(('TTHM GOAL CALC'!K35*2+SUM('TTHM GOAL CALC'!I35:J35))/4))","v":""},{"$f":"IF(ISERROR(('TTHM GOAL CALC'!L35*2+SUM('TTHM GOAL CALC'!J35:K35))/4),\"\",(('TTHM GOAL CALC'!L35*2+SUM('TTHM GOAL CALC'!J35:K35))/4))","v":""},{"$f":"IF(ISERROR(('TTHM GOAL CALC'!M35*2+SUM('TTHM GOAL CALC'!K35:L35))/4),\"\",(('TTHM GOAL CALC'!M35*2+SUM('TTHM GOAL CALC'!K35:L35))/4))","v":""},{"$f":"IF(ISERROR(('TTHM GOAL CALC'!N35*2+SUM('TTHM GOAL CALC'!L35:M35))/4),\"\",(('TTHM GOAL CALC'!N35*2+SUM('TTHM GOAL CALC'!L35:M35))/4))","v":""}]
[null,{"$f":"'TTHM GOAL CALC'!B66","v":"Site 18"},{"$f":"IF(ISBLANK('Site 18'!T5),\"\",'Site 18'!T5)","v":""},{"$f":"IF(ISERROR(('TTHM GOAL CALC'!F36*2+SUM('TTHM GOAL CALC'!D36:E36))/4),\"\",(('TTHM GOAL CALC'!F36*2+SUM('TTHM GOAL CALC'!D36:E36))/4))","v":""},{"$f":"IF(ISERROR(('TTHM GOAL CALC'!G36*2+SUM('TTHM GOAL CALC'!E36:F36))/4),\"\",(('TTHM GOAL CALC'!G36*2+SUM('TTHM GOAL CALC'!E36:F36))/4))","v":""},{"$f":"IF(ISERROR(('TTHM GOAL CALC'!H36*2+SUM('TTHM GOAL CALC'!F36:G36))/4),\"\",(('TTHM GOAL CALC'!H36*2+SUM('TTHM GOAL CALC'!F36:G36))/4))","v":""},{"$f":"IF(ISERROR(('TTHM GOAL CALC'!I36*2+SUM('TTHM GOAL CALC'!G36:H36))/4),\"\",(('TTHM GOAL CALC'!I36*2+SUM('TTHM GOAL CALC'!G36:H36))/4))","v":""},{"$f":"IF(ISERROR(('TTHM GOAL CALC'!J36*2+SUM('TTHM GOAL CALC'!H36:I36))/4),\"\",(('TTHM GOAL CALC'!J36*2+SUM('TTHM GOAL CALC'!H36:I36))/4))","v":""},{"$f":"IF(ISERROR(('TTHM GOAL CALC'!K36*2+SUM('TTHM GOAL CALC'!I36:J36))/4),\"\",(('TTHM GOAL CALC'!K36*2+SUM('TTHM GOAL CALC'!I36:J36))/4))","v":""},{"$f":"IF(ISERROR(('TTHM GOAL CALC'!L36*2+SUM('TTHM GOAL CALC'!J36:K36))/4),\"\",(('TTHM GOAL CALC'!L36*2+SUM('TTHM GOAL CALC'!J36:K36))/4))","v":""},{"$f":"IF(ISERROR(('TTHM GOAL CALC'!M36*2+SUM('TTHM GOAL CALC'!K36:L36))/4),\"\",(('TTHM GOAL CALC'!M36*2+SUM('TTHM GOAL CALC'!K36:L36))/4))","v":""},{"$f":"IF(ISERROR(('TTHM GOAL CALC'!N36*2+SUM('TTHM GOAL CALC'!L36:M36))/4),\"\",(('TTHM GOAL CALC'!N36*2+SUM('TTHM GOAL CALC'!L36:M36))/4))","v":""}]
[null,{"$f":"'TTHM GOAL CALC'!B67","v":"Site 19"},{"$f":"IF(ISBLANK('Site 19'!T5),\"\",'Site 19'!T5)","v":""},{"$f":"IF(ISERROR(('TTHM GOAL CALC'!F37*2+SUM('TTHM GOAL CALC'!D37:E37))/4),\"\",(('TTHM GOAL CALC'!F37*2+SUM('TTHM GOAL CALC'!D37:E37))/4))","v":""},{"$f":"IF(ISERROR(('TTHM GOAL CALC'!G37*2+SUM('TTHM GOAL CALC'!E37:F37))/4),\"\",(('TTHM GOAL CALC'!G37*2+SUM('TTHM GOAL CALC'!E37:F37))/4))","v":""},{"$f":"IF(ISERROR(('TTHM GOAL CALC'!H37*2+SUM('TTHM GOAL CALC'!F37:G37))/4),\"\",(('TTHM GOAL CALC'!H37*2+SUM('TTHM GOAL CALC'!F37:G37))/4))","v":""},{"$f":"IF(ISERROR(('TTHM GOAL CALC'!I37*2+SUM('TTHM GOAL CALC'!G37:H37))/4),\"\",(('TTHM GOAL CALC'!I37*2+SUM('TTHM GOAL CALC'!G37:H37))/4))","v":""},{"$f":"IF(ISERROR(('TTHM GOAL CALC'!J37*2+SUM('TTHM GOAL CALC'!H37:I37))/4),\"\",(('TTHM GOAL CALC'!J37*2+SUM('TTHM GOAL CALC'!H37:I37))/4))","v":""},{"$f":"IF(ISERROR(('TTHM GOAL CALC'!K37*2+SUM('TTHM GOAL CALC'!I37:J37))/4),\"\",(('TTHM GOAL CALC'!K37*2+SUM('TTHM GOAL CALC'!I37:J37))/4))","v":""},{"$f":"IF(ISERROR(('TTHM GOAL CALC'!L37*2+SUM('TTHM GOAL CALC'!J37:K37))/4),\"\",(('TTHM GOAL CALC'!L37*2+SUM('TTHM GOAL CALC'!J37:K37))/4))","v":""},{"$f":"IF(ISERROR(('TTHM GOAL CALC'!M37*2+SUM('TTHM GOAL CALC'!K37:L37))/4),\"\",(('TTHM GOAL CALC'!M37*2+SUM('TTHM GOAL CALC'!K37:L37))/4))","v":""},{"$f":"IF(ISERROR(('TTHM GOAL CALC'!N37*2+SUM('TTHM GOAL CALC'!L37:M37))/4),\"\",(('TTHM GOAL CALC'!N37*2+SUM('TTHM GOAL CALC'!L37:M37))/4))","v":""}]
[null,{"$f":"'TTHM GOAL CALC'!B68","v":"Site 20"},{"$f":"IF(ISBLANK('Site 20'!T5),\"\",'Site 20'!T5)","v":""},{"$f":"IF(ISERROR(('TTHM GOAL CALC'!F38*2+SUM('TTHM GOAL CALC'!D38:E38))/4),\"\",(('TTHM GOAL CALC'!F38*2+SUM('TTHM GOAL CALC'!D38:E38))/4))","v":""},{"$f":"IF(ISERROR(('TTHM GOAL CALC'!G38*2+SUM('TTHM GOAL CALC'!E38:F38))/4),\"\",(('TTHM GOAL CALC'!G38*2+SUM('TTHM GOAL CALC'!E38:F38))/4))","v":""},{"$f":"IF(ISERROR(('TTHM GOAL CALC'!H38*2+SUM('TTHM GOAL CALC'!F38:G38))/4),\"\",(('TTHM GOAL CALC'!H38*2+SUM('TTHM GOAL CALC'!F38:G38))/4))","v":""},{"$f":"IF(ISERROR(('TTHM GOAL CALC'!I38*2+SUM('TTHM GOAL CALC'!G38:H38))/4),\"\",(('TTHM GOAL CALC'!I38*2+SUM('TTHM GOAL CALC'!G38:H38))/4))","v":""},{"$f":"IF(ISERROR(('TTHM GOAL CALC'!J38*2+SUM('TTHM GOAL CALC'!H38:I38))/4),\"\",(('TTHM GOAL CALC'!J38*2+SUM('TTHM GOAL CALC'!H38:I38))/4))","v":""},{"$f":"IF(ISERROR(('TTHM GOAL CALC'!K38*2+SUM('TTHM GOAL CALC'!I38:J38))/4),\"\",(('TTHM GOAL CALC'!K38*2+SUM('TTHM GOAL CALC'!I38:J38))/4))","v":""},{"$f":"IF(ISERROR(('TTHM GOAL CALC'!L38*2+SUM('TTHM GOAL CALC'!J38:K38))/4),\"\",(('TTHM GOAL CALC'!L38*2+SUM('TTHM GOAL CALC'!J38:K38))/4))","v":""},{"$f":"IF(ISERROR(('TTHM GOAL CALC'!M38*2+SUM('TTHM GOAL CALC'!K38:L38))/4),\"\",(('TTHM GOAL CALC'!M38*2+SUM('TTHM GOAL CALC'!K38:L38))/4))","v":""},{"$f":"IF(ISERROR(('TTHM GOAL CALC'!N38*2+SUM('TTHM GOAL CALC'!L38:M38))/4),\"\",(('TTHM GOAL CALC'!N38*2+SUM('TTHM GOAL CALC'!L38:M38))/4))","v":""}]
[null,{"$f":"'TTHM GOAL CALC'!B69","v":"Site 21"},{"$f":"IF(ISBLANK('Site 21'!T5),\"\",'Site 21'!T5)","v":""},{"$f":"IF(ISERROR(('TTHM GOAL CALC'!F39*2+SUM('TTHM GOAL CALC'!D39:E39))/4),\"\",(('TTHM GOAL CALC'!F39*2+SUM('TTHM GOAL CALC'!D39:E39))/4))","v":""},{"$f":"IF(ISERROR(('TTHM GOAL CALC'!G39*2+SUM('TTHM GOAL CALC'!E39:F39))/4),\"\",(('TTHM GOAL CALC'!G39*2+SUM('TTHM GOAL CALC'!E39:F39))/4))","v":""},{"$f":"IF(ISERROR(('TTHM GOAL CALC'!H39*2+SUM('TTHM GOAL CALC'!F39:G39))/4),\"\",(('TTHM GOAL CALC'!H39*2+SUM('TTHM GOAL CALC'!F39:G39))/4))","v":""},{"$f":"IF(ISERROR(('TTHM GOAL CALC'!I39*2+SUM('TTHM GOAL CALC'!G39:H39))/4),\"\",(('TTHM GOAL CALC'!I39*2+SUM('TTHM GOAL CALC'!G39:H39))/4))","v":""},{"$f":"IF(ISERROR(('TTHM GOAL CALC'!J39*2+SUM('TTHM GOAL CALC'!H39:I39))/4),\"\",(('TTHM GOAL CALC'!J39*2+SUM('TTHM GOAL CALC'!H39:I39))/4))","v":""},{"$f":"IF(ISERROR(('TTHM GOAL CALC'!K39*2+SUM('TTHM GOAL CALC'!I39:J39))/4),\"\",(('TTHM GOAL CALC'!K39*2+SUM('TTHM GOAL CALC'!I39:J39))/4))","v":""},{"$f":"IF(ISERROR(('TTHM GOAL CALC'!L39*2+SUM('TTHM GOAL CALC'!J39:K39))/4),\"\",(('TTHM GOAL CALC'!L39*2+SUM('TTHM GOAL CALC'!J39:K39))/4))","v":""},{"$f":"IF(ISERROR(('TTHM GOAL CALC'!M39*2+SUM('TTHM GOAL CALC'!K39:L39))/4),\"\",(('TTHM GOAL CALC'!M39*2+SUM('TTHM GOAL CALC'!K39:L39))/4))","v":""},{"$f":"IF(ISERROR(('TTHM GOAL CALC'!N39*2+SUM('TTHM GOAL CALC'!L39:M39))/4),\"\",(('TTHM GOAL CALC'!N39*2+SUM('TTHM GOAL CALC'!L39:M39))/4))","v":""}]
[null,{"$f":"'TTHM GOAL CALC'!B70","v":"Site 22"},{"$f":"IF(ISBLANK('Site 22'!T5),\"\",'Site 22'!T5)","v":""},{"$f":"IF(ISERROR(('TTHM GOAL CALC'!F40*2+SUM('TTHM GOAL CALC'!D40:E40))/4),\"\",(('TTHM GOAL CALC'!F40*2+SUM('TTHM GOAL CALC'!D40:E40))/4))","v":""},{"$f":"IF(ISERROR(('TTHM GOAL CALC'!G40*2+SUM('TTHM GOAL CALC'!E40:F40))/4),\"\",(('TTHM GOAL CALC'!G40*2+SUM('TTHM GOAL CALC'!E40:F40))/4))","v":""},{"$f":"IF(ISERROR(('TTHM GOAL CALC'!H40*2+SUM('TTHM GOAL CALC'!F40:G40))/4),\"\",(('TTHM GOAL CALC'!H40*2+SUM('TTHM GOAL CALC'!F40:G40))/4))","v":""},{"$f":"IF(ISERROR(('TTHM GOAL CALC'!I40*2+SUM('TTHM GOAL CALC'!G40:H40))/4),\"\",(('TTHM GOAL CALC'!I40*2+SUM('TTHM GOAL CALC'!G40:H40))/4))","v":""},{"$f":"IF(ISERROR(('TTHM GOAL CALC'!J40*2+SUM('TTHM GOAL CALC'!H40:I40))/4),\"\",(('TTHM GOAL CALC'!J40*2+SUM('TTHM GOAL CALC'!H40:I40))/4))","v":""},{"$f":"IF(ISERROR(('TTHM GOAL CALC'!K40*2+SUM('TTHM GOAL CALC'!I40:J40))/4),\"\",(('TTHM GOAL CALC'!K40*2+SUM('TTHM GOAL CALC'!I40:J40))/4))","v":""},{"$f":"IF(ISERROR(('TTHM GOAL CALC'!L40*2+SUM('TTHM GOAL CALC'!J40:K40))/4),\"\",(('TTHM GOAL CALC'!L40*2+SUM('TTHM GOAL CALC'!J40:K40))/4))","v":""},{"$f":"IF(ISERROR(('TTHM GOAL CALC'!M40*2+SUM('TTHM GOAL CALC'!K40:L40))/4),\"\",(('TTHM GOAL CALC'!M40*2+SUM('TTHM GOAL CALC'!K40:L40))/4))","v":""},{"$f":"IF(ISERROR(('TTHM GOAL CALC'!N40*2+SUM('TTHM GOAL CALC'!L40:M40))/4),\"\",(('TTHM GOAL CALC'!N40*2+SUM('TTHM GOAL CALC'!L40:M40))/4))","v":""}]
[null,{"$f":"'TTHM GOAL CALC'!B71","v":"Site 23"},{"$f":"IF(ISBLANK('Site 23'!T5),\"\",'Site 23'!T5)","v":""},{"$f":"IF(ISERROR(('TTHM GOAL CALC'!F41*2+SUM('TTHM GOAL CALC'!D41:E41))/4),\"\",(('TTHM GOAL CALC'!F41*2+SUM('TTHM GOAL CALC'!D41:E41))/4))","v":""},{"$f":"IF(ISERROR(('TTHM GOAL CALC'!G41*2+SUM('TTHM GOAL CALC'!E41:F41))/4),\"\",(('TTHM GOAL CALC'!G41*2+SUM('TTHM GOAL CALC'!E41:F41))/4))","v":""},{"$f":"IF(ISERROR(('TTHM GOAL CALC'!H41*2+SUM('TTHM GOAL CALC'!F41:G41))/4),\"\",(('TTHM GOAL CALC'!H41*2+SUM('TTHM GOAL CALC'!F41:G41))/4))","v":""},{"$f":"IF(ISERROR(('TTHM GOAL CALC'!I41*2+SUM('TTHM GOAL CALC'!G41:H41))/4),\"\",(('TTHM GOAL CALC'!I41*2+SUM('TTHM GOAL CALC'!G41:H41))/4))","v":""},{"$f":"IF(ISERROR(('TTHM GOAL CALC'!J41*2+SUM('TTHM GOAL CALC'!H41:I41))/4),\"\",(('TTHM GOAL CALC'!J41*2+SUM('TTHM GOAL CALC'!H41:I41))/4))","v":""},{"$f":"IF(ISERROR(('TTHM GOAL CALC'!K41*2+SUM('TTHM GOAL CALC'!I41:J41))/4),\"\",(('TTHM GOAL CALC'!K41*2+SUM('TTHM GOAL CALC'!I41:J41))/4))","v":""},{"$f":"IF(ISERROR(('TTHM GOAL CALC'!L41*2+SUM('TTHM GOAL CALC'!J41:K41))/4),\"\",(('TTHM GOAL CALC'!L41*2+SUM('TTHM GOAL CALC'!J41:K41))/4))","v":""},{"$f":"IF(ISERROR(('TTHM GOAL CALC'!M41*2+SUM('TTHM GOAL CALC'!K41:L41))/4),\"\",(('TTHM GOAL CALC'!M41*2+SUM('TTHM GOAL CALC'!K41:L41))/4))","v":""},{"$f":"IF(ISERROR(('TTHM GOAL CALC'!N41*2+SUM('TTHM GOAL CALC'!L41:M41))/4),\"\",(('TTHM GOAL CALC'!N41*2+SUM('TTHM GOAL CALC'!L41:M41))/4))","v":""}]
[null,{"$f":"'TTHM GOAL CALC'!B72","v":"Site 24"},{"$f":"IF(ISBLANK('Site 24'!T5),\"\",'Site 24'!T5)","v":""},{"$f":"IF(ISERROR(('TTHM GOAL CALC'!F42*2+SUM('TTHM GOAL CALC'!D42:E42))/4),\"\",(('TTHM GOAL CALC'!F42*2+SUM('TTHM GOAL CALC'!D42:E42))/4))","v":""},{"$f":"IF(ISERROR(('TTHM GOAL CALC'!G42*2+SUM('TTHM GOAL CALC'!E42:F42))/4),\"\",(('TTHM GOAL CALC'!G42*2+SUM('TTHM GOAL CALC'!E42:F42))/4))","v":""},{"$f":"IF(ISERROR(('TTHM GOAL CALC'!H42*2+SUM('TTHM GOAL CALC'!F42:G42))/4),\"\",(('TTHM GOAL CALC'!H42*2+SUM('TTHM GOAL CALC'!F42:G42))/4))","v":""},{"$f":"IF(ISERROR(('TTHM GOAL CALC'!I42*2+SUM('TTHM GOAL CALC'!G42:H42))/4),\"\",(('TTHM GOAL CALC'!I42*2+SUM('TTHM GOAL CALC'!G42:H42))/4))","v":""},{"$f":"IF(ISERROR(('TTHM GOAL CALC'!J42*2+SUM('TTHM GOAL CALC'!H42:I42))/4),\"\",(('TTHM GOAL CALC'!J42*2+SUM('TTHM GOAL CALC'!H42:I42))/4))","v":""},{"$f":"IF(ISERROR(('TTHM GOAL CALC'!K42*2+SUM('TTHM GOAL CALC'!I42:J42))/4),\"\",(('TTHM GOAL CALC'!K42*2+SUM('TTHM GOAL CALC'!I42:J42))/4))","v":""},{"$f":"IF(ISERROR(('TTHM GOAL CALC'!L42*2+SUM('TTHM GOAL CALC'!J42:K42))/4),\"\",(('TTHM GOAL CALC'!L42*2+SUM('TTHM GOAL CALC'!J42:K42))/4))","v":""},{"$f":"IF(ISERROR(('TTHM GOAL CALC'!M42*2+SUM('TTHM GOAL CALC'!K42:L42))/4),\"\",(('TTHM GOAL CALC'!M42*2+SUM('TTHM GOAL CALC'!K42:L42))/4))","v":""},{"$f":"IF(ISERROR(('TTHM GOAL CALC'!N42*2+SUM('TTHM GOAL CALC'!L42:M42))/4),\"\",(('TTHM GOAL CALC'!N42*2+SUM('TTHM GOAL CALC'!L42:M42))/4))","v":""}]
[null,{"$f":"'TTHM GOAL CALC'!B73","v":"Site 25"},{"$f":"IF(ISBLANK('Site 25'!T5),\"\",'Site 25'!T5)","v":""},{"$f":"IF(ISERROR(('TTHM GOAL CALC'!F43*2+SUM('TTHM GOAL CALC'!D43:E43))/4),\"\",(('TTHM GOAL CALC'!F43*2+SUM('TTHM GOAL CALC'!D43:E43))/4))","v":""},{"$f":"IF(ISERROR(('TTHM GOAL CALC'!G43*2+SUM('TTHM GOAL CALC'!E43:F43))/4),\"\",(('TTHM GOAL CALC'!G43*2+SUM('TTHM GOAL CALC'!E43:F43))/4))","v":""},{"$f":"IF(ISERROR(('TTHM GOAL CALC'!H43*2+SUM('TTHM GOAL CALC'!F43:G43))/4),\"\",(('TTHM GOAL CALC'!H43*2+SUM('TTHM GOAL CALC'!F43:G43))/4))","v":""},{"$f":"IF(ISERROR(('TTHM GOAL CALC'!I43*2+SUM('TTHM GOAL CALC'!G43:H43))/4),\"\",(('TTHM GOAL CALC'!I43*2+SUM('TTHM GOAL CALC'!G43:H43))/4))","v":""},{"$f":"IF(ISERROR(('TTHM GOAL CALC'!J43*2+SUM('TTHM GOAL CALC'!H43:I43))/4),\"\",(('TTHM GOAL CALC'!J43*2+SUM('TTHM GOAL CALC'!H43:I43))/4))","v":""},{"$f":"IF(ISERROR(('TTHM GOAL CALC'!K43*2+SUM('TTHM GOAL CALC'!I43:J43))/4),\"\",(('TTHM GOAL CALC'!K43*2+SUM('TTHM GOAL CALC'!I43:J43))/4))","v":""},{"$f":"IF(ISERROR(('TTHM GOAL CALC'!L43*2+SUM('TTHM GOAL CALC'!J43:K43))/4),\"\",(('TTHM GOAL CALC'!L43*2+SUM('TTHM GOAL CALC'!J43:K43))/4))","v":""},{"$f":"IF(ISERROR(('TTHM GOAL CALC'!M43*2+SUM('TTHM GOAL CALC'!K43:L43))/4),\"\",(('TTHM GOAL CALC'!M43*2+SUM('TTHM GOAL CALC'!K43:L43))/4))","v":""},{"$f":"IF(ISERROR(('TTHM GOAL CALC'!N43*2+SUM('TTHM GOAL CALC'!L43:M43))/4),\"\",(('TTHM GOAL CALC'!N43*2+SUM('TTHM GOAL CALC'!L43:M43))/4))","v":""}]
[null,{"$f":"'TTHM GOAL CALC'!B74","v":"Site 26"},{"$f":"IF(ISBLANK('Site 26'!T5),\"\",'Site 26'!T5)","v":""},{"$f":"IF(ISERROR(('TTHM GOAL CALC'!F44*2+SUM('TTHM GOAL CALC'!D44:E44))/4),\"\",(('TTHM GOAL CALC'!F44*2+SUM('TTHM GOAL CALC'!D44:E44))/4))","v":""},{"$f":"IF(ISERROR(('TTHM GOAL CALC'!G44*2+SUM('TTHM GOAL CALC'!E44:F44))/4),\"\",(('TTHM GOAL CALC'!G44*2+SUM('TTHM GOAL CALC'!E44:F44))/4))","v":""},{"$f":"IF(ISERROR(('TTHM GOAL CALC'!H44*2+SUM('TTHM GOAL CALC'!F44:G44))/4),\"\",(('TTHM GOAL CALC'!H44*2+SUM('TTHM GOAL CALC'!F44:G44))/4))","v":""},{"$f":"IF(ISERROR(('TTHM GOAL CALC'!I44*2+SUM('TTHM GOAL CALC'!G44:H44))/4),\"\",(('TTHM GOAL CALC'!I44*2+SUM('TTHM GOAL CALC'!G44:H44))/4))","v":""},{"$f":"IF(ISERROR(('TTHM GOAL CALC'!J44*2+SUM('TTHM GOAL CALC'!H44:I44))/4),\"\",(('TTHM GOAL CALC'!J44*2+SUM('TTHM GOAL CALC'!H44:I44))/4))","v":""},{"$f":"IF(ISERROR(('TTHM GOAL CALC'!K44*2+SUM('TTHM GOAL CALC'!I44:J44))/4),\"\",(('TTHM GOAL CALC'!K44*2+SUM('TTHM GOAL CALC'!I44:J44))/4))","v":""},{"$f":"IF(ISERROR(('TTHM GOAL CALC'!L44*2+SUM('TTHM GOAL CALC'!J44:K44))/4),\"\",(('TTHM GOAL CALC'!L44*2+SUM('TTHM GOAL CALC'!J44:K44))/4))","v":""},{"$f":"IF(ISERROR(('TTHM GOAL CALC'!M44*2+SUM('TTHM GOAL CALC'!K44:L44))/4),\"\",(('TTHM GOAL CALC'!M44*2+SUM('TTHM GOAL CALC'!K44:L44))/4))","v":""},{"$f":"IF(ISERROR(('TTHM GOAL CALC'!N44*2+SUM('TTHM GOAL CALC'!L44:M44))/4),\"\",(('TTHM GOAL CALC'!N44*2+SUM('TTHM GOAL CALC'!L44:M44))/4))","v":""}]
[null,{"$f":"'TTHM GOAL CALC'!B75","v":"Site 27"},{"$f":"IF(ISBLANK('Site 27'!T5),\"\",'Site 27'!T5)","v":""},{"$f":"IF(ISERROR(('TTHM GOAL CALC'!F45*2+SUM('TTHM GOAL CALC'!D45:E45))/4),\"\",(('TTHM GOAL CALC'!F45*2+SUM('TTHM GOAL CALC'!D45:E45))/4))","v":""},{"$f":"IF(ISERROR(('TTHM GOAL CALC'!G45*2+SUM('TTHM GOAL CALC'!E45:F45))/4),\"\",(('TTHM GOAL CALC'!G45*2+SUM('TTHM GOAL CALC'!E45:F45))/4))","v":""},{"$f":"IF(ISERROR(('TTHM GOAL CALC'!H45*2+SUM('TTHM GOAL CALC'!F45:G45))/4),\"\",(('TTHM GOAL CALC'!H45*2+SUM('TTHM GOAL CALC'!F45:G45))/4))","v":""},{"$f":"IF(ISERROR(('TTHM GOAL CALC'!I45*2+SUM('TTHM GOAL CALC'!G45:H45))/4),\"\",(('TTHM GOAL CALC'!I45*2+SUM('TTHM GOAL CALC'!G45:H45))/4))","v":""},{"$f":"IF(ISERROR(('TTHM GOAL CALC'!J45*2+SUM('TTHM GOAL CALC'!H45:I45))/4),\"\",(('TTHM GOAL CALC'!J45*2+SUM('TTHM GOAL CALC'!H45:I45))/4))","v":""},{"$f":"IF(ISERROR(('TTHM GOAL CALC'!K45*2+SUM('TTHM GOAL CALC'!I45:J45))/4),\"\",(('TTHM GOAL CALC'!K45*2+SUM('TTHM GOAL CALC'!I45:J45))/4))","v":""},{"$f":"IF(ISERROR(('TTHM GOAL CALC'!L45*2+SUM('TTHM GOAL CALC'!J45:K45))/4),\"\",(('TTHM GOAL CALC'!L45*2+SUM('TTHM GOAL CALC'!J45:K45))/4))","v":""},{"$f":"IF(ISERROR(('TTHM GOAL CALC'!M45*2+SUM('TTHM GOAL CALC'!K45:L45))/4),\"\",(('TTHM GOAL CALC'!M45*2+SUM('TTHM GOAL CALC'!K45:L45))/4))","v":""},{"$f":"IF(ISERROR(('TTHM GOAL CALC'!N45*2+SUM('TTHM GOAL CALC'!L45:M45))/4),\"\",(('TTHM GOAL CALC'!N45*2+SUM('TTHM GOAL CALC'!L45:M45))/4))","v":""}]
[null,{"$f":"'TTHM GOAL CALC'!B76","v":"Site 28"},{"$f":"IF(ISBLANK('Site 28'!T5),\"\",'Site 28'!T5)","v":""},{"$f":"IF(ISERROR(('TTHM GOAL CALC'!F46*2+SUM('TTHM GOAL CALC'!D46:E46))/4),\"\",(('TTHM GOAL CALC'!F46*2+SUM('TTHM GOAL CALC'!D46:E46))/4))","v":""},{"$f":"IF(ISERROR(('TTHM GOAL CALC'!G46*2+SUM('TTHM GOAL CALC'!E46:F46))/4),\"\",(('TTHM GOAL CALC'!G46*2+SUM('TTHM GOAL CALC'!E46:F46))/4))","v":""},{"$f":"IF(ISERROR(('TTHM GOAL CALC'!H46*2+SUM('TTHM GOAL CALC'!F46:G46))/4),\"\",(('TTHM GOAL CALC'!H46*2+SUM('TTHM GOAL CALC'!F46:G46))/4))","v":""},{"$f":"IF(ISERROR(('TTHM GOAL CALC'!I46*2+SUM('TTHM GOAL CALC'!G46:H46))/4),\"\",(('TTHM GOAL CALC'!I46*2+SUM('TTHM GOAL CALC'!G46:H46))/4))","v":""},{"$f":"IF(ISERROR(('TTHM GOAL CALC'!J46*2+SUM('TTHM GOAL CALC'!H46:I46))/4),\"\",(('TTHM GOAL CALC'!J46*2+SUM('TTHM GOAL CALC'!H46:I46))/4))","v":""},{"$f":"IF(ISERROR(('TTHM GOAL CALC'!K46*2+SUM('TTHM GOAL CALC'!I46:J46))/4),\"\",(('TTHM GOAL CALC'!K46*2+SUM('TTHM GOAL CALC'!I46:J46))/4))","v":""},{"$f":"IF(ISERROR(('TTHM GOAL CALC'!L46*2+SUM('TTHM GOAL CALC'!J46:K46))/4),\"\",(('TTHM GOAL CALC'!L46*2+SUM('TTHM GOAL CALC'!J46:K46))/4))","v":""},{"$f":"IF(ISERROR(('TTHM GOAL CALC'!M46*2+SUM('TTHM GOAL CALC'!K46:L46))/4),\"\",(('TTHM GOAL CALC'!M46*2+SUM('TTHM GOAL CALC'!K46:L46))/4))","v":""},{"$f":"IF(ISERROR(('TTHM GOAL CALC'!N46*2+SUM('TTHM GOAL CALC'!L46:M46))/4),\"\",(('TTHM GOAL CALC'!N46*2+SUM('TTHM GOAL CALC'!L46:M46))/4))","v":""}]
[null,{"$f":"'TTHM GOAL CALC'!B77","v":"Site 29"},{"$f":"IF(ISBLANK('Site 29'!T5),\"\",'Site 29'!T5)","v":""},{"$f":"IF(ISERROR(('TTHM GOAL CALC'!F47*2+SUM('TTHM GOAL CALC'!D47:E47))/4),\"\",(('TTHM GOAL CALC'!F47*2+SUM('TTHM GOAL CALC'!D47:E47))/4))","v":""},{"$f":"IF(ISERROR(('TTHM GOAL CALC'!G47*2+SUM('TTHM GOAL CALC'!E47:F47))/4),\"\",(('TTHM GOAL CALC'!G47*2+SUM('TTHM GOAL CALC'!E47:F47))/4))","v":""},{"$f":"IF(ISERROR(('TTHM GOAL CALC'!H47*2+SUM('TTHM GOAL CALC'!F47:G47))/4),\"\",(('TTHM GOAL CALC'!H47*2+SUM('TTHM GOAL CALC'!F47:G47))/4))","v":""},{"$f":"IF(ISERROR(('TTHM GOAL CALC'!I47*2+SUM('TTHM GOAL CALC'!G47:H47))/4),\"\",(('TTHM GOAL CALC'!I47*2+SUM('TTHM GOAL CALC'!G47:H47))/4))","v":""},{"$f":"IF(ISERROR(('TTHM GOAL CALC'!J47*2+SUM('TTHM GOAL CALC'!H47:I47))/4),\"\",(('TTHM GOAL CALC'!J47*2+SUM('TTHM GOAL CALC'!H47:I47))/4))","v":""},{"$f":"IF(ISERROR(('TTHM GOAL CALC'!K47*2+SUM('TTHM GOAL CALC'!I47:J47))/4),\"\",(('TTHM GOAL CALC'!K47*2+SUM('TTHM GOAL CALC'!I47:J47))/4))","v":""},{"$f":"IF(ISERROR(('TTHM GOAL CALC'!L47*2+SUM('TTHM GOAL CALC'!J47:K47))/4),\"\",(('TTHM GOAL CALC'!L47*2+SUM('TTHM GOAL CALC'!J47:K47))/4))","v":""},{"$f":"IF(ISERROR(('TTHM GOAL CALC'!M47*2+SUM('TTHM GOAL CALC'!K47:L47))/4),\"\",(('TTHM GOAL CALC'!M47*2+SUM('TTHM GOAL CALC'!K47:L47))/4))","v":""},{"$f":"IF(ISERROR(('TTHM GOAL CALC'!N47*2+SUM('TTHM GOAL CALC'!L47:M47))/4),\"\",(('TTHM GOAL CALC'!N47*2+SUM('TTHM GOAL CALC'!L47:M47))/4))","v":""}]
[null,{"$f":"'TTHM GOAL CALC'!B78","v":"Site 30"},{"$f":"IF(ISBLANK('Site 30'!T5),\"\",'Site 30'!T5)","v":""},{"$f":"IF(ISERROR(('TTHM GOAL CALC'!F48*2+SUM('TTHM GOAL CALC'!D48:E48))/4),\"\",(('TTHM GOAL CALC'!F48*2+SUM('TTHM GOAL CALC'!D48:E48))/4))","v":""},{"$f":"IF(ISERROR(('TTHM GOAL CALC'!G48*2+SUM('TTHM GOAL CALC'!E48:F48))/4),\"\",(('TTHM GOAL CALC'!G48*2+SUM('TTHM GOAL CALC'!E48:F48))/4))","v":""},{"$f":"IF(ISERROR(('TTHM GOAL CALC'!H48*2+SUM('TTHM GOAL CALC'!F48:G48))/4),\"\",(('TTHM GOAL CALC'!H48*2+SUM('TTHM GOAL CALC'!F48:G48))/4))","v":""},{"$f":"IF(ISERROR(('TTHM GOAL CALC'!I48*2+SUM('TTHM GOAL CALC'!G48:H48))/4),\"\",(('TTHM GOAL CALC'!I48*2+SUM('TTHM GOAL CALC'!G48:H48))/4))","v":""},{"$f":"IF(ISERROR(('TTHM GOAL CALC'!J48*2+SUM('TTHM GOAL CALC'!H48:I48))/4),\"\",(('TTHM GOAL CALC'!J48*2+SUM('TTHM GOAL CALC'!H48:I48))/4))","v":""},{"$f":"IF(ISERROR(('TTHM GOAL CALC'!K48*2+SUM('TTHM GOAL CALC'!I48:J48))/4),\"\",(('TTHM GOAL CALC'!K48*2+SUM('TTHM GOAL CALC'!I48:J48))/4))","v":""},{"$f":"IF(ISERROR(('TTHM GOAL CALC'!L48*2+SUM('TTHM GOAL CALC'!J48:K48))/4),\"\",(('TTHM GOAL CALC'!L48*2+SUM('TTHM GOAL CALC'!J48:K48))/4))","v":""},{"$f":"IF(ISERROR(('TTHM GOAL CALC'!M48*2+SUM('TTHM GOAL CALC'!K48:L48))/4),\"\",(('TTHM GOAL CALC'!M48*2+SUM('TTHM GOAL CALC'!K48:L48))/4))","v":""},{"$f":"IF(ISERROR(('TTHM GOAL CALC'!N48*2+SUM('TTHM GOAL CALC'!L48:M48))/4),\"\",(('TTHM GOAL CALC'!N48*2+SUM('TTHM GOAL CALC'!L48:M48))/4))","v":""},null,"Formulas for labeling max. LRAA sites on LT charts"]
[]
[null,"HAA5 OEL Table"]
[null,"Sample Location","Compliance Site",{"$f":"'HAA5 GOAL CALC'!F18","v":"Q1 1898"},{"$f":"'HAA5 GOAL CALC'!G18","v":"Q2 1898"},{"$f":"'HAA5 GOAL CALC'!H18","v":"Q3 1898"},{"$f":"'HAA5 GOAL CALC'!I18","v":"Q4 1898"},{"$f":"'HAA5 GOAL CALC'!J18","v":"Q1 1899"},{"$f":"'HAA5 GOAL CALC'!K18","v":"Q2 1899"},{"$f":"'HAA5 GOAL CALC'!L18","v":"Q3 1899"},{"$f":"'HAA5 GOAL CALC'!M18","v":"Q4 1899"},{"$f":"'HAA5 GOAL CALC'!N18","v":"Q1 1900"}]
[null,{"$f":"'HAA5 GOAL CALC'!B19","v":"Entry Point"},{"$f":"C7","v":""},{"$f":"IF(ISERROR(('HAA5 GOAL CALC'!F19*2+SUM('HAA5 GOAL CALC'!D19:E19))/4),\"\",(('HAA5 GOAL CALC'!F19*2+SUM('HAA5 GOAL CALC'!D19:E19))/4))","v":""},{"$f":"IF(ISERROR(('HAA5 GOAL CALC'!G19*2+SUM('HAA5 GOAL CALC'!E19:F19))/4),\"\",(('HAA5 GOAL CALC'!G19*2+SUM('HAA5 GOAL CALC'!E19:F19))/4))","v":""},{"$f":"IF(ISERROR(('HAA5 GOAL CALC'!H19*2+SUM('HAA5 GOAL CALC'!F19:G19))/4),\"\",(('HAA5 GOAL CALC'!H19*2+SUM('HAA5 GOAL CALC'!F19:G19))/4))","v":""},{"$f":"IF(ISERROR(('HAA5 GOAL CALC'!I19*2+SUM('HAA5 GOAL CALC'!G19:H19))/4),\"\",(('HAA5 GOAL CALC'!I19*2+SUM('HAA5 GOAL CALC'!G19:H19))/4))","v":""},{"$f":"IF(ISERROR(('HAA5 GOAL CALC'!J19*2+SUM('HAA5 GOAL CALC'!H19:I19))/4),\"\",(('HAA5 GOAL CALC'!J19*2+SUM('HAA5 GOAL CALC'!H19:I19))/4))","v":""},{"$f":"IF(ISERROR(('HAA5 GOAL CALC'!K19*2+SUM('HAA5 GOAL CALC'!I19:J19))/4),\"\",(('HAA5 GOAL CALC'!K19*2+SUM('HAA5 GOAL CALC'!I19:J19))/4))","v":""},{"$f":"IF(ISERROR(('HAA5 GOAL CALC'!L19*2+SUM('HAA5 GOAL CALC'!J19:K19))/4),\"\",(('HAA5 GOAL CALC'!L19*2+SUM('HAA5 GOAL CALC'!J19:K19))/4))","v":""},{"$f":"IF(ISERROR(('HAA5 GOAL CALC'!M19*2+SUM('HAA5 GOAL CALC'!K19:L19))/4),\"\",(('HAA5 GOAL CALC'!M19*2+SUM('HAA5 GOAL CALC'!K19:L19))/4))","v":""},{"$f":"IF(ISERROR(('HAA5 GOAL CALC'!N19*2+SUM('HAA5 GOAL CALC'!L19:M19))/4),\"\",(('HAA5 GOAL CALC'!N19*2+SUM('HAA5 GOAL CALC'!L19:M19))/4))","v":""}]
[null,{"$f":"'HAA5 GOAL CALC'!B20","v":"Site 2"},"",{"$f":"IF(ISERROR(('HAA5 GOAL CALC'!F20*2+SUM('HAA5 GOAL CALC'!D20:E20))/4),\"\",(('HAA5 GOAL CALC'!F20*2+SUM('HAA5 GOAL CALC'!D20:E20))/4))","v":""},{"$f":"IF(ISERROR(('HAA5 GOAL CALC'!G20*2+SUM('HAA5 GOAL CALC'!E20:F20))/4),\"\",(('HAA5 GOAL CALC'!G20*2+SUM('HAA5 GOAL CALC'!E20:F20))/4))","v":""},{"$f":"IF(ISERROR(('HAA5 GOAL CALC'!H20*2+SUM('HAA5 GOAL CALC'!F20:G20))/4),\"\",(('HAA5 GOAL CALC'!H20*2+SUM('HAA5 GOAL CALC'!F20:G20))/4))","v":""},{"$f":"IF(ISERROR(('HAA5 GOAL CALC'!I20*2+SUM('HAA5 GOAL CALC'!G20:H20))/4),\"\",(('HAA5 GOAL CALC'!I20*2+SUM('HAA5 GOAL CALC'!G20:H20))/4))","v":""},{"$f":"IF(ISERROR(('HAA5 GOAL CALC'!J20*2+SUM('HAA5 GOAL CALC'!H20:I20))/4),\"\",(('HAA5 GOAL CALC'!J20*2+SUM('HAA5 GOAL CALC'!H20:I20))/4))","v":""},{"$f":"IF(ISERROR(('HAA5 GOAL CALC'!K20*2+SUM('HAA5 GOAL CALC'!I20:J20))/4),\"\",(('HAA5 GOAL CALC'!K20*2+SUM('HAA5 GOAL CALC'!I20:J20))/4))","v":""},{"$f":"IF(ISERROR(('HAA5 GOAL CALC'!L20*2+SUM('HAA5 GOAL CALC'!J20:K20))/4),\"\",(('HAA5 GOAL CALC'!L20*2+SUM('HAA5 GOAL CALC'!J20:K20))/4))","v":""},{"$f":"IF(ISERROR(('HAA5 GOAL CALC'!M20*2+SUM('HAA5 GOAL CALC'!K20:L20))/4),\"\",(('HAA5 GOAL CALC'!M20*2+SUM('HAA5 GOAL CALC'!K20:L20))/4))","v":""},{"$f":"IF(ISERROR(('HAA5 GOAL CALC'!N20*2+SUM('HAA5 GOAL CALC'!L20:M20))/4),\"\",(('HAA5 GOAL CALC'!N20*2+SUM('HAA5 GOAL CALC'!L20:M20))/4))","v":""}]
[null,{"$f":"'HAA5 GOAL CALC'!B21","v":"Site 3"},"",{"$f":"IF(ISERROR(('HAA5 GOAL CALC'!F21*2+SUM('HAA5 GOAL CALC'!D21:E21))/4),\"\",(('HAA5 GOAL CALC'!F21*2+SUM('HAA5 GOAL CALC'!D21:E21))/4))","v":""},{"$f":"IF(ISERROR(('HAA5 GOAL CALC'!G21*2+SUM('HAA5 GOAL CALC'!E21:F21))/4),\"\",(('HAA5 GOAL CALC'!G21*2+SUM('HAA5 GOAL CALC'!E21:F21))/4))","v":""},{"$f":"IF(ISERROR(('HAA5 GOAL CALC'!H21*2+SUM('HAA5 GOAL CALC'!F21:G21))/4),\"\",(('HAA5 GOAL CALC'!H21*2+SUM('HAA5 GOAL CALC'!F21:G21))/4))","v":""},{"$f":"IF(ISERROR(('HAA5 GOAL CALC'!I21*2+SUM('HAA5 GOAL CALC'!G21:H21))/4),\"\",(('HAA5 GOAL CALC'!I21*2+SUM('HAA5 GOAL CALC'!G21:H21))/4))","v":""},{"$f":"IF(ISERROR(('HAA5 GOAL CALC'!J21*2+SUM('HAA5 GOAL CALC'!H21:I21))/4),\"\",(('HAA5 GOAL CALC'!J21*2+SUM('HAA5 GOAL CALC'!H21:I21))/4))","v":""},{"$f":"IF(ISERROR(('HAA5 GOAL CALC'!K21*2+SUM('HAA5 GOAL CALC'!I21:J21))/4),\"\",(('HAA5 GOAL CALC'!K21*2+SUM('HAA5 GOAL CALC'!I21:J21))/4))","v":""},{"$f":"IF(ISERROR(('HAA5 GOAL CALC'!L21*2+SUM('HAA5 GOAL CALC'!J21:K21))/4),\"\",(('HAA5 GOAL CALC'!L21*2+SUM('HAA5 GOAL CALC'!J21:K21))/4))","v":""},{"$f":"IF(ISERROR(('HAA5 GOAL CALC'!M21*2+SUM('HAA5 GOAL CALC'!K21:L21))/4),\"\",(('HAA5 GOAL CALC'!M21*2+SUM('HAA5 GOAL CALC'!K21:L21))/4))","v":""},{"$f":"IF(ISERROR(('HAA5 GOAL CALC'!N21*2+SUM('HAA5 GOAL CALC'!L21:M21))/4),\"\",(('HAA5 GOAL CALC'!N21*2+SUM('HAA5 GOAL CALC'!L21:M21))/4))","v":""}]
[null,{"$f":"'HAA5 GOAL CALC'!B22","v":"Site 4"},"",{"$f":"IF(ISERROR(('HAA5 GOAL CALC'!F22*2+SUM('HAA5 GOAL CALC'!D22:E22))/4),\"\",(('HAA5 GOAL CALC'!F22*2+SUM('HAA5 GOAL CALC'!D22:E22))/4))","v":""},{"$f":"IF(ISERROR(('HAA5 GOAL CALC'!G22*2+SUM('HAA5 GOAL CALC'!E22:F22))/4),\"\",(('HAA5 GOAL CALC'!G22*2+SUM('HAA5 GOAL CALC'!E22:F22))/4))","v":""},{"$f":"IF(ISERROR(('HAA5 GOAL CALC'!H22*2+SUM('HAA5 GOAL CALC'!F22:G22))/4),\"\",(('HAA5 GOAL CALC'!H22*2+SUM('HAA5 GOAL CALC'!F22:G22))/4))","v":""},{"$f":"IF(ISERROR(('HAA5 GOAL CALC'!I22*2+SUM('HAA5 GOAL CALC'!G22:H22))/4),\"\",(('HAA5 GOAL CALC'!I22*2+SUM('HAA5 GOAL CALC'!G22:H22))/4))","v":""},{"$f":"IF(ISERROR(('HAA5 GOAL CALC'!J22*2+SUM('HAA5 GOAL CALC'!H22:I22))/4),\"\",(('HAA5 GOAL CALC'!J22*2+SUM('HAA5 GOAL CALC'!H22:I22))/4))","v":""},{"$f":"IF(ISERROR(('HAA5 GOAL CALC'!K22*2+SUM('HAA5 GOAL CALC'!I22:J22))/4),\"\",(('HAA5 GOAL CALC'!K22*2+SUM('HAA5 GOAL CALC'!I22:J22))/4))","v":""},{"$f":"IF(ISERROR(('HAA5 GOAL CALC'!L22*2+SUM('HAA5 GOAL CALC'!J22:K22))/4),\"\",(('HAA5 GOAL CALC'!L22*2+SUM('HAA5 GOAL CALC'!J22:K22))/4))","v":""},{"$f":"IF(ISERROR(('HAA5 GOAL CALC'!M22*2+SUM('HAA5 GOAL CALC'!K22:L22))/4),\"\",(('HAA5 GOAL CALC'!M22*2+SUM('HAA5 GOAL CALC'!K22:L22))/4))","v":""},{"$f":"IF(ISERROR(('HAA5 GOAL CALC'!N22*2+SUM('HAA5 GOAL CALC'!L22:M22))/4),\"\",(('HAA5 GOAL CALC'!N22*2+SUM('HAA5 GOAL CALC'!L22:M22))/4))","v":""}]
[null,{"$f":"'HAA5 GOAL CALC'!B23","v":"Site 5"},"",{"$f":"IF(ISERROR(('HAA5 GOAL CALC'!F23*2+SUM('HAA5 GOAL CALC'!D23:E23))/4),\"\",(('HAA5 GOAL CALC'!F23*2+SUM('HAA5 GOAL CALC'!D23:E23))/4))","v":""},{"$f":"IF(ISERROR(('HAA5 GOAL CALC'!G23*2+SUM('HAA5 GOAL CALC'!E23:F23))/4),\"\",(('HAA5 GOAL CALC'!G23*2+SUM('HAA5 GOAL CALC'!E23:F23))/4))","v":""},{"$f":"IF(ISERROR(('HAA5 GOAL CALC'!H23*2+SUM('HAA5 GOAL CALC'!F23:G23))/4),\"\",(('HAA5 GOAL CALC'!H23*2+SUM('HAA5 GOAL CALC'!F23:G23))/4))","v":""},{"$f":"IF(ISERROR(('HAA5 GOAL CALC'!I23*2+SUM('HAA5 GOAL CALC'!G23:H23))/4),\"\",(('HAA5 GOAL CALC'!I23*2+SUM('HAA5 GOAL CALC'!G23:H23))/4))","v":""},{"$f":"IF(ISERROR(('HAA5 GOAL CALC'!J23*2+SUM('HAA5 GOAL CALC'!H23:I23))/4),\"\",(('HAA5 GOAL CALC'!J23*2+SUM('HAA5 GOAL CALC'!H23:I23))/4))","v":""},{"$f":"IF(ISERROR(('HAA5 GOAL CALC'!K23*2+SUM('HAA5 GOAL CALC'!I23:J23))/4),\"\",(('HAA5 GOAL CALC'!K23*2+SUM('HAA5 GOAL CALC'!I23:J23))/4))","v":""},{"$f":"IF(ISERROR(('HAA5 GOAL CALC'!L23*2+SUM('HAA5 GOAL CALC'!J23:K23))/4),\"\",(('HAA5 GOAL CALC'!L23*2+SUM('HAA5 GOAL CALC'!J23:K23))/4))","v":""},{"$f":"IF(ISERROR(('HAA5 GOAL CALC'!M23*2+SUM('HAA5 GOAL CALC'!K23:L23))/4),\"\",(('HAA5 GOAL CALC'!M23*2+SUM('HAA5 GOAL CALC'!K23:L23))/4))","v":""},{"$f":"IF(ISERROR(('HAA5 GOAL CALC'!N23*2+SUM('HAA5 GOAL CALC'!L23:M23))/4),\"\",(('HAA5 GOAL CALC'!N23*2+SUM('HAA5 GOAL CALC'!L23:M23))/4))","v":""}]
[null,{"$f":"'HAA5 GOAL CALC'!B24","v":"Site 6"},"",{"$f":"IF(ISERROR(('HAA5 GOAL CALC'!F24*2+SUM('HAA5 GOAL CALC'!D24:E24))/4),\"\",(('HAA5 GOAL CALC'!F24*2+SUM('HAA5 GOAL CALC'!D24:E24))/4))","v":""},{"$f":"IF(ISERROR(('HAA5 GOAL CALC'!G24*2+SUM('HAA5 GOAL CALC'!E24:F24))/4),\"\",(('HAA5 GOAL CALC'!G24*2+SUM('HAA5 GOAL CALC'!E24:F24))/4))","v":""},{"$f":"IF(ISERROR(('HAA5 GOAL CALC'!H24*2+SUM('HAA5 GOAL CALC'!F24:G24))/4),\"\",(('HAA5 GOAL CALC'!H24*2+SUM('HAA5 GOAL CALC'!F24:G24))/4))","v":""},{"$f":"IF(ISERROR(('HAA5 GOAL CALC'!I24*2+SUM('HAA5 GOAL CALC'!G24:H24))/4),\"\",(('HAA5 GOAL CALC'!I24*2+SUM('HAA5 GOAL CALC'!G24:H24))/4))","v":""},{"$f":"IF(ISERROR(('HAA5 GOAL CALC'!J24*2+SUM('HAA5 GOAL CALC'!H24:I24))/4),\"\",(('HAA5 GOAL CALC'!J24*2+SUM('HAA5 GOAL CALC'!H24:I24))/4))","v":""},{"$f":"IF(ISERROR(('HAA5 GOAL CALC'!K24*2+SUM('HAA5 GOAL CALC'!I24:J24))/4),\"\",(('HAA5 GOAL CALC'!K24*2+SUM('HAA5 GOAL CALC'!I24:J24))/4))","v":""},{"$f":"IF(ISERROR(('HAA5 GOAL CALC'!L24*2+SUM('HAA5 GOAL CALC'!J24:K24))/4),\"\",(('HAA5 GOAL CALC'!L24*2+SUM('HAA5 GOAL CALC'!J24:K24))/4))","v":""},{"$f":"IF(ISERROR(('HAA5 GOAL CALC'!M24*2+SUM('HAA5 GOAL CALC'!K24:L24))/4),\"\",(('HAA5 GOAL CALC'!M24*2+SUM('HAA5 GOAL CALC'!K24:L24))/4))","v":""},{"$f":"IF(ISERROR(('HAA5 GOAL CALC'!N24*2+SUM('HAA5 GOAL CALC'!L24:M24))/4),\"\",(('HAA5 GOAL CALC'!N24*2+SUM('HAA5 GOAL CALC'!L24:M24))/4))","v":""}]
[null,{"$f":"'HAA5 GOAL CALC'!B25","v":"Site 7"},"",{"$f":"IF(ISERROR(('HAA5 GOAL CALC'!F25*2+SUM('HAA5 GOAL CALC'!D25:E25))/4),\"\",(('HAA5 GOAL CALC'!F25*2+SUM('HAA5 GOAL CALC'!D25:E25))/4))","v":""},{"$f":"IF(ISERROR(('HAA5 GOAL CALC'!G25*2+SUM('HAA5 GOAL CALC'!E25:F25))/4),\"\",(('HAA5 GOAL CALC'!G25*2+SUM('HAA5 GOAL CALC'!E25:F25))/4))","v":""},{"$f":"IF(ISERROR(('HAA5 GOAL CALC'!H25*2+SUM('HAA5 GOAL CALC'!F25:G25))/4),\"\",(('HAA5 GOAL CALC'!H25*2+SUM('HAA5 GOAL CALC'!F25:G25))/4))","v":""},{"$f":"IF(ISERROR(('HAA5 GOAL CALC'!I25*2+SUM('HAA5 GOAL CALC'!G25:H25))/4),\"\",(('HAA5 GOAL CALC'!I25*2+SUM('HAA5 GOAL CALC'!G25:H25))/4))","v":""},{"$f":"IF(ISERROR(('HAA5 GOAL CALC'!J25*2+SUM('HAA5 GOAL CALC'!H25:I25))/4),\"\",(('HAA5 GOAL CALC'!J25*2+SUM('HAA5 GOAL CALC'!H25:I25))/4))","v":""},{"$f":"IF(ISERROR(('HAA5 GOAL CALC'!K25*2+SUM('HAA5 GOAL CALC'!I25:J25))/4),\"\",(('HAA5 GOAL CALC'!K25*2+SUM('HAA5 GOAL CALC'!I25:J25))/4))","v":""},{"$f":"IF(ISERROR(('HAA5 GOAL CALC'!L25*2+SUM('HAA5 GOAL CALC'!J25:K25))/4),\"\",(('HAA5 GOAL CALC'!L25*2+SUM('HAA5 GOAL CALC'!J25:K25))/4))","v":""},{"$f":"IF(ISERROR(('HAA5 GOAL CALC'!M25*2+SUM('HAA5 GOAL CALC'!K25:L25))/4),\"\",(('HAA5 GOAL CALC'!M25*2+SUM('HAA5 GOAL CALC'!K25:L25))/4))","v":""},{"$f":"IF(ISERROR(('HAA5 GOAL CALC'!N25*2+SUM('HAA5 GOAL CALC'!L25:M25))/4),\"\",(('HAA5 GOAL CALC'!N25*2+SUM('HAA5 GOAL CALC'!L25:M25))/4))","v":""}]
[null,{"$f":"'HAA5 GOAL CALC'!B26","v":"Site 8"},"",{"$f":"IF(ISERROR(('HAA5 GOAL CALC'!F26*2+SUM('HAA5 GOAL CALC'!D26:E26))/4),\"\",(('HAA5 GOAL CALC'!F26*2+SUM('HAA5 GOAL CALC'!D26:E26))/4))","v":""},{"$f":"IF(ISERROR(('HAA5 GOAL CALC'!G26*2+SUM('HAA5 GOAL CALC'!E26:F26))/4),\"\",(('HAA5 GOAL CALC'!G26*2+SUM('HAA5 GOAL CALC'!E26:F26))/4))","v":""},{"$f":"IF(ISERROR(('HAA5 GOAL CALC'!H26*2+SUM('HAA5 GOAL CALC'!F26:G26))/4),\"\",(('HAA5 GOAL CALC'!H26*2+SUM('HAA5 GOAL CALC'!F26:G26))/4))","v":""},{"$f":"IF(ISERROR(('HAA5 GOAL CALC'!I26*2+SUM('HAA5 GOAL CALC'!G26:H26))/4),\"\",(('HAA5 GOAL CALC'!I26*2+SUM('HAA5 GOAL CALC'!G26:H26))/4))","v":""},{"$f":"IF(ISERROR(('HAA5 GOAL CALC'!J26*2+SUM('HAA5 GOAL CALC'!H26:I26))/4),\"\",(('HAA5 GOAL CALC'!J26*2+SUM('HAA5 GOAL CALC'!H26:I26))/4))","v":""},{"$f":"IF(ISERROR(('HAA5 GOAL CALC'!K26*2+SUM('HAA5 GOAL CALC'!I26:J26))/4),\"\",(('HAA5 GOAL CALC'!K26*2+SUM('HAA5 GOAL CALC'!I26:J26))/4))","v":""},{"$f":"IF(ISERROR(('HAA5 GOAL CALC'!L26*2+SUM('HAA5 GOAL CALC'!J26:K26))/4),\"\",(('HAA5 GOAL CALC'!L26*2+SUM('HAA5 GOAL CALC'!J26:K26))/4))","v":""},{"$f":"IF(ISERROR(('HAA5 GOAL CALC'!M26*2+SUM('HAA5 GOAL CALC'!K26:L26))/4),\"\",(('HAA5 GOAL CALC'!M26*2+SUM('HAA5 GOAL CALC'!K26:L26))/4))","v":""},{"$f":"IF(ISERROR(('HAA5 GOAL CALC'!N26*2+SUM('HAA5 GOAL CALC'!L26:M26))/4),\"\",(('HAA5 GOAL CALC'!N26*2+SUM('HAA5 GOAL CALC'!L26:M26))/4))","v":""}]
[null,{"$f":"'HAA5 GOAL CALC'!B27","v":"Site 9"},"",{"$f":"IF(ISERROR(('HAA5 GOAL CALC'!F27*2+SUM('HAA5 GOAL CALC'!D27:E27))/4),\"\",(('HAA5 GOAL CALC'!F27*2+SUM('HAA5 GOAL CALC'!D27:E27))/4))","v":""},{"$f":"IF(ISERROR(('HAA5 GOAL CALC'!G27*2+SUM('HAA5 GOAL CALC'!E27:F27))/4),\"\",(('HAA5 GOAL CALC'!G27*2+SUM('HAA5 GOAL CALC'!E27:F27))/4))","v":""},{"$f":"IF(ISERROR(('HAA5 GOAL CALC'!H27*2+SUM('HAA5 GOAL CALC'!F27:G27))/4),\"\",(('HAA5 GOAL CALC'!H27*2+SUM('HAA5 GOAL CALC'!F27:G27))/4))","v":""},{"$f":"IF(ISERROR(('HAA5 GOAL CALC'!I27*2+SUM('HAA5 GOAL CALC'!G27:H27))/4),\"\",(('HAA5 GOAL CALC'!I27*2+SUM('HAA5 GOAL CALC'!G27:H27))/4))","v":""},{"$f":"IF(ISERROR(('HAA5 GOAL CALC'!J27*2+SUM('HAA5 GOAL CALC'!H27:I27))/4),\"\",(('HAA5 GOAL CALC'!J27*2+SUM('HAA5 GOAL CALC'!H27:I27))/4))","v":""},{"$f":"IF(ISERROR(('HAA5 GOAL CALC'!K27*2+SUM('HAA5 GOAL CALC'!I27:J27))/4),\"\",(('HAA5 GOAL CALC'!K27*2+SUM('HAA5 GOAL CALC'!I27:J27))/4))","v":""},{"$f":"IF(ISERROR(('HAA5 GOAL CALC'!L27*2+SUM('HAA5 GOAL CALC'!J27:K27))/4),\"\",(('HAA5 GOAL CALC'!L27*2+SUM('HAA5 GOAL CALC'!J27:K27))/4))","v":""},{"$f":"IF(ISERROR(('HAA5 GOAL CALC'!M27*2+SUM('HAA5 GOAL CALC'!K27:L27))/4),\"\",(('HAA5 GOAL CALC'!M27*2+SUM('HAA5 GOAL CALC'!K27:L27))/4))","v":""},{"$f":"IF(ISERROR(('HAA5 GOAL CALC'!N27*2+SUM('HAA5 GOAL CALC'!L27:M27))/4),\"\",(('HAA5 GOAL CALC'!N27*2+SUM('HAA5 GOAL CALC'!L27:M27))/4))","v":""}]
[null,{"$f":"'HAA5 GOAL CALC'!B28","v":"Site 10"},"",{"$f":"IF(ISERROR(('HAA5 GOAL CALC'!F28*2+SUM('HAA5 GOAL CALC'!D28:E28))/4),\"\",(('HAA5 GOAL CALC'!F28*2+SUM('HAA5 GOAL CALC'!D28:E28))/4))","v":""},{"$f":"IF(ISERROR(('HAA5 GOAL CALC'!G28*2+SUM('HAA5 GOAL CALC'!E28:F28))/4),\"\",(('HAA5 GOAL CALC'!G28*2+SUM('HAA5 GOAL CALC'!E28:F28))/4))","v":""},{"$f":"IF(ISERROR(('HAA5 GOAL CALC'!H28*2+SUM('HAA5 GOAL CALC'!F28:G28))/4),\"\",(('HAA5 GOAL CALC'!H28*2+SUM('HAA5 GOAL CALC'!F28:G28))/4))","v":""},{"$f":"IF(ISERROR(('HAA5 GOAL CALC'!I28*2+SUM('HAA5 GOAL CALC'!G28:H28))/4),\"\",(('HAA5 GOAL CALC'!I28*2+SUM('HAA5 GOAL CALC'!G28:H28))/4))","v":""},{"$f":"IF(ISERROR(('HAA5 GOAL CALC'!J28*2+SUM('HAA5 GOAL CALC'!H28:I28))/4),\"\",(('HAA5 GOAL CALC'!J28*2+SUM('HAA5 GOAL CALC'!H28:I28))/4))","v":""},{"$f":"IF(ISERROR(('HAA5 GOAL CALC'!K28*2+SUM('HAA5 GOAL CALC'!I28:J28))/4),\"\",(('HAA5 GOAL CALC'!K28*2+SUM('HAA5 GOAL CALC'!I28:J28))/4))","v":""},{"$f":"IF(ISERROR(('HAA5 GOAL CALC'!L28*2+SUM('HAA5 GOAL CALC'!J28:K28))/4),\"\",(('HAA5 GOAL CALC'!L28*2+SUM('HAA5 GOAL CALC'!J28:K28))/4))","v":""},{"$f":"IF(ISERROR(('HAA5 GOAL CALC'!M28*2+SUM('HAA5 GOAL CALC'!K28:L28))/4),\"\",(('HAA5 GOAL CALC'!M28*2+SUM('HAA5 GOAL CALC'!K28:L28))/4))","v":""},{"$f":"IF(ISERROR(('HAA5 GOAL CALC'!N28*2+SUM('HAA5 GOAL CALC'!L28:M28))/4),\"\",(('HAA5 GOAL CALC'!N28*2+SUM('HAA5 GOAL CALC'!L28:M28))/4))","v":""}]
[null,{"$f":"'HAA5 GOAL CALC'!B29","v":"Site 11"},"",{"$f":"IF(ISERROR(('HAA5 GOAL CALC'!F29*2+SUM('HAA5 GOAL CALC'!D29:E29))/4),\"\",(('HAA5 GOAL CALC'!F29*2+SUM('HAA5 GOAL CALC'!D29:E29))/4))","v":""},{"$f":"IF(ISERROR(('HAA5 GOAL CALC'!G29*2+SUM('HAA5 GOAL CALC'!E29:F29))/4),\"\",(('HAA5 GOAL CALC'!G29*2+SUM('HAA5 GOAL CALC'!E29:F29))/4))","v":""},{"$f":"IF(ISERROR(('HAA5 GOAL CALC'!H29*2+SUM('HAA5 GOAL CALC'!F29:G29))/4),\"\",(('HAA5 GOAL CALC'!H29*2+SUM('HAA5 GOAL CALC'!F29:G29))/4))","v":""},{"$f":"IF(ISERROR(('HAA5 GOAL CALC'!I29*2+SUM('HAA5 GOAL CALC'!G29:H29))/4),\"\",(('HAA5 GOAL CALC'!I29*2+SUM('HAA5 GOAL CALC'!G29:H29))/4))","v":""},{"$f":"IF(ISERROR(('HAA5 GOAL CALC'!J29*2+SUM('HAA5 GOAL CALC'!H29:I29))/4),\"\",(('HAA5 GOAL CALC'!J29*2+SUM('HAA5 GOAL CALC'!H29:I29))/4))","v":""},{"$f":"IF(ISERROR(('HAA5 GOAL CALC'!K29*2+SUM('HAA5 GOAL CALC'!I29:J29))/4),\"\",(('HAA5 GOAL CALC'!K29*2+SUM('HAA5 GOAL CALC'!I29:J29))/4))","v":""},{"$f":"IF(ISERROR(('HAA5 GOAL CALC'!L29*2+SUM('HAA5 GOAL CALC'!J29:K29))/4),\"\",(('HAA5 GOAL CALC'!L29*2+SUM('HAA5 GOAL CALC'!J29:K29))/4))","v":""},{"$f":"IF(ISERROR(('HAA5 GOAL CALC'!M29*2+SUM('HAA5 GOAL CALC'!K29:L29))/4),\"\",(('HAA5 GOAL CALC'!M29*2+SUM('HAA5 GOAL CALC'!K29:L29))/4))","v":""},{"$f":"IF(ISERROR(('HAA5 GOAL CALC'!N29*2+SUM('HAA5 GOAL CALC'!L29:M29))/4),\"\",(('HAA5 GOAL CALC'!N29*2+SUM('HAA5 GOAL CALC'!L29:M29))/4))","v":""}]
[null,{"$f":"'HAA5 GOAL CALC'!B30","v":"Site 12"},"",{"$f":"IF(ISERROR(('HAA5 GOAL CALC'!F30*2+SUM('HAA5 GOAL CALC'!D30:E30))/4),\"\",(('HAA5 GOAL CALC'!F30*2+SUM('HAA5 GOAL CALC'!D30:E30))/4))","v":""},{"$f":"IF(ISERROR(('HAA5 GOAL CALC'!G30*2+SUM('HAA5 GOAL CALC'!E30:F30))/4),\"\",(('HAA5 GOAL CALC'!G30*2+SUM('HAA5 GOAL CALC'!E30:F30))/4))","v":""},{"$f":"IF(ISERROR(('HAA5 GOAL CALC'!H30*2+SUM('HAA5 GOAL CALC'!F30:G30))/4),\"\",(('HAA5 GOAL CALC'!H30*2+SUM('HAA5 GOAL CALC'!F30:G30))/4))","v":""},{"$f":"IF(ISERROR(('HAA5 GOAL CALC'!I30*2+SUM('HAA5 GOAL CALC'!G30:H30))/4),\"\",(('HAA5 GOAL CALC'!I30*2+SUM('HAA5 GOAL CALC'!G30:H30))/4))","v":""},{"$f":"IF(ISERROR(('HAA5 GOAL CALC'!J30*2+SUM('HAA5 GOAL CALC'!H30:I30))/4),\"\",(('HAA5 GOAL CALC'!J30*2+SUM('HAA5 GOAL CALC'!H30:I30))/4))","v":""},{"$f":"IF(ISERROR(('HAA5 GOAL CALC'!K30*2+SUM('HAA5 GOAL CALC'!I30:J30))/4),\"\",(('HAA5 GOAL CALC'!K30*2+SUM('HAA5 GOAL CALC'!I30:J30))/4))","v":""},{"$f":"IF(ISERROR(('HAA5 GOAL CALC'!L30*2+SUM('HAA5 GOAL CALC'!J30:K30))/4),\"\",(('HAA5 GOAL CALC'!L30*2+SUM('HAA5 GOAL CALC'!J30:K30))/4))","v":""},{"$f":"IF(ISERROR(('HAA5 GOAL CALC'!M30*2+SUM('HAA5 GOAL CALC'!K30:L30))/4),\"\",(('HAA5 GOAL CALC'!M30*2+SUM('HAA5 GOAL CALC'!K30:L30))/4))","v":""},{"$f":"IF(ISERROR(('HAA5 GOAL CALC'!N30*2+SUM('HAA5 GOAL CALC'!L30:M30))/4),\"\",(('HAA5 GOAL CALC'!N30*2+SUM('HAA5 GOAL CALC'!L30:M30))/4))","v":""}]
[null,{"$f":"'HAA5 GOAL CALC'!B31","v":"Site 13"},"",{"$f":"IF(ISERROR(('HAA5 GOAL CALC'!F31*2+SUM('HAA5 GOAL CALC'!D31:E31))/4),\"\",(('HAA5 GOAL CALC'!F31*2+SUM('HAA5 GOAL CALC'!D31:E31))/4))","v":""},{"$f":"IF(ISERROR(('HAA5 GOAL CALC'!G31*2+SUM('HAA5 GOAL CALC'!E31:F31))/4),\"\",(('HAA5 GOAL CALC'!G31*2+SUM('HAA5 GOAL CALC'!E31:F31))/4))","v":""},{"$f":"IF(ISERROR(('HAA5 GOAL CALC'!H31*2+SUM('HAA5 GOAL CALC'!F31:G31))/4),\"\",(('HAA5 GOAL CALC'!H31*2+SUM('HAA5 GOAL CALC'!F31:G31))/4))","v":""},{"$f":"IF(ISERROR(('HAA5 GOAL CALC'!I31*2+SUM('HAA5 GOAL CALC'!G31:H31))/4),\"\",(('HAA5 GOAL CALC'!I31*2+SUM('HAA5 GOAL CALC'!G31:H31))/4))","v":""},{"$f":"IF(ISERROR(('HAA5 GOAL CALC'!J31*2+SUM('HAA5 GOAL CALC'!H31:I31))/4),\"\",(('HAA5 GOAL CALC'!J31*2+SUM('HAA5 GOAL CALC'!H31:I31))/4))","v":""},{"$f":"IF(ISERROR(('HAA5 GOAL CALC'!K31*2+SUM('HAA5 GOAL CALC'!I31:J31))/4),\"\",(('HAA5 GOAL CALC'!K31*2+SUM('HAA5 GOAL CALC'!I31:J31))/4))","v":""},{"$f":"IF(ISERROR(('HAA5 GOAL CALC'!L31*2+SUM('HAA5 GOAL CALC'!J31:K31))/4),\"\",(('HAA5 GOAL CALC'!L31*2+SUM('HAA5 GOAL CALC'!J31:K31))/4))","v":""},{"$f":"IF(ISERROR(('HAA5 GOAL CALC'!M31*2+SUM('HAA5 GOAL CALC'!K31:L31))/4),\"\",(('HAA5 GOAL CALC'!M31*2+SUM('HAA5 GOAL CALC'!K31:L31))/4))","v":""},{"$f":"IF(ISERROR(('HAA5 GOAL CALC'!N31*2+SUM('HAA5 GOAL CALC'!L31:M31))/4),\"\",(('HAA5 GOAL CALC'!N31*2+SUM('HAA5 GOAL CALC'!L31:M31))/4))","v":""}]
[null,{"$f":"'HAA5 GOAL CALC'!B32","v":"Site 14"},"",{"$f":"IF(ISERROR(('HAA5 GOAL CALC'!F32*2+SUM('HAA5 GOAL CALC'!D32:E32))/4),\"\",(('HAA5 GOAL CALC'!F32*2+SUM('HAA5 GOAL CALC'!D32:E32))/4))","v":""},{"$f":"IF(ISERROR(('HAA5 GOAL CALC'!G32*2+SUM('HAA5 GOAL CALC'!E32:F32))/4),\"\",(('HAA5 GOAL CALC'!G32*2+SUM('HAA5 GOAL CALC'!E32:F32))/4))","v":""},{"$f":"IF(ISERROR(('HAA5 GOAL CALC'!H32*2+SUM('HAA5 GOAL CALC'!F32:G32))/4),\"\",(('HAA5 GOAL CALC'!H32*2+SUM('HAA5 GOAL CALC'!F32:G32))/4))","v":""},{"$f":"IF(ISERROR(('HAA5 GOAL CALC'!I32*2+SUM('HAA5 GOAL CALC'!G32:H32))/4),\"\",(('HAA5 GOAL CALC'!I32*2+SUM('HAA5 GOAL CALC'!G32:H32))/4))","v":""},{"$f":"IF(ISERROR(('HAA5 GOAL CALC'!J32*2+SUM('HAA5 GOAL CALC'!H32:I32))/4),\"\",(('HAA5 GOAL CALC'!J32*2+SUM('HAA5 GOAL CALC'!H32:I32))/4))","v":""},{"$f":"IF(ISERROR(('HAA5 GOAL CALC'!K32*2+SUM('HAA5 GOAL CALC'!I32:J32))/4),\"\",(('HAA5 GOAL CALC'!K32*2+SUM('HAA5 GOAL CALC'!I32:J32))/4))","v":""},{"$f":"IF(ISERROR(('HAA5 GOAL CALC'!L32*2+SUM('HAA5 GOAL CALC'!J32:K32))/4),\"\",(('HAA5 GOAL CALC'!L32*2+SUM('HAA5 GOAL CALC'!J32:K32))/4))","v":""},{"$f":"IF(ISERROR(('HAA5 GOAL CALC'!M32*2+SUM('HAA5 GOAL CALC'!K32:L32))/4),\"\",(('HAA5 GOAL CALC'!M32*2+SUM('HAA5 GOAL CALC'!K32:L32))/4))","v":""},{"$f":"IF(ISERROR(('HAA5 GOAL CALC'!N32*2+SUM('HAA5 GOAL CALC'!L32:M32))/4),\"\",(('HAA5 GOAL CALC'!N32*2+SUM('HAA5 GOAL CALC'!L32:M32))/4))","v":""}]
[null,{"$f":"'HAA5 GOAL CALC'!B33","v":"Site 15"},"",{"$f":"IF(ISERROR(('HAA5 GOAL CALC'!F33*2+SUM('HAA5 GOAL CALC'!D33:E33))/4),\"\",(('HAA5 GOAL CALC'!F33*2+SUM('HAA5 GOAL CALC'!D33:E33))/4))","v":""},{"$f":"IF(ISERROR(('HAA5 GOAL CALC'!G33*2+SUM('HAA5 GOAL CALC'!E33:F33))/4),\"\",(('HAA5 GOAL CALC'!G33*2+SUM('HAA5 GOAL CALC'!E33:F33))/4))","v":""},{"$f":"IF(ISERROR(('HAA5 GOAL CALC'!H33*2+SUM('HAA5 GOAL CALC'!F33:G33))/4),\"\",(('HAA5 GOAL CALC'!H33*2+SUM('HAA5 GOAL CALC'!F33:G33))/4))","v":""},{"$f":"IF(ISERROR(('HAA5 GOAL CALC'!I33*2+SUM('HAA5 GOAL CALC'!G33:H33))/4),\"\",(('HAA5 GOAL CALC'!I33*2+SUM('HAA5 GOAL CALC'!G33:H33))/4))","v":""},{"$f":"IF(ISERROR(('HAA5 GOAL CALC'!J33*2+SUM('HAA5 GOAL CALC'!H33:I33))/4),\"\",(('HAA5 GOAL CALC'!J33*2+SUM('HAA5 GOAL CALC'!H33:I33))/4))","v":""},{"$f":"IF(ISERROR(('HAA5 GOAL CALC'!K33*2+SUM('HAA5 GOAL CALC'!I33:J33))/4),\"\",(('HAA5 GOAL CALC'!K33*2+SUM('HAA5 GOAL CALC'!I33:J33))/4))","v":""},{"$f":"IF(ISERROR(('HAA5 GOAL CALC'!L33*2+SUM('HAA5 GOAL CALC'!J33:K33))/4),\"\",(('HAA5 GOAL CALC'!L33*2+SUM('HAA5 GOAL CALC'!J33:K33))/4))","v":""},{"$f":"IF(ISERROR(('HAA5 GOAL CALC'!M33*2+SUM('HAA5 GOAL CALC'!K33:L33))/4),\"\",(('HAA5 GOAL CALC'!M33*2+SUM('HAA5 GOAL CALC'!K33:L33))/4))","v":""},{"$f":"IF(ISERROR(('HAA5 GOAL CALC'!N33*2+SUM('HAA5 GOAL CALC'!L33:M33))/4),\"\",(('HAA5 GOAL CALC'!N33*2+SUM('HAA5 GOAL CALC'!L33:M33))/4))","v":""}]
[null,{"$f":"'HAA5 GOAL CALC'!B34","v":"Site 16"},"",{"$f":"IF(ISERROR(('HAA5 GOAL CALC'!F34*2+SUM('HAA5 GOAL CALC'!D34:E34))/4),\"\",(('HAA5 GOAL CALC'!F34*2+SUM('HAA5 GOAL CALC'!D34:E34))/4))","v":""},{"$f":"IF(ISERROR(('HAA5 GOAL CALC'!G34*2+SUM('HAA5 GOAL CALC'!E34:F34))/4),\"\",(('HAA5 GOAL CALC'!G34*2+SUM('HAA5 GOAL CALC'!E34:F34))/4))","v":""},{"$f":"IF(ISERROR(('HAA5 GOAL CALC'!H34*2+SUM('HAA5 GOAL CALC'!F34:G34))/4),\"\",(('HAA5 GOAL CALC'!H34*2+SUM('HAA5 GOAL CALC'!F34:G34))/4))","v":""},{"$f":"IF(ISERROR(('HAA5 GOAL CALC'!I34*2+SUM('HAA5 GOAL CALC'!G34:H34))/4),\"\",(('HAA5 GOAL CALC'!I34*2+SUM('HAA5 GOAL CALC'!G34:H34))/4))","v":""},{"$f":"IF(ISERROR(('HAA5 GOAL CALC'!J34*2+SUM('HAA5 GOAL CALC'!H34:I34))/4),\"\",(('HAA5 GOAL CALC'!J34*2+SUM('HAA5 GOAL CALC'!H34:I34))/4))","v":""},{"$f":"IF(ISERROR(('HAA5 GOAL CALC'!K34*2+SUM('HAA5 GOAL CALC'!I34:J34))/4),\"\",(('HAA5 GOAL CALC'!K34*2+SUM('HAA5 GOAL CALC'!I34:J34))/4))","v":""},{"$f":"IF(ISERROR(('HAA5 GOAL CALC'!L34*2+SUM('HAA5 GOAL CALC'!J34:K34))/4),\"\",(('HAA5 GOAL CALC'!L34*2+SUM('HAA5 GOAL CALC'!J34:K34))/4))","v":""},{"$f":"IF(ISERROR(('HAA5 GOAL CALC'!M34*2+SUM('HAA5 GOAL CALC'!K34:L34))/4),\"\",(('HAA5 GOAL CALC'!M34*2+SUM('HAA5 GOAL CALC'!K34:L34))/4))","v":""},{"$f":"IF(ISERROR(('HAA5 GOAL CALC'!N34*2+SUM('HAA5 GOAL CALC'!L34:M34))/4),\"\",(('HAA5 GOAL CALC'!N34*2+SUM('HAA5 GOAL CALC'!L34:M34))/4))","v":""}]
[null,{"$f":"'HAA5 GOAL CALC'!B35","v":"Site 17"},"",{"$f":"IF(ISERROR(('HAA5 GOAL CALC'!F35*2+SUM('HAA5 GOAL CALC'!D35:E35))/4),\"\",(('HAA5 GOAL CALC'!F35*2+SUM('HAA5 GOAL CALC'!D35:E35))/4))","v":""},{"$f":"IF(ISERROR(('HAA5 GOAL CALC'!G35*2+SUM('HAA5 GOAL CALC'!E35:F35))/4),\"\",(('HAA5 GOAL CALC'!G35*2+SUM('HAA5 GOAL CALC'!E35:F35))/4))","v":""},{"$f":"IF(ISERROR(('HAA5 GOAL CALC'!H35*2+SUM('HAA5 GOAL CALC'!F35:G35))/4),\"\",(('HAA5 GOAL CALC'!H35*2+SUM('HAA5 GOAL CALC'!F35:G35))/4))","v":""},{"$f":"IF(ISERROR(('HAA5 GOAL CALC'!I35*2+SUM('HAA5 GOAL CALC'!G35:H35))/4),\"\",(('HAA5 GOAL CALC'!I35*2+SUM('HAA5 GOAL CALC'!G35:H35))/4))","v":""},{"$f":"IF(ISERROR(('HAA5 GOAL CALC'!J35*2+SUM('HAA5 GOAL CALC'!H35:I35))/4),\"\",(('HAA5 GOAL CALC'!J35*2+SUM('HAA5 GOAL CALC'!H35:I35))/4))","v":""},{"$f":"IF(ISERROR(('HAA5 GOAL CALC'!K35*2+SUM('HAA5 GOAL CALC'!I35:J35))/4),\"\",(('HAA5 GOAL CALC'!K35*2+SUM('HAA5 GOAL CALC'!I35:J35))/4))","v":""},{"$f":"IF(ISERROR(('HAA5 GOAL CALC'!L35*2+SUM('HAA5 GOAL CALC'!J35:K35))/4),\"\",(('HAA5 GOAL CALC'!L35*2+SUM('HAA5 GOAL CALC'!J35:K35))/4))","v":""},{"$f":"IF(ISERROR(('HAA5 GOAL CALC'!M35*2+SUM('HAA5 GOAL CALC'!K35:L35))/4),\"\",(('HAA5 GOAL CALC'!M35*2+SUM('HAA5 GOAL CALC'!K35:L35))/4))","v":""},{"$f":"IF(ISERROR(('HAA5 GOAL CALC'!N35*2+SUM('HAA5 GOAL CALC'!L35:M35))/4),\"\",(('HAA5 GOAL CALC'!N35*2+SUM('HAA5 GOAL CALC'!L35:M35))/4))","v":""}]
[null,{"$f":"'HAA5 GOAL CALC'!B36","v":"Site 18"},"",{"$f":"IF(ISERROR(('HAA5 GOAL CALC'!F36*2+SUM('HAA5 GOAL CALC'!D36:E36))/4),\"\",(('HAA5 GOAL CALC'!F36*2+SUM('HAA5 GOAL CALC'!D36:E36))/4))","v":""},{"$f":"IF(ISERROR(('HAA5 GOAL CALC'!G36*2+SUM('HAA5 GOAL CALC'!E36:F36))/4),\"\",(('HAA5 GOAL CALC'!G36*2+SUM('HAA5 GOAL CALC'!E36:F36))/4))","v":""},{"$f":"IF(ISERROR(('HAA5 GOAL CALC'!H36*2+SUM('HAA5 GOAL CALC'!F36:G36))/4),\"\",(('HAA5 GOAL CALC'!H36*2+SUM('HAA5 GOAL CALC'!F36:G36))/4))","v":""},{"$f":"IF(ISERROR(('HAA5 GOAL CALC'!I36*2+SUM('HAA5 GOAL CALC'!G36:H36))/4),\"\",(('HAA5 GOAL CALC'!I36*2+SUM('HAA5 GOAL CALC'!G36:H36))/4))","v":""},{"$f":"IF(ISERROR(('HAA5 GOAL CALC'!J36*2+SUM('HAA5 GOAL CALC'!H36:I36))/4),\"\",(('HAA5 GOAL CALC'!J36*2+SUM('HAA5 GOAL CALC'!H36:I36))/4))","v":""},{"$f":"IF(ISERROR(('HAA5 GOAL CALC'!K36*2+SUM('HAA5 GOAL CALC'!I36:J36))/4),\"\",(('HAA5 GOAL CALC'!K36*2+SUM('HAA5 GOAL CALC'!I36:J36))/4))","v":""},{"$f":"IF(ISERROR(('HAA5 GOAL CALC'!L36*2+SUM('HAA5 GOAL CALC'!J36:K36))/4),\"\",(('HAA5 GOAL CALC'!L36*2+SUM('HAA5 GOAL CALC'!J36:K36))/4))","v":""},{"$f":"IF(ISERROR(('HAA5 GOAL CALC'!M36*2+SUM('HAA5 GOAL CALC'!K36:L36))/4),\"\",(('HAA5 GOAL CALC'!M36*2+SUM('HAA5 GOAL CALC'!K36:L36))/4))","v":""},{"$f":"IF(ISERROR(('HAA5 GOAL CALC'!N36*2+SUM('HAA5 GOAL CALC'!L36:M36))/4),\"\",(('HAA5 GOAL CALC'!N36*2+SUM('HAA5 GOAL CALC'!L36:M36))/4))","v":""}]
[null,{"$f":"'HAA5 GOAL CALC'!B37","v":"Site 19"},"",{"$f":"IF(ISERROR(('HAA5 GOAL CALC'!F37*2+SUM('HAA5 GOAL CALC'!D37:E37))/4),\"\",(('HAA5 GOAL CALC'!F37*2+SUM('HAA5 GOAL CALC'!D37:E37))/4))","v":""},{"$f":"IF(ISERROR(('HAA5 GOAL CALC'!G37*2+SUM('HAA5 GOAL CALC'!E37:F37))/4),\"\",(('HAA5 GOAL CALC'!G37*2+SUM('HAA5 GOAL CALC'!E37:F37))/4))","v":""},{"$f":"IF(ISERROR(('HAA5 GOAL CALC'!H37*2+SUM('HAA5 GOAL CALC'!F37:G37))/4),\"\",(('HAA5 GOAL CALC'!H37*2+SUM('HAA5 GOAL CALC'!F37:G37))/4))","v":""},{"$f":"IF(ISERROR(('HAA5 GOAL CALC'!I37*2+SUM('HAA5 GOAL CALC'!G37:H37))/4),\"\",(('HAA5 GOAL CALC'!I37*2+SUM('HAA5 GOAL CALC'!G37:H37))/4))","v":""},{"$f":"IF(ISERROR(('HAA5 GOAL CALC'!J37*2+SUM('HAA5 GOAL CALC'!H37:I37))/4),\"\",(('HAA5 GOAL CALC'!J37*2+SUM('HAA5 GOAL CALC'!H37:I37))/4))","v":""},{"$f":"IF(ISERROR(('HAA5 GOAL CALC'!K37*2+SUM('HAA5 GOAL CALC'!I37:J37))/4),\"\",(('HAA5 GOAL CALC'!K37*2+SUM('HAA5 GOAL CALC'!I37:J37))/4))","v":""},{"$f":"IF(ISERROR(('HAA5 GOAL CALC'!L37*2+SUM('HAA5 GOAL CALC'!J37:K37))/4),\"\",(('HAA5 GOAL CALC'!L37*2+SUM('HAA5 GOAL CALC'!J37:K37))/4))","v":""},{"$f":"IF(ISERROR(('HAA5 GOAL CALC'!M37*2+SUM('HAA5 GOAL CALC'!K37:L37))/4),\"\",(('HAA5 GOAL CALC'!M37*2+SUM('HAA5 GOAL CALC'!K37:L37))/4))","v":""},{"$f":"IF(ISERROR(('HAA5 GOAL CALC'!N37*2+SUM('HAA5 GOAL CALC'!L37:M37))/4),\"\",(('HAA5 GOAL CALC'!N37*2+SUM('HAA5 GOAL CALC'!L37:M37))/4))","v":""}]
[null,{"$f":"'HAA5 GOAL CALC'!B38","v":"Site 20"},"",{"$f":"IF(ISERROR(('HAA5 GOAL CALC'!F38*2+SUM('HAA5 GOAL CALC'!D38:E38))/4),\"\",(('HAA5 GOAL CALC'!F38*2+SUM('HAA5 GOAL CALC'!D38:E38))/4))","v":""},{"$f":"IF(ISERROR(('HAA5 GOAL CALC'!G38*2+SUM('HAA5 GOAL CALC'!E38:F38))/4),\"\",(('HAA5 GOAL CALC'!G38*2+SUM('HAA5 GOAL CALC'!E38:F38))/4))","v":""},{"$f":"IF(ISERROR(('HAA5 GOAL CALC'!H38*2+SUM('HAA5 GOAL CALC'!F38:G38))/4),\"\",(('HAA5 GOAL CALC'!H38*2+SUM('HAA5 GOAL CALC'!F38:G38))/4))","v":""},{"$f":"IF(ISERROR(('HAA5 GOAL CALC'!I38*2+SUM('HAA5 GOAL CALC'!G38:H38))/4),\"\",(('HAA5 GOAL CALC'!I38*2+SUM('HAA5 GOAL CALC'!G38:H38))/4))","v":""},{"$f":"IF(ISERROR(('HAA5 GOAL CALC'!J38*2+SUM('HAA5 GOAL CALC'!H38:I38))/4),\"\",(('HAA5 GOAL CALC'!J38*2+SUM('HAA5 GOAL CALC'!H38:I38))/4))","v":""},{"$f":"IF(ISERROR(('HAA5 GOAL CALC'!K38*2+SUM('HAA5 GOAL CALC'!I38:J38))/4),\"\",(('HAA5 GOAL CALC'!K38*2+SUM('HAA5 GOAL CALC'!I38:J38))/4))","v":""},{"$f":"IF(ISERROR(('HAA5 GOAL CALC'!L38*2+SUM('HAA5 GOAL CALC'!J38:K38))/4),\"\",(('HAA5 GOAL CALC'!L38*2+SUM('HAA5 GOAL CALC'!J38:K38))/4))","v":""},{"$f":"IF(ISERROR(('HAA5 GOAL CALC'!M38*2+SUM('HAA5 GOAL CALC'!K38:L38))/4),\"\",(('HAA5 GOAL CALC'!M38*2+SUM('HAA5 GOAL CALC'!K38:L38))/4))","v":""},{"$f":"IF(ISERROR(('HAA5 GOAL CALC'!N38*2+SUM('HAA5 GOAL CALC'!L38:M38))/4),\"\",(('HAA5 GOAL CALC'!N38*2+SUM('HAA5 GOAL CALC'!L38:M38))/4))","v":""}]
[null,{"$f":"'HAA5 GOAL CALC'!B39","v":"Site 21"},"",{"$f":"IF(ISERROR(('HAA5 GOAL CALC'!F39*2+SUM('HAA5 GOAL CALC'!D39:E39))/4),\"\",(('HAA5 GOAL CALC'!F39*2+SUM('HAA5 GOAL CALC'!D39:E39))/4))","v":""},{"$f":"IF(ISERROR(('HAA5 GOAL CALC'!G39*2+SUM('HAA5 GOAL CALC'!E39:F39))/4),\"\",(('HAA5 GOAL CALC'!G39*2+SUM('HAA5 GOAL CALC'!E39:F39))/4))","v":""},{"$f":"IF(ISERROR(('HAA5 GOAL CALC'!H39*2+SUM('HAA5 GOAL CALC'!F39:G39))/4),\"\",(('HAA5 GOAL CALC'!H39*2+SUM('HAA5 GOAL CALC'!F39:G39))/4))","v":""},{"$f":"IF(ISERROR(('HAA5 GOAL CALC'!I39*2+SUM('HAA5 GOAL CALC'!G39:H39))/4),\"\",(('HAA5 GOAL CALC'!I39*2+SUM('HAA5 GOAL CALC'!G39:H39))/4))","v":""},{"$f":"IF(ISERROR(('HAA5 GOAL CALC'!J39*2+SUM('HAA5 GOAL CALC'!H39:I39))/4),\"\",(('HAA5 GOAL CALC'!J39*2+SUM('HAA5 GOAL CALC'!H39:I39))/4))","v":""},{"$f":"IF(ISERROR(('HAA5 GOAL CALC'!K39*2+SUM('HAA5 GOAL CALC'!I39:J39))/4),\"\",(('HAA5 GOAL CALC'!K39*2+SUM('HAA5 GOAL CALC'!I39:J39))/4))","v":""},{"$f":"IF(ISERROR(('HAA5 GOAL CALC'!L39*2+SUM('HAA5 GOAL CALC'!J39:K39))/4),\"\",(('HAA5 GOAL CALC'!L39*2+SUM('HAA5 GOAL CALC'!J39:K39))/4))","v":""},{"$f":"IF(ISERROR(('HAA5 GOAL CALC'!M39*2+SUM('HAA5 GOAL CALC'!K39:L39))/4),\"\",(('HAA5 GOAL CALC'!M39*2+SUM('HAA5 GOAL CALC'!K39:L39))/4))","v":""},{"$f":"IF(ISERROR(('HAA5 GOAL CALC'!N39*2+SUM('HAA5 GOAL CALC'!L39:M39))/4),\"\",(('HAA5 GOAL CALC'!N39*2+SUM('HAA5 GOAL CALC'!L39:M39))/4))","v":""}]
[null,{"$f":"'HAA5 GOAL CALC'!B40","v":"Site 22"},"",{"$f":"IF(ISERROR(('HAA5 GOAL CALC'!F40*2+SUM('HAA5 GOAL CALC'!D40:E40))/4),\"\",(('HAA5 GOAL CALC'!F40*2+SUM('HAA5 GOAL CALC'!D40:E40))/4))","v":""},{"$f":"IF(ISERROR(('HAA5 GOAL CALC'!G40*2+SUM('HAA5 GOAL CALC'!E40:F40))/4),\"\",(('HAA5 GOAL CALC'!G40*2+SUM('HAA5 GOAL CALC'!E40:F40))/4))","v":""},{"$f":"IF(ISERROR(('HAA5 GOAL CALC'!H40*2+SUM('HAA5 GOAL CALC'!F40:G40))/4),\"\",(('HAA5 GOAL CALC'!H40*2+SUM('HAA5 GOAL CALC'!F40:G40))/4))","v":""},{"$f":"IF(ISERROR(('HAA5 GOAL CALC'!I40*2+SUM('HAA5 GOAL CALC'!G40:H40))/4),\"\",(('HAA5 GOAL CALC'!I40*2+SUM('HAA5 GOAL CALC'!G40:H40))/4))","v":""},{"$f":"IF(ISERROR(('HAA5 GOAL CALC'!J40*2+SUM('HAA5 GOAL CALC'!H40:I40))/4),\"\",(('HAA5 GOAL CALC'!J40*2+SUM('HAA5 GOAL CALC'!H40:I40))/4))","v":""},{"$f":"IF(ISERROR(('HAA5 GOAL CALC'!K40*2+SUM('HAA5 GOAL CALC'!I40:J40))/4),\"\",(('HAA5 GOAL CALC'!K40*2+SUM('HAA5 GOAL CALC'!I40:J40))/4))","v":""},{"$f":"IF(ISERROR(('HAA5 GOAL CALC'!L40*2+SUM('HAA5 GOAL CALC'!J40:K40))/4),\"\",(('HAA5 GOAL CALC'!L40*2+SUM('HAA5 GOAL CALC'!J40:K40))/4))","v":""},{"$f":"IF(ISERROR(('HAA5 GOAL CALC'!M40*2+SUM('HAA5 GOAL CALC'!K40:L40))/4),\"\",(('HAA5 GOAL CALC'!M40*2+SUM('HAA5 GOAL CALC'!K40:L40))/4))","v":""},{"$f":"IF(ISERROR(('HAA5 GOAL CALC'!N40*2+SUM('HAA5 GOAL CALC'!L40:M40))/4),\"\",(('HAA5 GOAL CALC'!N40*2+SUM('HAA5 GOAL CALC'!L40:M40))/4))","v":""}]
[null,{"$f":"'HAA5 GOAL CALC'!B41","v":"Site 23"},"",{"$f":"IF(ISERROR(('HAA5 GOAL CALC'!F41*2+SUM('HAA5 GOAL CALC'!D41:E41))/4),\"\",(('HAA5 GOAL CALC'!F41*2+SUM('HAA5 GOAL CALC'!D41:E41))/4))","v":""},{"$f":"IF(ISERROR(('HAA5 GOAL CALC'!G41*2+SUM('HAA5 GOAL CALC'!E41:F41))/4),\"\",(('HAA5 GOAL CALC'!G41*2+SUM('HAA5 GOAL CALC'!E41:F41))/4))","v":""},{"$f":"IF(ISERROR(('HAA5 GOAL CALC'!H41*2+SUM('HAA5 GOAL CALC'!F41:G41))/4),\"\",(('HAA5 GOAL CALC'!H41*2+SUM('HAA5 GOAL CALC'!F41:G41))/4))","v":""},{"$f":"IF(ISERROR(('HAA5 GOAL CALC'!I41*2+SUM('HAA5 GOAL CALC'!G41:H41))/4),\"\",(('HAA5 GOAL CALC'!I41*2+SUM('HAA5 GOAL CALC'!G41:H41))/4))","v":""},{"$f":"IF(ISERROR(('HAA5 GOAL CALC'!J41*2+SUM('HAA5 GOAL CALC'!H41:I41))/4),\"\",(('HAA5 GOAL CALC'!J41*2+SUM('HAA5 GOAL CALC'!H41:I41))/4))","v":""},{"$f":"IF(ISERROR(('HAA5 GOAL CALC'!K41*2+SUM('HAA5 GOAL CALC'!I41:J41))/4),\"\",(('HAA5 GOAL CALC'!K41*2+SUM('HAA5 GOAL CALC'!I41:J41))/4))","v":""},{"$f":"IF(ISERROR(('HAA5 GOAL CALC'!L41*2+SUM('HAA5 GOAL CALC'!J41:K41))/4),\"\",(('HAA5 GOAL CALC'!L41*2+SUM('HAA5 GOAL CALC'!J41:K41))/4))","v":""},{"$f":"IF(ISERROR(('HAA5 GOAL CALC'!M41*2+SUM('HAA5 GOAL CALC'!K41:L41))/4),\"\",(('HAA5 GOAL CALC'!M41*2+SUM('HAA5 GOAL CALC'!K41:L41))/4))","v":""},{"$f":"IF(ISERROR(('HAA5 GOAL CALC'!N41*2+SUM('HAA5 GOAL CALC'!L41:M41))/4),\"\",(('HAA5 GOAL CALC'!N41*2+SUM('HAA5 GOAL CALC'!L41:M41))/4))","v":""}]
[null,{"$f":"'HAA5 GOAL CALC'!B42","v":"Site 24"},"",{"$f":"IF(ISERROR(('HAA5 GOAL CALC'!F42*2+SUM('HAA5 GOAL CALC'!D42:E42))/4),\"\",(('HAA5 GOAL CALC'!F42*2+SUM('HAA5 GOAL CALC'!D42:E42))/4))","v":""},{"$f":"IF(ISERROR(('HAA5 GOAL CALC'!G42*2+SUM('HAA5 GOAL CALC'!E42:F42))/4),\"\",(('HAA5 GOAL CALC'!G42*2+SUM('HAA5 GOAL CALC'!E42:F42))/4))","v":""},{"$f":"IF(ISERROR(('HAA5 GOAL CALC'!H42*2+SUM('HAA5 GOAL CALC'!F42:G42))/4),\"\",(('HAA5 GOAL CALC'!H42*2+SUM('HAA5 GOAL CALC'!F42:G42))/4))","v":""},{"$f":"IF(ISERROR(('HAA5 GOAL CALC'!I42*2+SUM('HAA5 GOAL CALC'!G42:H42))/4),\"\",(('HAA5 GOAL CALC'!I42*2+SUM('HAA5 GOAL CALC'!G42:H42))/4))","v":""},{"$f":"IF(ISERROR(('HAA5 GOAL CALC'!J42*2+SUM('HAA5 GOAL CALC'!H42:I42))/4),\"\",(('HAA5 GOAL CALC'!J42*2+SUM('HAA5 GOAL CALC'!H42:I42))/4))","v":""},{"$f":"IF(ISERROR(('HAA5 GOAL CALC'!K42*2+SUM('HAA5 GOAL CALC'!I42:J42))/4),\"\",(('HAA5 GOAL CALC'!K42*2+SUM('HAA5 GOAL CALC'!I42:J42))/4))","v":""},{"$f":"IF(ISERROR(('HAA5 GOAL CALC'!L42*2+SUM('HAA5 GOAL CALC'!J42:K42))/4),\"\",(('HAA5 GOAL CALC'!L42*2+SUM('HAA5 GOAL CALC'!J42:K42))/4))","v":""},{"$f":"IF(ISERROR(('HAA5 GOAL CALC'!M42*2+SUM('HAA5 GOAL CALC'!K42:L42))/4),\"\",(('HAA5 GOAL CALC'!M42*2+SUM('HAA5 GOAL CALC'!K42:L42))/4))","v":""},{"$f":"IF(ISERROR(('HAA5 GOAL CALC'!N42*2+SUM('HAA5 GOAL CALC'!L42:M42))/4),\"\",(('HAA5 GOAL CALC'!N42*2+SUM('HAA5 GOAL CALC'!L42:M42))/4))","v":""}]
[null,{"$f":"'HAA5 GOAL CALC'!B43","v":"Site 25"},"",{"$f":"IF(ISERROR(('HAA5 GOAL CALC'!F43*2+SUM('HAA5 GOAL CALC'!D43:E43))/4),\"\",(('HAA5 GOAL CALC'!F43*2+SUM('HAA5 GOAL CALC'!D43:E43))/4))","v":""},{"$f":"IF(ISERROR(('HAA5 GOAL CALC'!G43*2+SUM('HAA5 GOAL CALC'!E43:F43))/4),\"\",(('HAA5 GOAL CALC'!G43*2+SUM('HAA5 GOAL CALC'!E43:F43))/4))","v":""},{"$f":"IF(ISERROR(('HAA5 GOAL CALC'!H43*2+SUM('HAA5 GOAL CALC'!F43:G43))/4),\"\",(('HAA5 GOAL CALC'!H43*2+SUM('HAA5 GOAL CALC'!F43:G43))/4))","v":""},{"$f":"IF(ISERROR(('HAA5 GOAL CALC'!I43*2+SUM('HAA5 GOAL CALC'!G43:H43))/4),\"\",(('HAA5 GOAL CALC'!I43*2+SUM('HAA5 GOAL CALC'!G43:H43))/4))","v":""},{"$f":"IF(ISERROR(('HAA5 GOAL CALC'!J43*2+SUM('HAA5 GOAL CALC'!H43:I43))/4),\"\",(('HAA5 GOAL CALC'!J43*2+SUM('HAA5 GOAL CALC'!H43:I43))/4))","v":""},{"$f":"IF(ISERROR(('HAA5 GOAL CALC'!K43*2+SUM('HAA5 GOAL CALC'!I43:J43))/4),\"\",(('HAA5 GOAL CALC'!K43*2+SUM('HAA5 GOAL CALC'!I43:J43))/4))","v":""},{"$f":"IF(ISERROR(('HAA5 GOAL CALC'!L43*2+SUM('HAA5 GOAL CALC'!J43:K43))/4),\"\",(('HAA5 GOAL CALC'!L43*2+SUM('HAA5 GOAL CALC'!J43:K43))/4))","v":""},{"$f":"IF(ISERROR(('HAA5 GOAL CALC'!M43*2+SUM('HAA5 GOAL CALC'!K43:L43))/4),\"\",(('HAA5 GOAL CALC'!M43*2+SUM('HAA5 GOAL CALC'!K43:L43))/4))","v":""},{"$f":"IF(ISERROR(('HAA5 GOAL CALC'!N43*2+SUM('HAA5 GOAL CALC'!L43:M43))/4),\"\",(('HAA5 GOAL CALC'!N43*2+SUM('HAA5 GOAL CALC'!L43:M43))/4))","v":""}]
[null,{"$f":"'HAA5 GOAL CALC'!B44","v":"Site 26"},"",{"$f":"IF(ISERROR(('HAA5 GOAL CALC'!F44*2+SUM('HAA5 GOAL CALC'!D44:E44))/4),\"\",(('HAA5 GOAL CALC'!F44*2+SUM('HAA5 GOAL CALC'!D44:E44))/4))","v":""},{"$f":"IF(ISERROR(('HAA5 GOAL CALC'!G44*2+SUM('HAA5 GOAL CALC'!E44:F44))/4),\"\",(('HAA5 GOAL CALC'!G44*2+SUM('HAA5 GOAL CALC'!E44:F44))/4))","v":""},{"$f":"IF(ISERROR(('HAA5 GOAL CALC'!H44*2+SUM('HAA5 GOAL CALC'!F44:G44))/4),\"\",(('HAA5 GOAL CALC'!H44*2+SUM('HAA5 GOAL CALC'!F44:G44))/4))","v":""},{"$f":"IF(ISERROR(('HAA5 GOAL CALC'!I44*2+SUM('HAA5 GOAL CALC'!G44:H44))/4),\"\",(('HAA5 GOAL CALC'!I44*2+SUM('HAA5 GOAL CALC'!G44:H44))/4))","v":""},{"$f":"IF(ISERROR(('HAA5 GOAL CALC'!J44*2+SUM('HAA5 GOAL CALC'!H44:I44))/4),\"\",(('HAA5 GOAL CALC'!J44*2+SUM('HAA5 GOAL CALC'!H44:I44))/4))","v":""},{"$f":"IF(ISERROR(('HAA5 GOAL CALC'!K44*2+SUM('HAA5 GOAL CALC'!I44:J44))/4),\"\",(('HAA5 GOAL CALC'!K44*2+SUM('HAA5 GOAL CALC'!I44:J44))/4))","v":""},{"$f":"IF(ISERROR(('HAA5 GOAL CALC'!L44*2+SUM('HAA5 GOAL CALC'!J44:K44))/4),\"\",(('HAA5 GOAL CALC'!L44*2+SUM('HAA5 GOAL CALC'!J44:K44))/4))","v":""},{"$f":"IF(ISERROR(('HAA5 GOAL CALC'!M44*2+SUM('HAA5 GOAL CALC'!K44:L44))/4),\"\",(('HAA5 GOAL CALC'!M44*2+SUM('HAA5 GOAL CALC'!K44:L44))/4))","v":""},{"$f":"IF(ISERROR(('HAA5 GOAL CALC'!N44*2+SUM('HAA5 GOAL CALC'!L44:M44))/4),\"\",(('HAA5 GOAL CALC'!N44*2+SUM('HAA5 GOAL CALC'!L44:M44))/4))","v":""}]
[null,{"$f":"'HAA5 GOAL CALC'!B45","v":"Site 27"},"",{"$f":"IF(ISERROR(('HAA5 GOAL CALC'!F45*2+SUM('HAA5 GOAL CALC'!D45:E45))/4),\"\",(('HAA5 GOAL CALC'!F45*2+SUM('HAA5 GOAL CALC'!D45:E45))/4))","v":""},{"$f":"IF(ISERROR(('HAA5 GOAL CALC'!G45*2+SUM('HAA5 GOAL CALC'!E45:F45))/4),\"\",(('HAA5 GOAL CALC'!G45*2+SUM('HAA5 GOAL CALC'!E45:F45))/4))","v":""},{"$f":"IF(ISERROR(('HAA5 GOAL CALC'!H45*2+SUM('HAA5 GOAL CALC'!F45:G45))/4),\"\",(('HAA5 GOAL CALC'!H45*2+SUM('HAA5 GOAL CALC'!F45:G45))/4))","v":""},{"$f":"IF(ISERROR(('HAA5 GOAL CALC'!I45*2+SUM('HAA5 GOAL CALC'!G45:H45))/4),\"\",(('HAA5 GOAL CALC'!I45*2+SUM('HAA5 GOAL CALC'!G45:H45))/4))","v":""},{"$f":"IF(ISERROR(('HAA5 GOAL CALC'!J45*2+SUM('HAA5 GOAL CALC'!H45:I45))/4),\"\",(('HAA5 GOAL CALC'!J45*2+SUM('HAA5 GOAL CALC'!H45:I45))/4))","v":""},{"$f":"IF(ISERROR(('HAA5 GOAL CALC'!K45*2+SUM('HAA5 GOAL CALC'!I45:J45))/4),\"\",(('HAA5 GOAL CALC'!K45*2+SUM('HAA5 GOAL CALC'!I45:J45))/4))","v":""},{"$f":"IF(ISERROR(('HAA5 GOAL CALC'!L45*2+SUM('HAA5 GOAL CALC'!J45:K45))/4),\"\",(('HAA5 GOAL CALC'!L45*2+SUM('HAA5 GOAL CALC'!J45:K45))/4))","v":""},{"$f":"IF(ISERROR(('HAA5 GOAL CALC'!M45*2+SUM('HAA5 GOAL CALC'!K45:L45))/4),\"\",(('HAA5 GOAL CALC'!M45*2+SUM('HAA5 GOAL CALC'!K45:L45))/4))","v":""},{"$f":"IF(ISERROR(('HAA5 GOAL CALC'!N45*2+SUM('HAA5 GOAL CALC'!L45:M45))/4),\"\",(('HAA5 GOAL CALC'!N45*2+SUM('HAA5 GOAL CALC'!L45:M45))/4))","v":""}]
[null,{"$f":"'HAA5 GOAL CALC'!B46","v":"Site 28"},"",{"$f":"IF(ISERROR(('HAA5 GOAL CALC'!F46*2+SUM('HAA5 GOAL CALC'!D46:E46))/4),\"\",(('HAA5 GOAL CALC'!F46*2+SUM('HAA5 GOAL CALC'!D46:E46))/4))","v":""},{"$f":"IF(ISERROR(('HAA5 GOAL CALC'!G46*2+SUM('HAA5 GOAL CALC'!E46:F46))/4),\"\",(('HAA5 GOAL CALC'!G46*2+SUM('HAA5 GOAL CALC'!E46:F46))/4))","v":""},{"$f":"IF(ISERROR(('HAA5 GOAL CALC'!H46*2+SUM('HAA5 GOAL CALC'!F46:G46))/4),\"\",(('HAA5 GOAL CALC'!H46*2+SUM('HAA5 GOAL CALC'!F46:G46))/4))","v":""},{"$f":"IF(ISERROR(('HAA5 GOAL CALC'!I46*2+SUM('HAA5 GOAL CALC'!G46:H46))/4),\"\",(('HAA5 GOAL CALC'!I46*2+SUM('HAA5 GOAL CALC'!G46:H46))/4))","v":""},{"$f":"IF(ISERROR(('HAA5 GOAL CALC'!J46*2+SUM('HAA5 GOAL CALC'!H46:I46))/4),\"\",(('HAA5 GOAL CALC'!J46*2+SUM('HAA5 GOAL CALC'!H46:I46))/4))","v":""},{"$f":"IF(ISERROR(('HAA5 GOAL CALC'!K46*2+SUM('HAA5 GOAL CALC'!I46:J46))/4),\"\",(('HAA5 GOAL CALC'!K46*2+SUM('HAA5 GOAL CALC'!I46:J46))/4))","v":""},{"$f":"IF(ISERROR(('HAA5 GOAL CALC'!L46*2+SUM('HAA5 GOAL CALC'!J46:K46))/4),\"\",(('HAA5 GOAL CALC'!L46*2+SUM('HAA5 GOAL CALC'!J46:K46))/4))","v":""},{"$f":"IF(ISERROR(('HAA5 GOAL CALC'!M46*2+SUM('HAA5 GOAL CALC'!K46:L46))/4),\"\",(('HAA5 GOAL CALC'!M46*2+SUM('HAA5 GOAL CALC'!K46:L46))/4))","v":""},{"$f":"IF(ISERROR(('HAA5 GOAL CALC'!N46*2+SUM('HAA5 GOAL CALC'!L46:M46))/4),\"\",(('HAA5 GOAL CALC'!N46*2+SUM('HAA5 GOAL CALC'!L46:M46))/4))","v":""}]
[null,{"$f":"'HAA5 GOAL CALC'!B47","v":"Site 29"},"",{"$f":"IF(ISERROR(('HAA5 GOAL CALC'!F47*2+SUM('HAA5 GOAL CALC'!D47:E47))/4),\"\",(('HAA5 GOAL CALC'!F47*2+SUM('HAA5 GOAL CALC'!D47:E47))/4))","v":""},{"$f":"IF(ISERROR(('HAA5 GOAL CALC'!G47*2+SUM('HAA5 GOAL CALC'!E47:F47))/4),\"\",(('HAA5 GOAL CALC'!G47*2+SUM('HAA5 GOAL CALC'!E47:F47))/4))","v":""},{"$f":"IF(ISERROR(('HAA5 GOAL CALC'!H47*2+SUM('HAA5 GOAL CALC'!F47:G47))/4),\"\",(('HAA5 GOAL CALC'!H47*2+SUM('HAA5 GOAL CALC'!F47:G47))/4))","v":""},{"$f":"IF(ISERROR(('HAA5 GOAL CALC'!I47*2+SUM('HAA5 GOAL CALC'!G47:H47))/4),\"\",(('HAA5 GOAL CALC'!I47*2+SUM('HAA5 GOAL CALC'!G47:H47))/4))","v":""},{"$f":"IF(ISERROR(('HAA5 GOAL CALC'!J47*2+SUM('HAA5 GOAL CALC'!H47:I47))/4),\"\",(('HAA5 GOAL CALC'!J47*2+SUM('HAA5 GOAL CALC'!H47:I47))/4))","v":""},{"$f":"IF(ISERROR(('HAA5 GOAL CALC'!K47*2+SUM('HAA5 GOAL CALC'!I47:J47))/4),\"\",(('HAA5 GOAL CALC'!K47*2+SUM('HAA5 GOAL CALC'!I47:J47))/4))","v":""},{"$f":"IF(ISERROR(('HAA5 GOAL CALC'!L47*2+SUM('HAA5 GOAL CALC'!J47:K47))/4),\"\",(('HAA5 GOAL CALC'!L47*2+SUM('HAA5 GOAL CALC'!J47:K47))/4))","v":""},{"$f":"IF(ISERROR(('HAA5 GOAL CALC'!M47*2+SUM('HAA5 GOAL CALC'!K47:L47))/4),\"\",(('HAA5 GOAL CALC'!M47*2+SUM('HAA5 GOAL CALC'!K47:L47))/4))","v":""},{"$f":"IF(ISERROR(('HAA5 GOAL CALC'!N47*2+SUM('HAA5 GOAL CALC'!L47:M47))/4),\"\",(('HAA5 GOAL CALC'!N47*2+SUM('HAA5 GOAL CALC'!L47:M47))/4))","v":""}]
[null,{"$f":"'HAA5 GOAL CALC'!B48","v":"Site 30"},"",{"$f":"IF(ISERROR(('HAA5 GOAL CALC'!F48*2+SUM('HAA5 GOAL CALC'!D48:E48))/4),\"\",(('HAA5 GOAL CALC'!F48*2+SUM('HAA5 GOAL CALC'!D48:E48))/4))","v":""},{"$f":"IF(ISERROR(('HAA5 GOAL CALC'!G48*2+SUM('HAA5 GOAL CALC'!E48:F48))/4),\"\",(('HAA5 GOAL CALC'!G48*2+SUM('HAA5 GOAL CALC'!E48:F48))/4))","v":""},{"$f":"IF(ISERROR(('HAA5 GOAL CALC'!H48*2+SUM('HAA5 GOAL CALC'!F48:G48))/4),\"\",(('HAA5 GOAL CALC'!H48*2+SUM('HAA5 GOAL CALC'!F48:G48))/4))","v":""},{"$f":"IF(ISERROR(('HAA5 GOAL CALC'!I48*2+SUM('HAA5 GOAL CALC'!G48:H48))/4),\"\",(('HAA5 GOAL CALC'!I48*2+SUM('HAA5 GOAL CALC'!G48:H48))/4))","v":""},{"$f":"IF(ISERROR(('HAA5 GOAL CALC'!J48*2+SUM('HAA5 GOAL CALC'!H48:I48))/4),\"\",(('HAA5 GOAL CALC'!J48*2+SUM('HAA5 GOAL CALC'!H48:I48))/4))","v":""},{"$f":"IF(ISERROR(('HAA5 GOAL CALC'!K48*2+SUM('HAA5 GOAL CALC'!I48:J48))/4),\"\",(('HAA5 GOAL CALC'!K48*2+SUM('HAA5 GOAL CALC'!I48:J48))/4))","v":""},{"$f":"IF(ISERROR(('HAA5 GOAL CALC'!L48*2+SUM('HAA5 GOAL CALC'!J48:K48))/4),\"\",(('HAA5 GOAL CALC'!L48*2+SUM('HAA5 GOAL CALC'!J48:K48))/4))","v":""},{"$f":"IF(ISERROR(('HAA5 GOAL CALC'!M48*2+SUM('HAA5 GOAL CALC'!K48:L48))/4),\"\",(('HAA5 GOAL CALC'!M48*2+SUM('HAA5 GOAL CALC'!K48:L48))/4))","v":""},{"$f":"IF(ISERROR(('HAA5 GOAL CALC'!N48*2+SUM('HAA5 GOAL CALC'!L48:M48))/4),\"\",(('HAA5 GOAL CALC'!N48*2+SUM('HAA5 GOAL CALC'!L48:M48))/4))","v":""}]

{"sheet":"TTHM GOAL CALC","index":40,"n_rows":845,"n_cols":19,"rows_kept":845,"cut":false,"hidden":true,"merged":[]}
[]
[null,"TTHM Goals Calculation"]
[null,"The data in the table below are calculated based on inputs from the individual sample site input worksheets. Click on the blue update buttom to update the table."]
[null,"If desired, the goals can be modified on a system-specific basis.  Defaults are 70 ppb for the Individual Site Goal and 60 ppb for the Long-Term System Goal."]
[null,null,null,"Individual Site Goal:",70]
[null,null,null,"Long-Term System Goal:",60]
[null,null,null,"TTHM Compliance Avg. LRAA:",{"$f":"AVERAGE(R49:R78)","v":{"$error":"#DIV/0!"}}]
[null,null,null,"TTHM Compliance Max. LRAA:",{"$f":"MAX(R49:R78)","v":0}]
[]
[null,"RED",null,"highlighted LRAA exceeds TTHM compliance value (80 ppb) for that quarter"]
[null,"Blue",null,"highlighted LRAA exceeds the Individual Site Goal for that quarter; unless the LRAA exceeds the compliance value (see above)"]
[null,"Green",null,"highlighted data exceeds the TTHM Long-Term System Goal identified above"]
[]
[]
[null,"System Name:",{"$f":"Main!C5","v":0}]
[null,null,null,{"$f":"IF(E16=4,3,IF(E16=3,2,IF(E16=2,1,IF(E16=1,4))))","v":3},4,1,2,3,4,1,2,3,4,{"$f":"D153","v":1}]
[null,null,null,{"$f":"IF(E16=4,E17,IF(E16=3,E17,IF(E16=2,E17,IF(E16=1,E17-1))))","v":1897},1897,1898,1898,1898,1898,1899,1899,1899,1899,{"$f":"E153","v":1900}]
[null,"Sample Location","Compliance Site",{"$f":"\"Q\"&D16&\" \"&D17","v":"Q3 1897"},{"$f":"\"Q\"&E16&\" \"&E17","v":"Q4 1897"},"Q1 1898","Q2 1898","Q3 1898","Q4 1898","Q1 1899","Q2 1899","Q3 1899","Q4 1899",{"$f":"\"Q\"&N16&\" \"&N17","v":"Q1 1900"}]
[null,{"$f":"'Site 1'!J5","v":"Entry Point"},{"$f":"IF(ISBLANK('Site 1'!T5),\"\",'Site 1'!T5)","v":""},{"$f":"IF(ISERROR(IF(SUM(S1Table)=0,\"\",VLOOKUP(D$16&D$17,$A$159:$G$178,6,FALSE))),\"\",IF(SUM(S1Table)=0,\"\",VLOOKUP(D$16&D$17,$A$159:$G$178,6,FALSE)))","v":""},{"$f":"IF(ISERROR(IF(SUM(S1Table)=0,\"\",VLOOKUP(E$16&E$17,$A$159:$G$178,6,FALSE))),\"\",IF(SUM(S1Table)=0,\"\",VLOOKUP(E$16&E$17,$A$159:$G$178,6,FALSE)))","v":""},"","","","","","","","",""]
[null,{"$f":"'Site 2'!J5","v":"Site 2"},{"$f":"IF(ISBLANK('Site 2'!T5),\"\",'Site 2'!T5)","v":""},{"$f":"IF(ISERROR(IF(SUM(S2Table)=0,\"\",VLOOKUP(D$16&D$17,$A$182:$G$201,6,FALSE))),\"\",IF(SUM(S2Table)=0,\"\",VLOOKUP(D$16&D$17,$A$182:$G$201,6,FALSE)))","v":""},"","","","","","","","","",""]
[null,{"$f":"'Site 3'!J5","v":"Site 3"},{"$f":"IF(ISBLANK('Site 3'!$T$5),\"\",'Site 3'!$T$5)","v":""},{"$f":"IF(ISERROR(IF(SUM(S3Table)=0,\"\",VLOOKUP(D$16&D$17,$A$205:$G$224,6,FALSE))),\"\",IF(SUM(S3Table)=0,\"\",VLOOKUP(D$16&D$17,$A$205:$G$224,6,FALSE)))","v":""},"","","","","","","","","",""]
[null,{"$f":"'Site 4'!J5","v":"Site 4"},{"$f":"IF(ISBLANK('Site 4'!$T$5),\"\",'Site 4'!$T$5)","v":""},{"$f":"IF(ISERROR(IF(SUM(S4Table)=0,\"\",VLOOKUP(D$16&D$17,$A$228:$G$247,6,FALSE))),\"\",IF(SUM(S4Table)=0,\"\",VLOOKUP(D$16&D$17,$A$228:$G$247,6,FALSE)))","v":""},"","","","","","","","","",""]
[null,{"$f":"'Site 5'!J5","v":"Site 5"},{"$f":"IF(ISBLANK('Site 5'!$T$5),\"\",'Site 5'!$T$5)","v":""},{"$f":"IF(ISERROR(IF(SUM(S5Table)=0,\"\",VLOOKUP(D$16&D$17,$A$251:$G$270,6,FALSE))),\"\",IF(SUM(S5Table)=0,\"\",VLOOKUP(D$16&D$17,$A$251:$G$270,6,FALSE)))","v":""},"","","","","","","","","",""]
[null,{"$f":"'Site 6'!$J$5","v":"Site 6"},{"$f":"IF(ISBLANK('Site 6'!$T$5),\"\",'Site 6'!$T$5)","v":""},{"$f":"IF(ISERROR(IF(SUM(S6Table)=0,\"\",VLOOKUP(D$16&D$17,$A$274:$G$293,6,FALSE))),\"\",IF(SUM(S6Table)=0,\"\",VLOOKUP(D$16&D$17,$A$274:$G$293,6,FALSE)))","v":""},"","","","","","","","","",""]
[null,{"$f":"'Site 7'!J5","v":"Site 7"},{"$f":"IF(ISBLANK('Site 7'!$T$5),\"\",'Site 7'!$T$5)","v":""},{"$f":"IF(ISERROR(IF(SUM(S7Table)=0,\"\",VLOOKUP(D$16&D$17,$A$297:$G$316,6,FALSE))),\"\",IF(SUM(S7Table)=0,\"\",VLOOKUP(D$16&D$17,$A$297:$G$316,6,FALSE)))","v":""},"","","","","","","","","",""]
[null,{"$f":"'Site 8'!J5","v":"Site 8"},{"$f":"IF(ISBLANK('Site 8'!$T$5),\"\",'Site 8'!$T$5)","v":""},{"$f":"IF(ISERROR(IF(SUM(S8Table)=0,\"\",VLOOKUP(D$16&D$17,$A$320:$G$339,6,FALSE))),\"\",IF(SUM(S8Table)=0,\"\",VLOOKUP(D$16&D$17,$A$320:$G$339,6,FALSE)))","v":""},"","","","","","","","","",""]
[null,{"$f":"'Site 9'!J5","v":"Site 9"},{"$f":"IF(ISBLANK('Site 9'!$T$5),\"\",'Site 9'!$T$5)","v":""},{"$f":"IF(ISERROR(IF(SUM(S9Table)=0,\"\",VLOOKUP(D$16&D$17,$A$343:$G$362,6,FALSE))),\"\",IF(SUM(S9Table)=0,\"\",VLOOKUP(D$16&D$17,$A$343:$G$362,6,FALSE)))","v":""},"","","","","","","","","",""]
[null,{"$f":"'Site 10'!J5","v":"Site 10"},{"$f":"IF(ISBLANK('Site 10'!$T$5),\"\",'Site 10'!$T$5)","v":""},{"$f":"IF(ISERROR(IF(SUM(S10Table)=0,\"\",VLOOKUP(D$16&D$17,$A$366:$G$385,6,FALSE))),\"\",IF(SUM(S10Table)=0,\"\",VLOOKUP(D$16&D$17,$A$366:$G$385,6,FALSE)))","v":""},"","","","","","","","","",""]
[null,{"$f":"'Site 11'!J5","v":"Site 11"},{"$f":"IF(ISBLANK('Site 11'!$T$5),\"\",'Site 11'!$T$5)","v":""},{"$f":"IF(ISERROR(IF(SUM(S11Table)=0,\"\",VLOOKUP(D$16&D$17,$A$389:$G$408,6,FALSE))),\"\",IF(SUM(S11Table)=0,\"\",VLOOKUP(D$16&D$17,$A$389:$G$408,6,FALSE)))","v":""},"","","","","","","","","",""]
[null,{"$f":"'Site 12'!J5","v":"Site 12"},{"$f":"IF(ISBLANK('Site 12'!$T$5),\"\",'Site 12'!$T$5)","v":""},{"$f":"IF(ISERROR(IF(SUM(S12Table)=0,\"\",VLOOKUP(D$16&D$17,$A$412:$G$431,6,FALSE))),\"\",IF(SUM(S12Table)=0,\"\",VLOOKUP(D$16&D$17,$A$412:$G$431,6,FALSE)))","v":""},"","","","","","","","","",""]
[null,{"$f":"'Site 13'!J5","v":"Site 13"},{"$f":"IF(ISBLANK('Site 13'!$T$5),\"\",'Site 13'!$T$5)","v":""},{"$f":"IF(ISERROR(IF(SUM(S13Table)=0,\"\",VLOOKUP(D$16&D$17,$A$435:$G$454,6,FALSE))),\"\",IF(SUM(S13Table)=0,\"\",VLOOKUP(D$16&D$17,$A$435:$G$454,6,FALSE)))","v":""},"","","","","","","","","",""]
[null,{"$f":"'Site 14'!J5","v":"Site 14"},{"$f":"IF(ISBLANK('Site 14'!$T$5),\"\",'Site 14'!$T$5)","v":""},{"$f":"IF(ISERROR(IF(SUM(S14Table)=0,\"\",VLOOKUP(D$16&D$17,$A$458:$G$477,6,FALSE))),\"\",IF(SUM(S14Table)=0,\"\",VLOOKUP(D$16&D$17,$A$458:$G$477,6,FALSE)))","v":""},"","","","","","","","","",""]
[null,{"$f":"'Site 15'!J5","v":"Site 15"},{"$f":"IF(ISBLANK('Site 15'!$T$5),\"\",'Site 15'!$T$5)","v":""},{"$f":"IF(ISERROR(IF(SUM(S15Table)=0,\"\",VLOOKUP(D$16&D$17,$A$481:$G$500,6,FALSE))),\"\",IF(SUM(S15Table)=0,\"\",VLOOKUP(D$16&D$17,$A$481:$G$500,6,FALSE)))","v":""},"","","","","","","","","",""]
[null,{"$f":"'Site 16'!J5","v":"Site 16"},{"$f":"IF(ISBLANK('Site 16'!$T$5),\"\",'Site 16'!$T$5)","v":""},{"$f":"IF(ISERROR(IF(SUM(S16Table)=0,\"\",VLOOKUP(D$16&D$17,$A$504:$G$523,6,FALSE))),\"\",IF(SUM(S16Table)=0,\"\",VLOOKUP(D$16&D$17,$A$504:$G$523,6,FALSE)))","v":""},"","","","","","","","","",""]
[null,{"$f":"'Site 17'!J5","v":"Site 17"},{"$f":"IF(ISBLANK('Site 17'!$T$5),\"\",'Site 17'!$T$5)","v":""},{"$f":"IF(ISERROR(IF(SUM(S17Table)=0,\"\",VLOOKUP(D$16&D$17,$A$527:$G$546,6,FALSE))),\"\",IF(SUM(S17Table)=0,\"\",VLOOKUP(D$16&D$17,$A$527:$G$546,6,FALSE)))","v":""},"","","","","","","","","",""]
[null,{"$f":"'Site 18'!J5","v":"Site 18"},{"$f":"IF(ISBLANK('Site 18'!$T$5),\"\",'Site 18'!$T$5)","v":""},{"$f":"IF(ISERROR(IF(SUM(S15Table)=0,\"\",VLOOKUP(D$16&D$17,$A$481:$G$500,6,FALSE))),\"\",IF(SUM(S15Table)=0,\"\",VLOOKUP(D$16&D$17,$A$481:$G$500,6,FALSE)))","v":""},{"$f":"IF(ISERROR(IF(SUM(S18Table)=0,\"\",VLOOKUP(E$16&E$17,$A$550:$G$569,6,FALSE))),\"\",IF(SUM(S18Table)=0,\"\",VLOOKUP(E$16&E$17,$A$550:$G$569,6,FALSE)))","v":""},"","","","","","","","",""]
[null,{"$f":"'Site 19'!J5","v":"Site 19"},{"$f":"IF(ISBLANK('Site 19'!$T$5),\"\",'Site 19'!$T$5)","v":""},{"$f":"IF(ISERROR(IF(SUM(S19Table)=0,\"\",VLOOKUP(D$16&D$17,$A$573:$G$592,6,FALSE))),\"\",IF(SUM(S19Table)=0,\"\",VLOOKUP(D$16&D$17,$A$573:$G$592,6,FALSE)))","v":""},"","","","","","","","","",""]
[null,{"$f":"'Site 20'!J5","v":"Site 20"},{"$f":"IF(ISBLANK('Site 20'!$T$5),\"\",'Site 20'!$T$5)","v":""},{"$f":"IF(ISERROR(IF(SUM(S20Table)=0,\"\",VLOOKUP(D$16&D$17,$A$596:$G$615,6,FALSE))),\"\",IF(SUM(S20Table)=0,\"\",VLOOKUP(D$16&D$17,$A$596:$G$615,6,FALSE)))","v":""},"","","","","","","","","",""]
[null,{"$f":"'Site 21'!J5","v":"Site 21"},{"$f":"IF(ISBLANK('Site 21'!$T$5),\"\",'Site 21'!$T$5)","v":""},{"$f":"IF(ISERROR(IF(SUM(S21Table)=0,\"\",VLOOKUP(D$16&D$17,$A$619:$G$638,6,FALSE))),\"\",IF(SUM(S21Table)=0,\"\",VLOOKUP(D$16&D$17,$A$619:$G$638,6,FALSE)))","v":""},"","","","","","","","","",""]
[null,{"$f":"'Site 22'!J5","v":"Site 22"},{"$f":"IF(ISBLANK('Site 22'!$T$5),\"\",'Site 22'!$T$5)","v":""},{"$f":"IF(ISERROR(IF(SUM(S22Table)=0,\"\",VLOOKUP(D$16&D$17,$A$642:$G$661,6,FALSE))),\"\",IF(SUM(S22Table)=0,\"\",VLOOKUP(D$16&D$17,$A$642:$G$661,6,FALSE)))","v":""},"","","","","","","","","",""]
[null,{"$f":"'Site 23'!J5","v":"Site 23"},{"$f":"IF(ISBLANK('Site 23'!$T$5),\"\",'Site 23'!$T$5)","v":""},{"$f":"IF(ISERROR(IF(SUM(S23Table)=0,\"\",VLOOKUP(D$16&D$17,$A$665:$G$684,6,FALSE))),\"\",IF(SUM(S23Table)=0,\"\",VLOOKUP(D$16&D$17,$A$665:$G$684,6,FALSE)))","v":""},"","","","","","","","","",""]
[null,{"$f":"'Site 24'!J5","v":"Site 24"},{"$f":"IF(ISBLANK('Site 24'!$T$5),\"\",'Site 24'!$T$5)","v":""},{"$f":"IF(ISERROR(IF(SUM(S24Table)=0,\"\",VLOOKUP(D$16&D$17,$A$688:$G$707,6,FALSE))),\"\",IF(SUM(S24Table)=0,\"\",VLOOKUP(D$16&D$17,$A$688:$G$707,6,FALSE)))","v":""},"","","","","","","","","",""]
[null,{"$f":"'Site 25'!J5","v":"Site 25"},{"$f":"IF(ISBLANK('Site 25'!$T$5),\"\",'Site 25'!$T$5)","v":""},{"$f":"IF(ISERROR(IF(SUM(S25Table)=0,\"\",VLOOKUP(D$16&D$17,$A$711:$G$730,6,FALSE))),\"\",IF(SUM(S25Table)=0,\"\",VLOOKUP(D$16&D$17,$A$711:$G$730,6,FALSE)))","v":""},"","","","","","","","","",""]
[null,{"$f":"'Site 26'!J5","v":"Site 26"},{"$f":"IF(ISBLANK('Site 26'!$T$5),\"\",'Site 26'!$T$5)","v":""},{"$f":"IF(ISERROR(IF(SUM(S26Table)=0,\"\",VLOOKUP(D$16&D$17,$A$734:$G$753,6,FALSE))),\"\",IF(SUM(S26Table)=0,\"\",VLOOKUP(D$16&D$17,$A$734:$G$753,6,FALSE)))","v":""},"","","","","","","","","",""]
[null,{"$f":"'Site 27'!J5","v":"Site 27"},{"$f":"IF(ISBLANK('Site 27'!$T$5),\"\",'Site 27'!$T$5)","v":""},{"$f":"IF(ISERROR(IF(SUM(S27Table)=0,\"\",VLOOKUP(D$16&D$17,$A$757:$G$776,6,FALSE))),\"\",IF(SUM(S27Table)=0,\"\",VLOOKUP(D$16&D$17,$A$757:$G$776,6,FALSE)))","v":""},"","","","","","","","","",""]
[null,{"$f":"'Site 28'!J5","v":"Site 28"},{"$f":"IF(ISBLANK('Site 28'!$T$5),\"\",'Site 28'!$T$5)","v":""},{"$f":"IF(ISERROR(IF(SUM(S28Table)=0,\"\",VLOOKUP(D$16&D$17,$A$780:$G$799,6,FALSE))),\"\",IF(SUM(S28Table)=0,\"\",VLOOKUP(D$16&D$17,$A$780:$G$799,6,FALSE)))","v":""},"","","","","","","","","",""]
[null,{"$f":"'Site 29'!J5","v":"Site 29"},{"$f":"IF(ISBLANK('Site 29'!$T$5),\"\",'Site 29'!$T$5)","v":""},{"$f":"IF(ISERROR(IF(SUM(S29Table)=0,\"\",VLOOKUP(D$16&D$17,$A$803:$G$822,6,FALSE))),\"\",IF(SUM(S29Table)=0,\"\",VLOOKUP(D$16&D$17,$A$803:$G$822,6,FALSE)))","v":""},"","","","","","","","","",""]
[null,{"$f":"'Site 30'!J5","v":"Site 30"},{"$f":"IF(ISBLANK('Site 30'!$T$5),\"\",'Site 30'!$T$5)","v":""},{"$f":"IF(ISERROR(IF(SUM(S30Table)=0,\"\",VLOOKUP(D$16&D$17,$A$826:$G$845,6,FALSE))),\"\",IF(SUM(S30Table)=0,\"\",VLOOKUP(D$16&D$17,$A$826:$G$845,6,FALSE)))","v":""},"","","","","","","","","","",null,"Formulas for labeling max. LRAA sites on LT charts",null,"Compliance Check"]
[null,{"$f":"B19","v":"Entry Point"},{"$f":"C19","v":""},"LRAA",null,null,{"$f":"IF(COUNT(D19:G19)<4,\"NA\",AVERAGE(D19:G19))","v":"NA"},"NA","NA","NA","NA","NA","NA","NA",null,{"$f":"B49","v":"Entry Point"},{"$f":"IF($G$86=B49,B49,IF($H$86=B49,B49,IF($I$86=B49,B49,IF($J$86=B49,B49,IF($K$86=B49,B49,IF($L$86=B49,B49,IF($M$86=B49,B49,IF($N$86=B49,B49,\"\"))))))))","v":""},{"$f":"IF(C49=\"y\",N49,\"\")","v":""}]
[null,{"$f":"B20","v":"Site 2"},{"$f":"C20","v":""},"LRAA",null,null,{"$f":"IF(COUNT(D20:G20)<4,\"NA\",AVERAGE(D20:G20))","v":"NA"},"NA","NA","NA","NA","NA","NA","NA",null,{"$f":"B50","v":"Site 2"},{"$f":"IF($G$86=B50,B50,IF($H$86=B50,B50,IF($I$86=B50,B50,IF($J$86=B50,B50,IF($K$86=B50,B50,IF($L$86=B50,B50,IF($M$86=B50,B50,IF($N$86=B50,B50,\"\"))))))))","v":""},{"$f":"IF(C50=\"y\",N50,\"\")","v":""}]
[null,{"$f":"B21","v":"Site 3"},"","LRAA",null,null,"NA","NA","NA","NA","NA","NA","NA","NA",null,"Site 3","",""]
[null,{"$f":"B22","v":"Site 4"},"","LRAA",null,null,{"$f":"IF(COUNT(D22:G22)<4,\"NA\",AVERAGE(D22:G22))","v":"NA"},"NA","NA","NA","NA","NA","NA","NA",null,"Site 4","",""]
[null,"Site 5","","LRAA",null,null,{"$f":"IF(COUNT(D23:G23)<4,\"NA\",AVERAGE(D23:G23))","v":"NA"},"NA","NA","NA","NA","NA","NA","NA",null,"Site 5","",""]
[null,"Site 6","","LRAA",null,null,{"$f":"IF(COUNT(D24:G24)<4,\"NA\",AVERAGE(D24:G24))","v":"NA"},"NA","NA","NA","NA","NA","NA","NA",null,"Site 6","",""]
[null,"Site 7","","LRAA",null,null,{"$f":"IF(COUNT(D25:G25)<4,\"NA\",AVERAGE(D25:G25))","v":"NA"},"NA","NA","NA","NA","NA","NA","NA",null,"Site 7","",""]
[null,"Site 8","","LRAA",null,null,{"$f":"IF(COUNT(D26:G26)<4,\"NA\",AVERAGE(D26:G26))","v":"NA"},"NA","NA","NA","NA","NA","NA","NA",null,"Site 8","",""]
[null,"Site 9","","LRAA",null,null,{"$f":"IF(COUNT(D27:G27)<4,\"NA\",AVERAGE(D27:G27))","v":"NA"},"NA","NA","NA","NA","NA","NA","NA",null,"Site 9","",""]
[null,"Site 10","","LRAA",null,null,{"$f":"IF(COUNT(D28:G28)<4,\"NA\",AVERAGE(D28:G28))","v":"NA"},"NA","NA","NA","NA","NA","NA","NA",null,"Site 10","",""]
[null,"Site 11","","LRAA",null,null,{"$f":"IF(COUNT(D29:G29)<4,\"NA\",AVERAGE(D29:G29))","v":"NA"},"NA","NA","NA","NA","NA","NA","NA",null,"Site 11","",""]
[null,"Site 12","","LRAA",null,null,{"$f":"IF(COUNT(D30:G30)<4,\"NA\",AVERAGE(D30:G30))","v":"NA"},"NA","NA","NA","NA","NA","NA","NA",null,"Site 12","",""]
[null,"Site 13","","LRAA",null,null,{"$f":"IF(COUNT(D31:G31)<4,\"NA\",AVERAGE(D31:G31))","v":"NA"},"NA","NA","NA","NA","NA","NA","NA",null,"Site 13","",""]
[null,"Site 14","","LRAA",null,null,{"$f":"IF(COUNT(D32:G32)<4,\"NA\",AVERAGE(D32:G32))","v":"NA"},"NA","NA","NA","NA","NA","NA","NA",null,"Site 14","",""]
[null,"Site 15","","LRAA",null,null,{"$f":"IF(COUNT(D33:G33)<4,\"NA\",AVERAGE(D33:G33))","v":"NA"},"NA","NA","NA","NA","NA","NA","NA",null,"Site 15","",""]
[null,"Site 16","","LRAA",null,null,{"$f":"IF(COUNT(D34:G34)<4,\"NA\",AVERAGE(D34:G34))","v":"NA"},"NA","NA","NA","NA","NA","NA","NA",null,"Site 16","",""]
[null,"Site 17","","LRAA",null,null,{"$f":"IF(COUNT(D35:G35)<4,\"NA\",AVERAGE(D35:G35))","v":"NA"},"NA","NA","NA","NA","NA","NA","NA",null,"Site 17","",""]
[null,"Site 18","","LRAA",null,null,{"$f":"IF(COUNT(D36:G36)<4,\"NA\",AVERAGE(D36:G36))","v":"NA"},"NA","NA","NA","NA","NA","NA","NA",null,"Site 18","",""]
[null,"Site 19","","LRAA",null,null,{"$f":"IF(COUNT(D37:G37)<4,\"NA\",AVERAGE(D37:G37))","v":"NA"},"NA","NA","NA","NA","NA","NA","NA",null,"Site 19","",""]
[null,"Site 20","","LRAA",null,null,{"$f":"IF(COUNT(D38:G38)<4,\"NA\",AVERAGE(D38:G38))","v":"NA"},"NA","NA","NA","NA","NA","NA","NA",null,"Site 20","",""]
[null,"Site 21","","LRAA",null,null,{"$f":"IF(COUNT(D39:G39)<4,\"NA\",AVERAGE(D39:G39))","v":"NA"},"NA","NA","NA","NA","NA","NA","NA",null,"Site 21","",""]
[null,"Site 22","","LRAA",null,null,{"$f":"IF(COUNT(D40:G40)<4,\"NA\",AVERAGE(D40:G40))","v":"NA"},"NA","NA","NA","NA","NA","NA","NA",null,"Site 22","",""]
[null,"Site 23","","LRAA",null,null,{"$f":"IF(COUNT(D41:G41)<4,\"NA\",AVERAGE(D41:G41))","v":"NA"},"NA","NA","NA","NA","NA","NA","NA",null,"Site 23","",""]
[null,"Site 24","","LRAA",null,null,{"$f":"IF(COUNT(D42:G42)<4,\"NA\",AVERAGE(D42:G42))","v":"NA"},"NA","NA","NA","NA","NA","NA","NA",null,"Site 24","",""]
[null,"Site 25","","LRAA",null,null,{"$f":"IF(COUNT(D43:G43)<4,\"NA\",AVERAGE(D43:G43))","v":"NA"},"NA","NA","NA","NA","NA","NA","NA",null,"Site 25","",""]
[null,"Site 26","","LRAA",null,null,{"$f":"IF(COUNT(D44:G44)<4,\"NA\",AVERAGE(D44:G44))","v":"NA"},"NA","NA","NA","NA","NA","NA","NA",null,"Site 26","",""]
[null,"Site 27","","LRAA",null,null,{"$f":"IF(COUNT(D45:G45)<4,\"NA\",AVERAGE(D45:G45))","v":"NA"},"NA","NA","NA","NA","NA","NA","NA",null,"Site 27","",""]
[null,"Site 28","","LRAA",null,null,{"$f":"IF(COUNT(D46:G46)<4,\"NA\",AVERAGE(D46:G46))","v":"NA"},"NA","NA","NA","NA","NA","NA","NA",null,"Site 28","",""]
[null,"Site 29","","LRAA",null,null,{"$f":"IF(COUNT(D47:G47)<4,\"NA\",AVERAGE(D47:G47))","v":"NA"},"NA","NA","NA","NA","NA","NA","NA",null,"Site 29","","",{"$f":"IF(C77=\"y\",N77,\"\")","v":""}]
[null,"Site 30","","LRAA",null,null,{"$f":"IF(COUNT(D48:G48)<4,\"NA\",AVERAGE(D48:G48))","v":"NA"},"NA","NA","NA","NA","NA","NA","NA",null,"Site 30","","",{"$f":"IF(C78=\"y\",N78,\"\")","v":""}]
[null,"Max LRAA",null,null,null,null,{"$f":"IF(COUNT(G49:G78)=0,\"NA\",MAX(G49:G78))","v":"NA"},{"$f":"IF(COUNT(H49:H78)=0,\"NA\",MAX(H49:H78))","v":"NA"},"NA","NA","NA","NA","NA","NA",null,null,{"$f":"CONCATENATE(Q49,\"  \",Q50,\"  \",Q51,\"  \",Q70,\"  \",Q71,\"  \",Q72,\"  \",Q73,\"  \",Q74,\"  \",Q75,\"  \",Q76,\"  \",Q77,\"  \",Q78)","v":"                      "}]
[null,"Avg of Max LRAAs",null,null,null,null,null,null,null,null,null,null,null,{"$f":"IF(COUNT(G79:N79)<8,\"NA\",AVERAGE(G79:N79))","v":"NA"},null,null,{"$f":"Q49&\" \"&Q50&\" \"&Q51&\" \"&Q52&\" \"&Q53&\" \"&Q54&\" \"&Q55&\" \"&Q56&\" \"&Q57&\" \"&Q58&\" \"&Q59&\" \"&Q60&\" \"&Q61&\" \"&Q62&\" \"&Q63&\" \"&Q64&\" \"&Q65&\" \"&Q66&\" \"&Q67&\" \"&Q68&\" \"&Q69&\" \"&Q70&\" \"&Q71&\" \"&Q72&\" \"&Q73&\" \"&Q74&\" \"&Q75&\" \"&Q76&\" \"&Q77&\" \"&Q78","v":"                             "}]
[]
[null,"Data for plotting"]
[null,"Avg of Max LRAAs",null,null,null,null,{"$f":"+$N$80","v":"NA"},"NA","NA","NA","NA","NA","NA","NA"]
[null,"Individual Site Goal",null,null,null,null,{"$f":"+$E$5","v":70},70,70,70,70,70,70,70]
[null,"Long-Term System Goal",null,null,null,null,{"$f":"+$E$6","v":60},60,60,60,60,60,60,60]
[null,null,null,null,null,null,{"$f":"IF(SUM(G49:G78)=0,\"\",(VLOOKUP(MAX(G49:G78),$G$49:$P$78,10,FALSE)))","v":""},{"$f":"IF(SUM(H49:H78)=0,\"\",VLOOKUP(MAX(H49:H78),$H$49:$P$78,9,FALSE))","v":""},{"$f":"IF(SUM(I49:I78)=0,\"\",VLOOKUP(MAX(I49:I78),$I$49:$P$78,8,FALSE))","v":""},{"$f":"IF(SUM(J49:J78)=0,\"\",VLOOKUP(MAX(J49:J78),$J$49:$P$78,7,FALSE))","v":""},{"$f":"IF(SUM(K49:K78)=0,\"\",VLOOKUP(MAX(K49:K78),$K$49:$P$78,6,FALSE))","v":""},{"$f":"IF(SUM(L49:L78)=0,\"\",VLOOKUP(MAX(L49:L78),$L$49:$P$78,5,FALSE))","v":""},{"$f":"IF(SUM(M49:M78)=0,\"\",VLOOKUP(MAX(M49:M78),$M$49:$P$78,4,FALSE))","v":""},{"$f":"IF(SUM(N49:N78)=0,\"\",VLOOKUP(MAX(N49:N78),$N$49:$P$78,3,FALSE))","v":""}]
[]
[null,{"$f":"B19","v":"Entry Point"},null,"TTHM Goal",null,null,{"$f":"'Site 1'!$L$7","v":20},{"$f":"'Site 1'!$L$7","v":20},{"$f":"'Site 1'!$L$7","v":20},{"$f":"'Site 1'!$L$7","v":20},{"$f":"'Site 1'!$L$7","v":20},{"$f":"'Site 1'!$L$7","v":20},{"$f":"'Site 1'!$L$7","v":20},{"$f":"'Site 1'!$L$7","v":20}]
[null,{"$f":"B20","v":"Site 2"},null,"TTHM Goal",null,null,{"$f":"'Site 2'!$L$7","v":0},{"$f":"'Site 2'!$L$7","v":0},{"$f":"'Site 2'!$L$7","v":0},{"$f":"'Site 2'!$L$7","v":0},{"$f":"'Site 2'!$L$7","v":0},{"$f":"'Site 2'!$L$7","v":0},{"$f":"'Site 2'!$L$7","v":0},{"$f":"'Site 2'!$L$7","v":0}]
[null,{"$f":"B21","v":"Site 3"},null,"TTHM Goal",null,null,{"$f":"'Site 3'!$L$7","v":0},{"$f":"'Site 3'!$L$7","v":0},{"$f":"'Site 3'!$L$7","v":0},{"$f":"'Site 3'!$L$7","v":0},{"$f":"'Site 3'!$L$7","v":0},{"$f":"'Site 3'!$L$7","v":0},{"$f":"'Site 3'!$L$7","v":0},{"$f":"'Site 3'!$L$7","v":0}]
[null,{"$f":"B22","v":"Site 4"},null,"TTHM Goal",null,null,{"$f":"'Site 4'!$L$7","v":0},{"$f":"'Site 4'!$L$7","v":0},{"$f":"'Site 4'!$L$7","v":0},{"$f":"'Site 4'!$L$7","v":0},{"$f":"'Site 4'!$L$7","v":0},{"$f":"'Site 4'!$L$7","v":0},{"$f":"'Site 4'!$L$7","v":0},{"$f":"'Site 4'!$L$7","v":0}]
[null,{"$f":"B23","v":"Site 5"},null,"TTHM Goal",null,null,{"$f":"'Site 5'!$L$7","v":0},{"$f":"'Site 5'!$L$7","v":0},{"$f":"'Site 5'!$L$7","v":0},{"$f":"'Site 5'!$L$7","v":0},{"$f":"'Site 5'!$L$7","v":0},{"$f":"'Site 5'!$L$7","v":0},{"$f":"'Site 5'!$L$7","v":0},{"$f":"'Site 5'!$L$7","v":0}]
[null,{"$f":"B24","v":"Site 6"},null,"TTHM Goal",null,null,{"$f":"'Site 6'!$L$7","v":0},{"$f":"'Site 6'!$L$7","v":0},{"$f":"'Site 6'!$L$7","v":0},{"$f":"'Site 6'!$L$7","v":0},{"$f":"'Site 6'!$L$7","v":0},{"$f":"'Site 6'!$L$7","v":0},{"$f":"'Site 6'!$L$7","v":0},{"$f":"'Site 6'!$L$7","v":0}]
[null,"Site 7",null,"TTHM Goal",null,null,{"$f":"'Site 7'!$L$7","v":0},{"$f":"'Site 7'!$L$7","v":0},{"$f":"'Site 7'!$L$7","v":0},{"$f":"'Site 7'!$L$7","v":0},{"$f":"'Site 7'!$L$7","v":0},{"$f":"'Site 7'!$L$7","v":0},{"$f":"'Site 7'!$L$7","v":0},{"$f":"'Site 7'!$L$7","v":0}]
[null,"Site 8",null,"TTHM Goal",null,null,{"$f":"'Site 8'!$L$7","v":0},{"$f":"'Site 8'!$L$7","v":0},{"$f":"'Site 8'!$L$7","v":0},{"$f":"'Site 8'!$L$7","v":0},{"$f":"'Site 8'!$L$7","v":0},{"$f":"'Site 8'!$L$7","v":0},{"$f":"'Site 8'!$L$7","v":0},{"$f":"'Site 8'!$L$7","v":0}]
[null,"Site 9",null,"TTHM Goal",null,null,{"$f":"'Site 9'!$L$7","v":0},{"$f":"'Site 9'!$L$7","v":0},{"$f":"'Site 9'!$L$7","v":0},{"$f":"'Site 9'!$L$7","v":0},{"$f":"'Site 9'!$L$7","v":0},{"$f":"'Site 9'!$L$7","v":0},{"$f":"'Site 9'!$L$7","v":0},{"$f":"'Site 9'!$L$7","v":0}]
[null,"Site 10",null,"TTHM Goal",null,null,{"$f":"'Site 10'!$L$7","v":0},{"$f":"'Site 10'!$L$7","v":0},{"$f":"'Site 10'!$L$7","v":0},{"$f":"'Site 10'!$L$7","v":0},{"$f":"'Site 10'!$L$7","v":0},{"$f":"'Site 10'!$L$7","v":0},{"$f":"'Site 10'!$L$7","v":0},{"$f":"'Site 10'!$L$7","v":0}]
[null,"Site 11",null,"TTHM Goal",null,null,{"$f":"'Site 11'!$L$7","v":0},{"$f":"'Site 11'!$L$7","v":0},{"$f":"'Site 11'!$L$7","v":0},{"$f":"'Site 11'!$L$7","v":0},{"$f":"'Site 11'!$L$7","v":0},{"$f":"'Site 11'!$L$7","v":0},{"$f":"'Site 11'!$L$7","v":0},{"$f":"'Site 11'!$L$7","v":0}]
[null,"Site 12",null,"TTHM Goal",null,null,{"$f":"'Site 12'!$L$7","v":0},{"$f":"'Site 12'!$L$7","v":0},{"$f":"'Site 12'!$L$7","v":0},{"$f":"'Site 12'!$L$7","v":0},{"$f":"'Site 12'!$L$7","v":0},{"$f":"'Site 12'!$L$7","v":0},{"$f":"'Site 12'!$L$7","v":0},{"$f":"'Site 12'!$L$7","v":0}]
[null,"Site 13",null,"TTHM Goal",null,null,{"$f":"'Site 13'!$L$7","v":0},{"$f":"'Site 13'!$L$7","v":0},{"$f":"'Site 13'!$L$7","v":0},{"$f":"'Site 13'!$L$7","v":0},{"$f":"'Site 13'!$L$7","v":0},{"$f":"'Site 13'!$L$7","v":0},{"$f":"'Site 13'!$L$7","v":0},{"$f":"'Site 13'!$L$7","v":0}]
[null,"Site 14",null,"TTHM Goal",null,null,{"$f":"'Site 14'!$L$7","v":0},{"$f":"'Site 14'!$L$7","v":0},{"$f":"'Site 14'!$L$7","v":0},{"$f":"'Site 14'!$L$7","v":0},{"$f":"'Site 14'!$L$7","v":0},{"$f":"'Site 14'!$L$7","v":0},{"$f":"'Site 14'!$L$7","v":0},{"$f":"'Site 14'!$L$7","v":0}]
[null,"Site 15",null,"TTHM Goal",null,null,{"$f":"'Site 15'!$L$7","v":0},{"$f":"'Site 15'!$L$7","v":0},{"$f":"'Site 15'!$L$7","v":0},{"$f":"'Site 15'!$L$7","v":0},{"$f":"'Site 15'!$L$7","v":0},{"$f":"'Site 15'!$L$7","v":0},{"$f":"'Site 15'!$L$7","v":0},{"$f":"'Site 15'!$L$7","v":0}]
[null,"Site 16",null,"TTHM Goal",null,null,{"$f":"'Site 16'!$L$7","v":0},{"$f":"'Site 16'!$L$7","v":0},{"$f":"'Site 16'!$L$7","v":0},{"$f":"'Site 16'!$L$7","v":0},{"$f":"'Site 16'!$L$7","v":0},{"$f":"'Site 16'!$L$7","v":0},{"$f":"'Site 16'!$L$7","v":0},{"$f":"'Site 16'!$L$7","v":0}]
[null,"Site 17",null,"TTHM Goal",null,null,{"$f":"'Site 17'!$L$7","v":0},{"$f":"'Site 17'!$L$7","v":0},{"$f":"'Site 17'!$L$7","v":0},{"$f":"'Site 17'!$L$7","v":0},{"$f":"'Site 17'!$L$7","v":0},{"$f":"'Site 17'!$L$7","v":0},{"$f":"'Site 17'!$L$7","v":0},{"$f":"'Site 17'!$L$7","v":0}]
[null,"Site 18",null,"TTHM Goal",null,null,{"$f":"'Site 18'!$L$7","v":0},{"$f":"'Site 18'!$L$7","v":0},{"$f":"'Site 18'!$L$7","v":0},{"$f":"'Site 18'!$L$7","v":0},{"$f":"'Site 18'!$L$7","v":0},{"$f":"'Site 18'!$L$7","v":0},{"$f":"'Site 18'!$L$7","v":0},{"$f":"'Site 18'!$L$7","v":0}]
[null,"Site 19",null,"TTHM Goal",null,null,{"$f":"'Site 19'!$L$7","v":0},{"$f":"'Site 19'!$L$7","v":0},{"$f":"'Site 19'!$L$7","v":0},{"$f":"'Site 19'!$L$7","v":0},{"$f":"'Site 19'!$L$7","v":0},{"$f":"'Site 19'!$L$7","v":0},{"$f":"'Site 19'!$L$7","v":0},{"$f":"'Site 19'!$L$7","v":0}]
[null,"Site 20",null,"TTHM Goal",null,null,{"$f":"'Site 20'!$L$7","v":0},{"$f":"'Site 20'!$L$7","v":0},{"$f":"'Site 20'!$L$7","v":0},{"$f":"'Site 20'!$L$7","v":0},{"$f":"'Site 20'!$L$7","v":0},{"$f":"'Site 20'!$L$7","v":0},{"$f":"'Site 20'!$L$7","v":0},{"$f":"'Site 20'!$L$7","v":0}]
[null,"Site 21",null,"TTHM Goal",null,null,{"$f":"'Site 21'!$L$7","v":0},{"$f":"'Site 21'!$L$7","v":0},{"$f":"'Site 21'!$L$7","v":0},{"$f":"'Site 21'!$L$7","v":0},{"$f":"'Site 21'!$L$7","v":0},{"$f":"'Site 21'!$L$7","v":0},{"$f":"'Site 21'!$L$7","v":0},{"$f":"'Site 21'!$L$7","v":0}]
[null,"Site 22",null,"TTHM Goal",null,null,{"$f":"'Site 22'!$L$7","v":0},{"$f":"'Site 22'!$L$7","v":0},{"$f":"'Site 22'!$L$7","v":0},{"$f":"'Site 22'!$L$7","v":0},{"$f":"'Site 22'!$L$7","v":0},{"$f":"'Site 22'!$L$7","v":0},{"$f":"'Site 22'!$L$7","v":0},{"$f":"'Site 22'!$L$7","v":0}]
[null,"Site 23",null,"TTHM Goal",null,null,{"$f":"'Site 23'!$L$7","v":0},{"$f":"'Site 23'!$L$7","v":0},{"$f":"'Site 23'!$L$7","v":0},{"$f":"'Site 23'!$L$7","v":0},{"$f":"'Site 23'!$L$7","v":0},{"$f":"'Site 23'!$L$7","v":0},{"$f":"'Site 23'!$L$7","v":0},{"$f":"'Site 23'!$L$7","v":0}]
[null,"Site 24",null,"TTHM Goal",null,null,{"$f":"'Site 24'!$L$7","v":0},{"$f":"'Site 24'!$L$7","v":0},{"$f":"'Site 24'!$L$7","v":0},{"$f":"'Site 24'!$L$7","v":0},{"$f":"'Site 24'!$L$7","v":0},{"$f":"'Site 24'!$L$7","v":0},{"$f":"'Site 24'!$L$7","v":0},{"$f":"'Site 24'!$L$7","v":0}]
[null,"Site 25",null,"TTHM Goal",null,null,{"$f":"'Site 25'!$L$7","v":0},{"$f":"'Site 25'!$L$7","v":0},{"$f":"'Site 25'!$L$7","v":0},{"$f":"'Site 25'!$L$7","v":0},{"$f":"'Site 25'!$L$7","v":0},{"$f":"'Site 25'!$L$7","v":0},{"$f":"'Site 25'!$L$7","v":0},{"$f":"'Site 25'!$L$7","v":0}]
[null,"Site 26",null,"TTHM Goal",null,null,{"$f":"'Site 26'!$L$7","v":0},{"$f":"'Site 26'!$L$7","v":0},{"$f":"'Site 26'!$L$7","v":0},{"$f":"'Site 26'!$L$7","v":0},{"$f":"'Site 26'!$L$7","v":0},{"$f":"'Site 26'!$L$7","v":0},{"$f":"'Site 26'!$L$7","v":0},{"$f":"'Site 26'!$L$7","v":0}]
[null,"Site 27",null,"TTHM Goal",null,null,{"$f":"'Site 27'!$L$7","v":0},{"$f":"'Site 27'!$L$7","v":0},{"$f":"'Site 27'!$L$7","v":0},{"$f":"'Site 27'!$L$7","v":0},{"$f":"'Site 27'!$L$7","v":0},{"$f":"'Site 27'!$L$7","v":0},{"$f":"'Site 27'!$L$7","v":0},{"$f":"'Site 27'!$L$7","v":0}]
[null,"Site 28",null,"TTHM Goal",null,null,{"$f":"'Site 28'!$L$7","v":0},{"$f":"'Site 28'!$L$7","v":0},{"$f":"'Site 28'!$L$7","v":0},{"$f":"'Site 28'!$L$7","v":0},{"$f":"'Site 28'!$L$7","v":0},{"$f":"'Site 28'!$L$7","v":0},{"$f":"'Site 28'!$L$7","v":0},{"$f":"'Site 28'!$L$7","v":0}]
[null,"Site 29",null,"TTHM Goal",null,null,{"$f":"'Site 29'!$L$7","v":0},{"$f":"'Site 29'!$L$7","v":0},{"$f":"'Site 29'!$L$7","v":0},{"$f":"'Site 29'!$L$7","v":0},{"$f":"'Site 29'!$L$7","v":0},{"$f":"'Site 29'!$L$7","v":0},{"$f":"'Site 29'!$L$7","v":0},{"$f":"'Site 29'!$L$7","v":0}]
[null,"Site 30",null,"TTHM Goal",null,null,{"$f":"'Site 30'!$L$7","v":0},{"$f":"'Site 30'!$L$7","v":0},{"$f":"'Site 30'!$L$7","v":0},{"$f":"'Site 30'!$L$7","v":0},{"$f":"'Site 30'!$L$7","v":0},{"$f":"'Site 30'!$L$7","v":0},{"$f":"'Site 30'!$L$7","v":0},{"$f":"'Site 30'!$L$7","v":0}]
[]
[]
[]
[]
[null,"Max Date Determination"]
[null,"Site 1"]
[null,"Site 2"]
[null,"Site 3"]
[null,"Site 4"]
[null,"Site 5"]
[null,"Site 6"]
[null,"Site 7"]
[null,"Site 8"]
[null,"Site 9"]
[null,"Site 10"]
[null,"Site 11"]
[null,"Site 12"]
[null,"Site 13"]
[null,"Site 14"]
[null,"Site 15"]
[null,"Site 16"]
[null,"Site 17"]
[null,"Site 18"]
[null,"Site 19"]
[null,"Site 20"]
[null,"Site 21"]
[null,"Site 22"]
[null,"Site 23"]
[null,"Site 24"]
[null,"Site 25"]
[null,"Site 26"]
[null,"Site 27"]
[null,"Site 28"]
[null,"Site 29"]
[null,"Site 30"]
[null,"Overall",{"$f":"MAX(C123:C152)","v":"00:00:00"},{"$f":"INT((MONTH(C153)-1)/3)+1","v":1},{"$f":"YEAR(C153)","v":1900},{"$f":"\"Q\"&D153&\" \"&E153","v":"Q1 1900"}]
[]
[]
[]
[null,"Site 1 Quarterly Summary"]
["Identifier #","Q & Y",null,null,null,"TTHM","HAA5"]
[{"$f":"RIGHT(LEFT(B159,2),1)&RIGHT(LEFT(B159,7),4)","v":"  & Y"},"Q & Y"]
["11900","Q1 1900 Average",null,null,null,{"$error":"#DIV/0!"},{"$error":"#DIV/0!"}]
["rnd A","Grand Average",null,null,null,{"$error":"#DIV/0!"},{"$error":"#DIV/0!"}]
[""]
[""]
[""]
[""]
[""]
[""]
[""]
[""]
[""]
[{"$f":"RIGHT(LEFT(B171,2),1)&RIGHT(LEFT(B171,7),4)","v":""}]
[{"$f":"RIGHT(LEFT(B172,2),1)&RIGHT(LEFT(B172,7),4)","v":""}]
[""]
[""]
[""]
[""]
[""]
[""]
[]
[null,"Site 2 Quarterly Summary"]
["Identifier #","Q & Y",null,null,null,"TTHM","HAA5"]
[{"$f":"RIGHT(LEFT(B182,2),1)&RIGHT(LEFT(B182,7),4)","v":"  & Y"},"Q & Y"]
["11900","Q1 1900 Average",null,null,null,{"$error":"#DIV/0!"},{"$error":"#DIV/0!"}]
["  & Y","Q & Y"]
["11900","Q1 1900 Average",null,null,null,{"$error":"#DIV/0!"},{"$error":"#DIV/0!"}]
["  & Y","Q & Y"]
["11900","Q1 1900 Average",null,null,null,{"$error":"#DIV/0!"},{"$error":"#DIV/0!"}]
["  & Y","Q & Y"]
["11900","Q1 1900 Average",null,null,null,{"$error":"#DIV/0!"},{"$error":"#DIV/0!"}]
["  & Y","Q & Y"]
["11900","Q1 1900 Average",null,null,null,{"$error":"#DIV/0!"},{"$error":"#DIV/0!"}]
["  & Y","Q & Y"]
[{"$f":"RIGHT(LEFT(B193,2),1)&RIGHT(LEFT(B193,7),4)","v":"11900"},"Q1 1900 Average",null,null,null,{"$error":"#DIV/0!"},{"$error":"#DIV/0!"}]
[{"$f":"RIGHT(LEFT(B194,2),1)&RIGHT(LEFT(B194,7),4)","v":"  & Y"},"Q & Y"]
["11900","Q1 1900 Average",null,null,null,{"$error":"#DIV/0!"},{"$error":"#DIV/0!"}]
["  & Y","Q & Y"]
["11900","Q1 1900 Average",null,null,null,{"$error":"#DIV/0!"},{"$error":"#DIV/0!"}]
["  & Y","Q & Y"]
["11900","Q1 1900 Average",null,null,null,{"$error":"#DIV/0!"},{"$error":"#DIV/0!"}]
["  & Y","Q & Y"]
["11900","Q1 1900 Average",null,null,null,{"$error":"#DIV/0!"},{"$error":"#DIV/0!"}]
[]
[null,"Site 3 Quarterly Summary"]
["Identifier #","Q&Y",null,null,null,"TTHM","HAA5"]
[{"$f":"RIGHT(LEFT(B205,2),1)&RIGHT(LEFT(B205,7),4)","v":"  & Y"},"Q & Y"]
["11900","Q1 1900 Average",null,null,null,{"$error":"#DIV/0!"},{"$error":"#DIV/0!"}]
["  & Y","Q & Y"]
["11900","Q1 1900 Average",null,null,null,{"$error":"#DIV/0!"},{"$error":"#DIV/0!"}]
["  & Y","Q & Y"]
["11900","Q1 1900 Average",null,null,null,{"$error":"#DIV/0!"},{"$error":"#DIV/0!"}]
["  & Y","Q & Y"]
["11900","Q1 1900 Average",null,null,null,{"$error":"#DIV/0!"},{"$error":"#DIV/0!"}]
["  & Y","Q & Y"]
["11900","Q1 1900 Average",null,null,null,{"$error":"#DIV/0!"},{"$error":"#DIV/0!"}]
["  & Y","Q & Y"]
[{"$f":"RIGHT(LEFT(B216,2),1)&RIGHT(LEFT(B216,7),4)","v":"11900"},"Q1 1900 Average",null,null,null,{"$error":"#DIV/0!"},{"$error":"#DIV/0!"}]
[{"$f":"RIGHT(LEFT(B217,2),1)&RIGHT(LEFT(B217,7),4)","v":"  & Y"},"Q & Y"]
["11900","Q1 1900 Average",null,null,null,{"$error":"#DIV/0!"},{"$error":"#DIV/0!"}]
["  & Y","Q & Y"]
["11900","Q1 1900 Average",null,null,null,{"$error":"#DIV/0!"},{"$error":"#DIV/0!"}]
["  & Y","Q & Y"]
["11900","Q1 1900 Average",null,null,null,{"$error":"#DIV/0!"},{"$error":"#DIV/0!"}]
["  & Y","Q & Y"]
["11900","Q1 1900 Average",null,null,null,{"$error":"#DIV/0!"},{"$error":"#DIV/0!"}]
[]
[null,"Site 4 Quarterly Summary"]
["Identifier #","Q & Y",null,"Date",null,"TTHM ppb","HAA5 ppb"]
[{"$f":"RIGHT(LEFT(B228,2),1)&RIGHT(LEFT(B228,7),4)","v":"  & Y"},"Q & Y"]
["11900","Q1 1900 Average",null,null,null,{"$error":"#DIV/0!"},{"$error":"#DIV/0!"}]
["  & Y","Q & Y"]
["11900","Q1 1900 Average",null,null,null,{"$error":"#DIV/0!"},{"$error":"#DIV/0!"}]
["  & Y","Q & Y"]
["11900","Q1 1900 Average",null,null,null,{"$error":"#DIV/0!"},{"$error":"#DIV/0!"}]
["  & Y","Q & Y"]
["11900","Q1 1900 Average",null,null,null,{"$error":"#DIV/0!"},{"$error":"#DIV/0!"}]
["  & Y","Q & Y"]
["11900","Q1 1900 Average",null,null,null,{"$error":"#DIV/0!"},{"$error":"#DIV/0!"}]
["  & Y","Q & Y"]
[{"$f":"RIGHT(LEFT(B239,2),1)&RIGHT(LEFT(B239,7),4)","v":"11900"},"Q1 1900 Average",null,null,null,{"$error":"#DIV/0!"},{"$error":"#DIV/0!"}]
[{"$f":"RIGHT(LEFT(B240,2),1)&RIGHT(LEFT(B240,7),4)","v":"  & Y"},"Q & Y"]
["11900","Q1 1900 Average",null,null,null,{"$error":"#DIV/0!"},{"$error":"#DIV/0!"}]
["  & Y","Q & Y"]
["11900","Q1 1900 Average",null,null,null,{"$error":"#DIV/0!"},{"$error":"#DIV/0!"}]
["  & Y","Q & Y"]
["11900","Q1 1900 Average",null,null,null,{"$error":"#DIV/0!"},{"$error":"#DIV/0!"}]
["  & Y","Q & Y"]
["11900","Q1 1900 Average",null,null,null,{"$error":"#DIV/0!"},{"$error":"#DIV/0!"}]
[]
[null,"Site 5 Quarterly Summary"]
["Identifier #","Q & Y",null,"Date",null,"TTHM ppb","HAA5 ppb"]
[{"$f":"RIGHT(LEFT(B251,2),1)&RIGHT(LEFT(B251,7),4)","v":"  & Y"},"Q & Y"]
["11900","Q1 1900 Average",null,null,null,{"$error":"#DIV/0!"},{"$error":"#DIV/0!"}]
["  & Y","Q & Y"]
["11900","Q1 1900 Average",null,null,null,{"$error":"#DIV/0!"},{"$error":"#DIV/0!"}]
["  & Y","Q & Y"]
["11900","Q1 1900 Average",null,null,null,{"$error":"#DIV/0!"},{"$error":"#DIV/0!"}]
["  & Y","Q & Y"]
["11900","Q1 1900 Average",null,null,null,{"$error":"#DIV/0!"},{"$error":"#DIV/0!"}]
["  & Y","Q & Y"]
["11900","Q1 1900 Average",null,null,null,{"$error":"#DIV/0!"},{"$error":"#DIV/0!"}]
["  & Y","Q & Y"]
[{"$f":"RIGHT(LEFT(B262,2),1)&RIGHT(LEFT(B262,7),4)","v":"11900"},"Q1 1900 Average",null,null,null,{"$error":"#DIV/0!"},{"$error":"#DIV/0!"}]
[{"$f":"RIGHT(LEFT(B263,2),1)&RIGHT(LEFT(B263,7),4)","v":"  & Y"},"Q & Y"]
["11900","Q1 1900 Average",null,null,null,{"$error":"#DIV/0!"},{"$error":"#DIV/0!"}]
["  & Y","Q & Y"]
["11900","Q1 1900 Average",null,null,null,{"$error":"#DIV/0!"},{"$error":"#DIV/0!"}]
["  & Y","Q & Y"]
["11900","Q1 1900 Average",null,null,null,{"$error":"#DIV/0!"},{"$error":"#DIV/0!"}]
["  & Y","Q & Y"]
["11900","Q1 1900 Average",null,null,null,{"$error":"#DIV/0!"},{"$error":"#DIV/0!"}]
[]
[null,"Site 6 Quarterly Summary"]
["Identifier #","Q & Y",null,"Date",null,"TTHM ppb","HAA5 ppb"]
[{"$f":"RIGHT(LEFT(B274,2),1)&RIGHT(LEFT(B274,7),4)","v":"  & Y"},"Q & Y"]
["11900","Q1 1900 Average",null,null,null,{"$error":"#DIV/0!"},{"$error":"#DIV/0!"}]
["  & Y","Q & Y"]
["11900","Q1 1900 Average",null,null,null,{"$error":"#DIV/0!"},{"$error":"#DIV/0!"}]
["  & Y","Q & Y"]
["11900","Q1 1900 Average",null,null,null,{"$error":"#DIV/0!"},{"$error":"#DIV/0!"}]
["  & Y","Q & Y"]
["11900","Q1 1900 Average",null,null,null,{"$error":"#DIV/0!"},{"$error":"#DIV/0!"}]
["  & Y","Q & Y"]
["11900","Q1 1900 Average",null,null,null,{"$error":"#DIV/0!"},{"$error":"#DIV/0!"}]
["  & Y","Q & Y"]
[{"$f":"RIGHT(LEFT(B285,2),1)&RIGHT(LEFT(B285,7),4)","v":"11900"},"Q1 1900 Average",null,null,null,{"$error":"#DIV/0!"},{"$error":"#DIV/0!"}]
[{"$f":"RIGHT(LEFT(B286,2),1)&RIGHT(LEFT(B286,7),4)","v":"  & Y"},"Q & Y"]
["11900","Q1 1900 Average",null,null,null,{"$error":"#DIV/0!"},{"$error":"#DIV/0!"}]
["  & Y","Q & Y"]
["11900","Q1 1900 Average",null,null,null,{"$error":"#DIV/0!"},{"$error":"#DIV/0!"}]
["  & Y","Q & Y"]
["11900","Q1 1900 Average",null,null,null,{"$error":"#DIV/0!"},{"$error":"#DIV/0!"}]
["  & Y","Q & Y"]
["11900","Q1 1900 Average",null,null,null,{"$error":"#DIV/0!"},{"$error":"#DIV/0!"}]
[]
[null,"Site 7 Quarterly Summary"]
["Identifier #","Q & Y",null,"Date",null,"TTHM ppb","HAA5 ppb"]
[{"$f":"RIGHT(LEFT(B297,2),1)&RIGHT(LEFT(B297,7),4)","v":"  & Y"},"Q & Y"]
["11900","Q1 1900 Average",null,null,null,{"$error":"#DIV/0!"},{"$error":"#DIV/0!"}]
["  & Y","Q & Y"]
["11900","Q1 1900 Average",null,null,null,{"$error":"#DIV/0!"},{"$error":"#DIV/0!"}]
["  & Y","Q & Y"]
["11900","Q1 1900 Average",null,null,null,{"$error":"#DIV/0!"},{"$error":"#DIV/0!"}]
["  & Y","Q & Y"]
["11900","Q1 1900 Average",null,null,null,{"$error":"#DIV/0!"},{"$error":"#DIV/0!"}]
["  & Y","Q & Y"]
["11900","Q1 1900 Average",null,null,null,{"$error":"#DIV/0!"},{"$error":"#DIV/0!"}]
["  & Y","Q & Y"]
[{"$f":"RIGHT(LEFT(B308,2),1)&RIGHT(LEFT(B308,7),4)","v":"11900"},"Q1 1900 Average",null,null,null,{"$error":"#DIV/0!"},{"$error":"#DIV/0!"}]
[{"$f":"RIGHT(LEFT(B309,2),1)&RIGHT(LEFT(B309,7),4)","v":"  & Y"},"Q & Y"]
["11900","Q1 1900 Average",null,null,null,{"$error":"#DIV/0!"},{"$error":"#DIV/0!"}]
["  & Y","Q & Y"]
["11900","Q1 1900 Average",null,null,null,{"$error":"#DIV/0!"},{"$error":"#DIV/0!"}]
["  & Y","Q & Y"]
["11900","Q1 1900 Average",null,null,null,{"$error":"#DIV/0!"},{"$error":"#DIV/0!"}]
["  & Y","Q & Y"]
["11900","Q1 1900 Average",null,null,null,{"$error":"#DIV/0!"},{"$error":"#DIV/0!"}]
[]
[null,"Site 8 Quarterly Summary"]
["Identifier #","Q & Y",null,"Date",null,"TTHM ppb","HAA5 ppb"]
[{"$f":"RIGHT(LEFT(B320,2),1)&RIGHT(LEFT(B320,7),4)","v":"  & Y"},"Q & Y"]
["11900","Q1 1900 Average",null,null,null,{"$error":"#DIV/0!"},{"$error":"#DIV/0!"}]
["  & Y","Q & Y"]
["11900","Q1 1900 Average",null,null,null,{"$error":"#DIV/0!"},{"$error":"#DIV/0!"}]
["  & Y","Q & Y"]
["11900","Q1 1900 Average",null,null,null,{"$error":"#DIV/0!"},{"$error":"#DIV/0!"}]
["  & Y","Q & Y"]
["11900","Q1 1900 Average",null,null,null,{"$error":"#DIV/0!"},{"$error":"#DIV/0!"}]
["  & Y","Q & Y"]
["11900","Q1 1900 Average",null,null,null,{"$error":"#DIV/0!"},{"$error":"#DIV/0!"}]
["  & Y","Q & Y"]
[{"$f":"RIGHT(LEFT(B331,2),1)&RIGHT(LEFT(B331,7),4)","v":"11900"},"Q1 1900 Average",null,null,null,{"$error":"#DIV/0!"},{"$error":"#DIV/0!"}]
[{"$f":"RIGHT(LEFT(B332,2),1)&RIGHT(LEFT(B332,7),4)","v":"  & Y"},"Q & Y"]
["11900","Q1 1900 Average",null,null,null,{"$error":"#DIV/0!"},{"$error":"#DIV/0!"}]
["  & Y","Q & Y"]
["11900","Q1 1900 Average",null,null,null,{"$error":"#DIV/0!"},{"$error":"#DIV/0!"}]
["  & Y","Q & Y"]
["11900","Q1 1900 Average",null,null,null,{"$error":"#DIV/0!"},{"$error":"#DIV/0!"}]
["  & Y","Q & Y"]
["11900","Q1 1900 Average",null,null,null,{"$error":"#DIV/0!"},{"$error":"#DIV/0!"}]
[]
[null,"Site 9 Quarterly Summary"]
["Identifier #","Q & Y",null,"Date",null,"TTHM ppb","HAA5 ppb"]
[{"$f":"RIGHT(LEFT(B343,2),1)&RIGHT(LEFT(B343,7),4)","v":"  & Y"},"Q & Y"]
["11900","Q1 1900 Average",null,null,null,{"$error":"#DIV/0!"},{"$error":"#DIV/0!"}]
["  & Y","Q & Y"]
["11900","Q1 1900 Average",null,null,null,{"$error":"#DIV/0!"},{"$error":"#DIV/0!"}]
["  & Y","Q & Y"]
["11900","Q1 1900 Average",null,null,null,{"$error":"#DIV/0!"},{"$error":"#DIV/0!"}]
["  & Y","Q & Y"]
["11900","Q1 1900 Average",null,null,null,{"$error":"#DIV/0!"},{"$error":"#DIV/0!"}]
["  & Y","Q & Y"]
["11900","Q1 1900 Average",null,null,null,{"$error":"#DIV/0!"},{"$error":"#DIV/0!"}]
["  & Y","Q & Y"]
[{"$f":"RIGHT(LEFT(B354,2),1)&RIGHT(LEFT(B354,7),4)","v":"11900"},"Q1 1900 Average",null,null,null,{"$error":"#DIV/0!"},{"$error":"#DIV/0!"}]
[{"$f":"RIGHT(LEFT(B355,2),1)&RIGHT(LEFT(B355,7),4)","v":"  & Y"},"Q & Y"]
["11900","Q1 1900 Average",null,null,null,{"$error":"#DIV/0!"},{"$error":"#DIV/0!"}]
["  & Y","Q & Y"]
["11900","Q1 1900 Average",null,null,null,{"$error":"#DIV/0!"},{"$error":"#DIV/0!"}]
["  & Y","Q & Y"]
["11900","Q1 1900 Average",null,null,null,{"$error":"#DIV/0!"},{"$error":"#DIV/0!"}]
["  & Y","Q & Y"]
["11900","Q1 1900 Average",null,null,null,{"$error":"#DIV/0!"},{"$error":"#DIV/0!"}]
[]
[null,"Site 10 Quarterly Summary"]
["Identifier #","Q & Y",null,"Date",null,"TTHM ppb","HAA5 ppb"]
[{"$f":"RIGHT(LEFT(B366,2),1)&RIGHT(LEFT(B366,7),4)","v":"  & Y"},"Q & Y"]
["11900","Q1 1900 Average",null,null,null,{"$error":"#DIV/0!"},{"$error":"#DIV/0!"}]
["  & Y","Q & Y"]
["11900","Q1 1900 Average",null,null,null,{"$error":"#DIV/0!"},{"$error":"#DIV/0!"}]
["  & Y","Q & Y"]
["11900","Q1 1900 Average",null,null,null,{"$error":"#DIV/0!"},{"$error":"#DIV/0!"}]
["  & Y","Q & Y"]
["11900","Q1 1900 Average",null,null,null,{"$error":"#DIV/0!"},{"$error":"#DIV/0!"}]
["  & Y","Q & Y"]
["11900","Q1 1900 Average",null,null,null,{"$error":"#DIV/0!"},{"$error":"#DIV/0!"}]
["  & Y","Q & Y"]
[{"$f":"RIGHT(LEFT(B377,2),1)&RIGHT(LEFT(B377,7),4)","v":"11900"},"Q1 1900 Average",null,null,null,{"$error":"#DIV/0!"},{"$error":"#DIV/0!"}]
[{"$f":"RIGHT(LEFT(B378,2),1)&RIGHT(LEFT(B378,7),4)","v":"  & Y"},"Q & Y"]
["11900","Q1 1900 Average",null,null,null,{"$error":"#DIV/0!"},{"$error":"#DIV/0!"}]
["  & Y","Q & Y"]
["11900","Q1 1900 Average",null,null,null,{"$error":"#DIV/0!"},{"$error":"#DIV/0!"}]
["  & Y","Q & Y"]
["11900","Q1 1900 Average",null,null,null,{"$error":"#DIV/0!"},{"$error":"#DIV/0!"}]
["  & Y","Q & Y"]
["11900","Q1 1900 Average",null,null,null,{"$error":"#DIV/0!"},{"$error":"#DIV/0!"}]
[]
[null,"Site 11 Quarterly Summary"]
["Identifier #","Q & Y",null,"Date",null,"TTHM ppb","HAA5 ppb"]
[{"$f":"RIGHT(LEFT(B389,2),1)&RIGHT(LEFT(B389,7),4)","v":"  & Y"},"Q & Y"]
["11900","Q1 1900 Average",null,null,null,{"$error":"#DIV/0!"},{"$error":"#DIV/0!"}]
["  & Y","Q & Y"]
["11900","Q1 1900 Average",null,null,null,{"$error":"#DIV/0!"},{"$error":"#DIV/0!"}]
["  & Y","Q & Y"]
["11900","Q1 1900 Average",null,null,null,{"$error":"#DIV/0!"},{"$error":"#DIV/0!"}]
["  & Y","Q & Y"]
["11900","Q1 1900 Average",null,null,null,{"$error":"#DIV/0!"},{"$error":"#DIV/0!"}]
["  & Y","Q & Y"]
["11900","Q1 1900 Average",null,null,null,{"$error":"#DIV/0!"},{"$error":"#DIV/0!"}]
["  & Y","Q & Y"]
[{"$f":"RIGHT(LEFT(B400,2),1)&RIGHT(LEFT(B400,7),4)","v":"11900"},"Q1 1900 Average",null,null,null,{"$error":"#DIV/0!"},{"$error":"#DIV/0!"}]
[{"$f":"RIGHT(LEFT(B401,2),1)&RIGHT(LEFT(B401,7),4)","v":"  & Y"},"Q & Y"]
["11900","Q1 1900 Average",null,null,null,{"$error":"#DIV/0!"},{"$error":"#DIV/0!"}]
["  & Y","Q & Y"]
["11900","Q1 1900 Average",null,null,null,{"$error":"#DIV/0!"},{"$error":"#DIV/0!"}]
["  & Y","Q & Y"]
["11900","Q1 1900 Average",null,null,null,{"$error":"#DIV/0!"},{"$error":"#DIV/0!"}]
["  & Y","Q & Y"]
["11900","Q1 1900 Average",null,null,null,{"$error":"#DIV/0!"},{"$error":"#DIV/0!"}]
[{"$f":"RIGHT(LEFT(B409,2),1)&RIGHT(LEFT(B409,7),4)","v":""}]
[null,"Site 12 Quarterly Summary"]
["Identifier #","Q & Y",null,"Date",null,"TTHM ppb","HAA5 ppb"]
[{"$f":"RIGHT(LEFT(B412,2),1)&RIGHT(LEFT(B412,7),4)","v":"  & Y"},"Q & Y"]
["11900","Q1 1900 Average",null,null,null,{"$error":"#DIV/0!"},{"$error":"#DIV/0!"}]
["  & Y","Q & Y"]
["11900","Q1 1900 Average",null,null,null,{"$error":"#DIV/0!"},{"$error":"#DIV/0!"}]
["  & Y","Q & Y"]
["11900","Q1 1900 Average",null,null,null,{"$error":"#DIV/0!"},{"$error":"#DIV/0!"}]
["  & Y","Q & Y"]
["11900","Q1 1900 Average",null,null,null,{"$error":"#DIV/0!"},{"$error":"#DIV/0!"}]
["  & Y","Q & Y"]
["11900","Q1 1900 Average",null,null,null,{"$error":"#DIV/0!"},{"$error":"#DIV/0!"}]
["  & Y","Q & Y"]
[{"$f":"RIGHT(LEFT(B423,2),1)&RIGHT(LEFT(B423,7),4)","v":"11900"},"Q1 1900 Average",null,null,null,{"$error":"#DIV/0!"},{"$error":"#DIV/0!"}]
[{"$f":"RIGHT(LEFT(B424,2),1)&RIGHT(LEFT(B424,7),4)","v":"  & Y"},"Q & Y"]
["11900","Q1 1900 Average",null,null,null,{"$error":"#DIV/0!"},{"$error":"#DIV/0!"}]
["  & Y","Q & Y"]
["11900","Q1 1900 Average",null,null,null,{"$error":"#DIV/0!"},{"$error":"#DIV/0!"}]
["  & Y","Q & Y"]
["11900","Q1 1900 Average",null,null,null,{"$error":"#DIV/0!"},{"$error":"#DIV/0!"}]
["  & Y","Q & Y"]
["11900","Q1 1900 Average",null,null,null,{"$error":"#DIV/0!"},{"$error":"#DIV/0!"}]
[{"$f":"RIGHT(LEFT(B432,2),1)&RIGHT(LEFT(B432,7),4)","v":""}]
[null,"Site 13 Quarterly Summary"]
["Identifier #","Q & Y",null,"Date",null,"TTHM ppb","HAA5 ppb"]
[{"$f":"RIGHT(LEFT(B435,2),1)&RIGHT(LEFT(B435,7),4)","v":"  & Y"},"Q & Y"]
["11900","Q1 1900 Average",null,null,null,{"$error":"#DIV/0!"},{"$error":"#DIV/0!"}]
["  & Y","Q & Y"]
["11900","Q1 1900 Average",null,null,null,{"$error":"#DIV/0!"},{"$error":"#DIV/0!"}]
["  & Y","Q & Y"]
["11900","Q1 1900 Average",null,null,null,{"$error":"#DIV/0!"},{"$error":"#DIV/0!"}]
["  & Y","Q & Y"]
["11900","Q1 1900 Average",null,null,null,{"$error":"#DIV/0!"},{"$error":"#DIV/0!"}]
["  & Y","Q & Y"]
["11900","Q1 1900 Average",null,null,null,{"$error":"#DIV/0!"},{"$error":"#DIV/0!"}]
["  & Y","Q & Y"]
[{"$f":"RIGHT(LEFT(B446,2),1)&RIGHT(LEFT(B446,7),4)","v":"11900"},"Q1 1900 Average",null,null,null,{"$error":"#DIV/0!"},{"$error":"#DIV/0!"}]
[{"$f":"RIGHT(LEFT(B447,2),1)&RIGHT(LEFT(B447,7),4)","v":"  & Y"},"Q & Y"]
["11900","Q1 1900 Average",null,null,null,{"$error":"#DIV/0!"},{"$error":"#DIV/0!"}]
["  & Y","Q & Y"]
["11900","Q1 1900 Average",null,null,null,{"$error":"#DIV/0!"},{"$error":"#DIV/0!"}]
["  & Y","Q & Y"]
["11900","Q1 1900 Average",null,null,null,{"$error":"#DIV/0!"},{"$error":"#DIV/0!"}]
["  & Y","Q & Y"]
["11900","Q1 1900 Average",null,null,null,{"$error":"#DIV/0!"},{"$error":"#DIV/0!"}]
[]
[null,"Site 14 Quarterly Summary"]
["Identifier #","Q & Y",null,"Date",null,"TTHM ppb","HAA5 ppb"]
[{"$f":"RIGHT(LEFT(B458,2),1)&RIGHT(LEFT(B458,7),4)","v":"  & Y"},"Q & Y"]
["11900","Q1 1900 Average",null,null,null,{"$error":"#DIV/0!"},{"$error":"#DIV/0!"}]
["  & Y","Q & Y"]
["11900","Q1 1900 Average",null,null,null,{"$error":"#DIV/0!"},{"$error":"#DIV/0!"}]
["  & Y","Q & Y"]
["11900","Q1 1900 Average",null,null,null,{"$error":"#DIV/0!"},{"$error":"#DIV/0!"}]
["  & Y","Q & Y"]
["11900","Q1 1900 Average",null,null,null,{"$error":"#DIV/0!"},{"$error":"#DIV/0!"}]
["  & Y","Q & Y"]
["11900","Q1 1900 Average",null,null,null,{"$error":"#DIV/0!"},{"$error":"#DIV/0!"}]
["  & Y","Q & Y"]
[{"$f":"RIGHT(LEFT(B469,2),1)&RIGHT(LEFT(B469,7),4)","v":"11900"},"Q1 1900 Average",null,null,null,{"$error":"#DIV/0!"},{"$error":"#DIV/0!"}]
[{"$f":"RIGHT(LEFT(B470,2),1)&RIGHT(LEFT(B470,7),4)","v":"  & Y"},"Q & Y"]
["11900","Q1 1900 Average",null,null,null,{"$error":"#DIV/0!"},{"$error":"#DIV/0!"}]
["  & Y","Q & Y"]
["11900","Q1 1900 Average",null,null,null,{"$error":"#DIV/0!"},{"$error":"#DIV/0!"}]
["  & Y","Q & Y"]
["11900","Q1 1900 Average",null,null,null,{"$error":"#DIV/0!"},{"$error":"#DIV/0!"}]
["  & Y","Q & Y"]
["11900","Q1 1900 Average",null,null,null,{"$error":"#DIV/0!"},{"$error":"#DIV/0!"}]
[""]
[null,"Site 15 Quarterly Summary"]
["Identifier #","Q & Y",null,"Date",null,"TTHM ppb","HAA5 ppb"]
[{"$f":"RIGHT(LEFT(B481,2),1)&RIGHT(LEFT(B481,7),4)","v":"  & Y"},"Q & Y"]
["11900","Q1 1900 Average",null,null,null,{"$error":"#DIV/0!"},{"$error":"#DIV/0!"}]
["  & Y","Q & Y"]
["11900","Q1 1900 Average",null,null,null,{"$error":"#DIV/0!"},{"$error":"#DIV/0!"}]
["  & Y","Q & Y"]
["11900","Q1 1900 Average",null,null,null,{"$error":"#DIV/0!"},{"$error":"#DIV/0!"}]
["  & Y","Q & Y"]
["11900","Q1 1900 Average",null,null,null,{"$error":"#DIV/0!"},{"$error":"#DIV/0!"}]
["  & Y","Q & Y"]
["11900","Q1 1900 Average",null,null,null,{"$error":"#DIV/0!"},{"$error":"#DIV/0!"}]
["  & Y","Q & Y"]
[{"$f":"RIGHT(LEFT(B492,2),1)&RIGHT(LEFT(B492,7),4)","v":"11900"},"Q1 1900 Average",null,null,null,{"$error":"#DIV/0!"},{"$error":"#DIV/0!"}]
[{"$f":"RIGHT(LEFT(B493,2),1)&RIGHT(LEFT(B493,7),4)","v":"  & Y"},"Q & Y"]
["11900","Q1 1900 Average",null,null,null,{"$error":"#DIV/0!"},{"$error":"#DIV/0!"}]
["  & Y","Q & Y"]
["11900","Q1 1900 Average",null,null,null,{"$error":"#DIV/0!"},{"$error":"#DIV/0!"}]
["  & Y","Q & Y"]
["11900","Q1 1900 Average",null,null,null,{"$error":"#DIV/0!"},{"$error":"#DIV/0!"}]
["  & Y","Q & Y"]
["11900","Q1 1900 Average",null,null,null,{"$error":"#DIV/0!"},{"$error":"#DIV/0!"}]
[""]
[null,"Site 16 Quarterly Summary"]
["Identifier #","Q & Y",null,"Date",null,"TTHM ppb","HAA5 ppb"]
[{"$f":"RIGHT(LEFT(B504,2),1)&RIGHT(LEFT(B504,7),4)","v":"  & Y"},"Q & Y"]
["11900","Q1 1900 Average",null,null,null,{"$error":"#DIV/0!"},{"$error":"#DIV/0!"}]
["  & Y","Q & Y"]
["11900","Q1 1900 Average",null,null,null,{"$error":"#DIV/0!"},{"$error":"#DIV/0!"}]
["  & Y","Q & Y"]
["11900","Q1 1900 Average",null,null,null,{"$error":"#DIV/0!"},{"$error":"#DIV/0!"}]
["  & Y","Q & Y"]
["11900","Q1 1900 Average",null,null,null,{"$error":"#DIV/0!"},{"$error":"#DIV/0!"}]
["  & Y","Q & Y"]
["11900","Q1 1900 Average",null,null,null,{"$error":"#DIV/0!"},{"$error":"#DIV/0!"}]
["  & Y","Q & Y"]
[{"$f":"RIGHT(LEFT(B515,2),1)&RIGHT(LEFT(B515,7),4)","v":"11900"},"Q1 1900 Average",null,null,null,{"$error":"#DIV/0!"},{"$error":"#DIV/0!"}]
[{"$f":"RIGHT(LEFT(B516,2),1)&RIGHT(LEFT(B516,7),4)","v":"  & Y"},"Q & Y"]
["11900","Q1 1900 Average",null,null,null,{"$error":"#DIV/0!"},{"$error":"#DIV/0!"}]
["  & Y","Q & Y"]
["11900","Q1 1900 Average",null,null,null,{"$error":"#DIV/0!"},{"$error":"#DIV/0!"}]
["  & Y","Q & Y"]
["11900","Q1 1900 Average",null,null,null,{"$error":"#DIV/0!"},{"$error":"#DIV/0!"}]
["  & Y","Q & Y"]
["11900","Q1 1900 Average",null,null,null,{"$error":"#DIV/0!"},{"$error":"#DIV/0!"}]
[]
[null,"Site 17 Quarterly Summary"]
["Identifier #","Q & Y",null,"Date",null,"TTHM ppb","HAA5 ppb"]
[{"$f":"RIGHT(LEFT(B527,2),1)&RIGHT(LEFT(B527,7),4)","v":"  & Y"},"Q & Y"]
["11900","Q1 1900 Average",null,null,null,{"$error":"#DIV/0!"},{"$error":"#DIV/0!"}]
["  & Y","Q & Y"]
["11900","Q1 1900 Average",null,null,null,{"$error":"#DIV/0!"},{"$error":"#DIV/0!"}]
["  & Y","Q & Y"]
["11900","Q1 1900 Average",null,null,null,{"$error":"#DIV/0!"},{"$error":"#DIV/0!"}]
["  & Y","Q & Y"]
["11900","Q1 1900 Average",null,null,null,{"$error":"#DIV/0!"},{"$error":"#DIV/0!"}]
["  & Y","Q & Y"]
["11900","Q1 1900 Average",null,null,null,{"$error":"#DIV/0!"},{"$error":"#DIV/0!"}]
["  & Y","Q & Y"]
[{"$f":"RIGHT(LEFT(B538,2),1)&RIGHT(LEFT(B538,7),4)","v":"11900"},"Q1 1900 Average",null,null,null,{"$error":"#DIV/0!"},{"$error":"#DIV/0!"}]
[{"$f":"RIGHT(LEFT(B539,2),1)&RIGHT(LEFT(B539,7),4)","v":"  & Y"},"Q & Y"]
["11900","Q1 1900 Average",null,null,null,{"$error":"#DIV/0!"},{"$error":"#DIV/0!"}]
["  & Y","Q & Y"]
["11900","Q1 1900 Average",null,null,null,{"$error":"#DIV/0!"},{"$error":"#DIV/0!"}]
["  & Y","Q & Y"]
["11900","Q1 1900 Average",null,null,null,{"$error":"#DIV/0!"},{"$error":"#DIV/0!"}]
["  & Y","Q & Y"]
["11900","Q1 1900 Average",null,null,null,{"$error":"#DIV/0!"},{"$error":"#DIV/0!"}]
[]
[null,"Site 18 Quarterly Summary"]
["Identifier #","Q & Y",null,"Date",null,"TTHM ppb","HAA5 ppb"]
[{"$f":"RIGHT(LEFT(B550,2),1)&RIGHT(LEFT(B550,7),4)","v":"  & Y"},"Q & Y"]
["11900","Q1 1900 Average",null,null,null,{"$error":"#DIV/0!"},{"$error":"#DIV/0!"}]
["  & Y","Q & Y"]
["11900","Q1 1900 Average",null,null,null,{"$error":"#DIV/0!"},{"$error":"#DIV/0!"}]
["  & Y","Q & Y"]
["11900","Q1 1900 Average",null,null,null,{"$error":"#DIV/0!"},{"$error":"#DIV/0!"}]
["  & Y","Q & Y"]
["11900","Q1 1900 Average",null,null,null,{"$error":"#DIV/0!"},{"$error":"#DIV/0!"}]
["  & Y","Q & Y"]
["11900","Q1 1900 Average",null,null,null,{"$error":"#DIV/0!"},{"$error":"#DIV/0!"}]
["  & Y","Q & Y"]
[{"$f":"RIGHT(LEFT(B561,2),1)&RIGHT(LEFT(B561,7),4)","v":"11900"},"Q1 1900 Average",null,null,null,{"$error":"#DIV/0!"},{"$error":"#DIV/0!"}]
[{"$f":"RIGHT(LEFT(B562,2),1)&RIGHT(LEFT(B562,7),4)","v":"  & Y"},"Q & Y"]
["11900","Q1 1900 Average",null,null,null,{"$error":"#DIV/0!"},{"$error":"#DIV/0!"}]
["  & Y","Q & Y"]
["11900","Q1 1900 Average",null,null,null,{"$error":"#DIV/0!"},{"$error":"#DIV/0!"}]
["  & Y","Q & Y"]
["11900","Q1 1900 Average",null,null,null,{"$error":"#DIV/0!"},{"$error":"#DIV/0!"}]
["  & Y","Q & Y"]
["11900","Q1 1900 Average",null,null,null,{"$error":"#DIV/0!"},{"$error":"#DIV/0!"}]
[""]
[null,"Site 19 Quarterly Summary"]
["Identifier #","Q & Y",null,"Date",null,"TTHM ppb","HAA5 ppb"]
[{"$f":"RIGHT(LEFT(B573,2),1)&RIGHT(LEFT(B573,7),4)","v":"  & Y"},"Q & Y"]
["11900","Q1 1900 Average",null,null,null,{"$error":"#DIV/0!"},{"$error":"#DIV/0!"}]
["  & Y","Q & Y"]
["11900","Q1 1900 Average",null,null,null,{"$error":"#DIV/0!"},{"$error":"#DIV/0!"}]
["  & Y","Q & Y"]
["11900","Q1 1900 Average",null,null,null,{"$error":"#DIV/0!"},{"$error":"#DIV/0!"}]
["  & Y","Q & Y"]
["11900","Q1 1900 Average",null,null,null,{"$error":"#DIV/0!"},{"$error":"#DIV/0!"}]
["  & Y","Q & Y"]
["11900","Q1 1900 Average",null,null,null,{"$error":"#DIV/0!"},{"$error":"#DIV/0!"}]
["  & Y","Q & Y"]
[{"$f":"RIGHT(LEFT(B584,2),1)&RIGHT(LEFT(B584,7),4)","v":"11900"},"Q1 1900 Average",null,null,null,{"$error":"#DIV/0!"},{"$error":"#DIV/0!"}]
[{"$f":"RIGHT(LEFT(B585,2),1)&RIGHT(LEFT(B585,7),4)","v":"  & Y"},"Q & Y"]
["11900","Q1 1900 Average",null,null,null,{"$error":"#DIV/0!"},{"$error":"#DIV/0!"}]
["  & Y","Q & Y"]
["11900","Q1 1900 Average",null,null,null,{"$error":"#DIV/0!"},{"$error":"#DIV/0!"}]
["  & Y","Q & Y"]
["11900","Q1 1900 Average",null,null,null,{"$error":"#DIV/0!"},{"$error":"#DIV/0!"}]
["  & Y","Q & Y"]
["11900","Q1 1900 Average",null,null,null,{"$error":"#DIV/0!"},{"$error":"#DIV/0!"}]
[""]
[null,"Site 20 Quarterly Summary"]
["Identifier #","Q & Y",null,"Date",null,"TTHM ppb","HAA5 ppb"]
[{"$f":"RIGHT(LEFT(B596,2),1)&RIGHT(LEFT(B596,7),4)","v":"  & Y"},"Q & Y"]
["11900","Q1 1900 Average",null,null,null,{"$error":"#DIV/0!"},{"$error":"#DIV/0!"}]
["  & Y","Q & Y"]
["11900","Q1 1900 Average",null,null,null,{"$error":"#DIV/0!"},{"$error":"#DIV/0!"}]
["  & Y","Q & Y"]
["11900","Q1 1900 Average",null,null,null,{"$error":"#DIV/0!"},{"$error":"#DIV/0!"}]
["  & Y","Q & Y"]
["11900","Q1 1900 Average",null,null,null,{"$error":"#DIV/0!"},{"$error":"#DIV/0!"}]
["  & Y","Q & Y"]
["11900","Q1 1900 Average",null,null,null,{"$error":"#DIV/0!"},{"$error":"#DIV/0!"}]
["  & Y","Q & Y"]
[{"$f":"RIGHT(LEFT(B607,2),1)&RIGHT(LEFT(B607,7),4)","v":"11900"},"Q1 1900 Average",null,null,null,{"$error":"#DIV/0!"},{"$error":"#DIV/0!"}]
[{"$f":"RIGHT(LEFT(B608,2),1)&RIGHT(LEFT(B608,7),4)","v":"  & Y"},"Q & Y"]
["11900","Q1 1900 Average",null,null,null,{"$error":"#DIV/0!"},{"$error":"#DIV/0!"}]
["  & Y","Q & Y"]
["11900","Q1 1900 Average",null,null,null,{"$error":"#DIV/0!"},{"$error":"#DIV/0!"}]
["  & Y","Q & Y"]
["11900","Q1 1900 Average",null,null,null,{"$error":"#DIV/0!"},{"$error":"#DIV/0!"}]
["  & Y","Q & Y"]
["11900","Q1 1900 Average",null,null,null,{"$error":"#DIV/0!"},{"$error":"#DIV/0!"}]
[""]
[null,"Site 21 Quarterly Summary"]
["Identifier #","Q & Y",null,"Date",null,"TTHM ppb","HAA5 ppb"]
[{"$f":"RIGHT(LEFT(B619,2),1)&RIGHT(LEFT(B619,7),4)","v":"  & Y"},"Q & Y"]
["11900","Q1 1900 Average",null,null,null,{"$error":"#DIV/0!"},{"$error":"#DIV/0!"}]
["  & Y","Q & Y"]
["11900","Q1 1900 Average",null,null,null,{"$error":"#DIV/0!"},{"$error":"#DIV/0!"}]
["  & Y","Q & Y"]
["11900","Q1 1900 Average",null,null,null,{"$error":"#DIV/0!"},{"$error":"#DIV/0!"}]
["  & Y","Q & Y"]
["11900","Q1 1900 Average",null,null,null,{"$error":"#DIV/0!"},{"$error":"#DIV/0!"}]
["  & Y","Q & Y"]
["11900","Q1 1900 Average",null,null,null,{"$error":"#DIV/0!"},{"$error":"#DIV/0!"}]
["  & Y","Q & Y"]
[{"$f":"RIGHT(LEFT(B630,2),1)&RIGHT(LEFT(B630,7),4)","v":"11900"},"Q1 1900 Average",null,null,null,{"$error":"#DIV/0!"},{"$error":"#DIV/0!"}]
[{"$f":"RIGHT(LEFT(B631,2),1)&RIGHT(LEFT(B631,7),4)","v":"  & Y"},"Q & Y"]
["11900","Q1 1900 Average",null,null,null,{"$error":"#DIV/0!"},{"$error":"#DIV/0!"}]
["  & Y","Q & Y"]
["11900","Q1 1900 Average",null,null,null,{"$error":"#DIV/0!"},{"$error":"#DIV/0!"}]
["  & Y","Q & Y"]
["11900","Q1 1900 Average",null,null,null,{"$error":"#DIV/0!"},{"$error":"#DIV/0!"}]
["  & Y","Q & Y"]
["11900","Q1 1900 Average",null,null,null,{"$error":"#DIV/0!"},{"$error":"#DIV/0!"}]
[""]
[null,"Site 22 Quarterly Summary"]
["Identifier #","Q & Y",null,"Date",null,"TTHM ppb","HAA5 ppb"]
[{"$f":"RIGHT(LEFT(B642,2),1)&RIGHT(LEFT(B642,7),4)","v":"  & Y"},"Q & Y"]
["11900","Q1 1900 Average",null,null,null,{"$error":"#DIV/0!"},{"$error":"#DIV/0!"}]
["  & Y","Q & Y"]
["11900","Q1 1900 Average",null,null,null,{"$error":"#DIV/0!"},{"$error":"#DIV/0!"}]
["  & Y","Q & Y"]
["11900","Q1 1900 Average",null,null,null,{"$error":"#DIV/0!"},{"$error":"#DIV/0!"}]
["  & Y","Q & Y"]
["11900","Q1 1900 Average",null,null,null,{"$error":"#DIV/0!"},{"$error":"#DIV/0!"}]
["  & Y","Q & Y"]
["11900","Q1 1900 Average",null,null,null,{"$error":"#DIV/0!"},{"$error":"#DIV/0!"}]
["  & Y","Q & Y"]
[{"$f":"RIGHT(LEFT(B653,2),1)&RIGHT(LEFT(B653,7),4)","v":"11900"},"Q1 1900 Average",null,null,null,{"$error":"#DIV/0!"},{"$error":"#DIV/0!"}]
[{"$f":"RIGHT(LEFT(B654,2),1)&RIGHT(LEFT(B654,7),4)","v":"  & Y"},"Q & Y"]
["11900","Q1 1900 Average",null,null,null,{"$error":"#DIV/0!"},{"$error":"#DIV/0!"}]
["  & Y","Q & Y"]
["11900","Q1 1900 Average",null,null,null,{"$error":"#DIV/0!"},{"$error":"#DIV/0!"}]
["  & Y","Q & Y"]
["11900","Q1 1900 Average",null,null,null,{"$error":"#DIV/0!"},{"$error":"#DIV/0!"}]
["  & Y","Q & Y"]
["11900","Q1 1900 Average",null,null,null,{"$error":"#DIV/0!"},{"$error":"#DIV/0!"}]
[""]
[null,"Site 23 Quarterly Summary"]
["Identifier #","Q & Y",null,"Date",null,"TTHM ppb","HAA5 ppb"]
[{"$f":"RIGHT(LEFT(B665,2),1)&RIGHT(LEFT(B665,7),4)","v":"  & Y"},"Q & Y"]
["11900","Q1 1900 Average",null,null,null,{"$error":"#DIV/0!"},{"$error":"#DIV/0!"}]
["  & Y","Q & Y"]
["11900","Q1 1900 Average",null,null,null,{"$error":"#DIV/0!"},{"$error":"#DIV/0!"}]
["  & Y","Q & Y"]
["11900","Q1 1900 Average",null,null,null,{"$error":"#DIV/0!"},{"$error":"#DIV/0!"}]
["  & Y","Q & Y"]
["11900","Q1 1900 Average",null,null,null,{"$error":"#DIV/0!"},{"$error":"#DIV/0!"}]
["  & Y","Q & Y"]
["11900","Q1 1900 Average",null,null,null,{"$error":"#DIV/0!"},{"$error":"#DIV/0!"}]
["  & Y","Q & Y"]
[{"$f":"RIGHT(LEFT(B676,2),1)&RIGHT(LEFT(B676,7),4)","v":"11900"},"Q1 1900 Average",null,null,null,{"$error":"#DIV/0!"},{"$error":"#DIV/0!"}]
[{"$f":"RIGHT(LEFT(B677,2),1)&RIGHT(LEFT(B677,7),4)","v":"  & Y"},"Q & Y"]
["11900","Q1 1900 Average",null,null,null,{"$error":"#DIV/0!"},{"$error":"#DIV/0!"}]
["  & Y","Q & Y"]
["11900","Q1 1900 Average",null,null,null,{"$error":"#DIV/0!"},{"$error":"#DIV/0!"}]
["  & Y","Q & Y"]
["11900","Q1 1900 Average",null,null,null,{"$error":"#DIV/0!"},{"$error":"#DIV/0!"}]
["  & Y","Q & Y"]
["11900","Q1 1900 Average",null,null,null,{"$error":"#DIV/0!"},{"$error":"#DIV/0!"}]
[""]
[null,"Site 24 Quarterly Summary"]
["Identifier #","Q & Y",null,"Date",null,"TTHM ppb","HAA5 ppb"]
[{"$f":"RIGHT(LEFT(B688,2),1)&RIGHT(LEFT(B688,7),4)","v":"  & Y"},"Q & Y"]
["11900","Q1 1900 Average",null,null,null,{"$error":"#DIV/0!"},{"$error":"#DIV/0!"}]
["  & Y","Q & Y"]
["11900","Q1 1900 Average",null,null,null,{"$error":"#DIV/0!"},{"$error":"#DIV/0!"}]
["  & Y","Q & Y"]
["11900","Q1 1900 Average",null,null,null,{"$error":"#DIV/0!"},{"$error":"#DIV/0!"}]
["  & Y","Q & Y"]
["11900","Q1 1900 Average",null,null,null,{"$error":"#DIV/0!"},{"$error":"#DIV/0!"}]
["  & Y","Q & Y"]
["11900","Q1 1900 Average",null,null,null,{"$error":"#DIV/0!"},{"$error":"#DIV/0!"}]
["  & Y","Q & Y"]
[{"$f":"RIGHT(LEFT(B699,2),1)&RIGHT(LEFT(B699,7),4)","v":"11900"},"Q1 1900 Average",null,null,null,{"$error":"#DIV/0!"},{"$error":"#DIV/0!"}]
[{"$f":"RIGHT(LEFT(B700,2),1)&RIGHT(LEFT(B700,7),4)","v":"  & Y"},"Q & Y"]
["11900","Q1 1900 Average",null,null,null,{"$error":"#DIV/0!"},{"$error":"#DIV/0!"}]
["  & Y","Q & Y"]
["11900","Q1 1900 Average",null,null,null,{"$error":"#DIV/0!"},{"$error":"#DIV/0!"}]
["  & Y","Q & Y"]
["11900","Q1 1900 Average",null,null,null,{"$error":"#DIV/0!"},{"$error":"#DIV/0!"}]
["  & Y","Q & Y"]
["11900","Q1 1900 Average",null,null,null,{"$error":"#DIV/0!"},{"$error":"#DIV/0!"}]
[""]
[null,"Site 25 Quarterly Summary"]
["Identifier #","Q & Y",null,"Date",null,"TTHM ppb","HAA5 ppb"]
[{"$f":"RIGHT(LEFT(B711,2),1)&RIGHT(LEFT(B711,7),4)","v":"  & Y"},"Q & Y"]
["11900","Q1 1900 Average",null,null,null,{"$error":"#DIV/0!"},{"$error":"#DIV/0!"}]
["  & Y","Q & Y"]
["11900","Q1 1900 Average",null,null,null,{"$error":"#DIV/0!"},{"$error":"#DIV/0!"}]
["  & Y","Q & Y"]
["11900","Q1 1900 Average",null,null,null,{"$error":"#DIV/0!"},{"$error":"#DIV/0!"}]
["  & Y","Q & Y"]
["11900","Q1 1900 Average",null,null,null,{"$error":"#DIV/0!"},{"$error":"#DIV/0!"}]
["  & Y","Q & Y"]
["11900","Q1 1900 Average",null,null,null,{"$error":"#DIV/0!"},{"$error":"#DIV/0!"}]
["  & Y","Q & Y"]
[{"$f":"RIGHT(LEFT(B722,2),1)&RIGHT(LEFT(B722,7),4)","v":"11900"},"Q1 1900 Average",null,null,null,{"$error":"#DIV/0!"},{"$error":"#DIV/0!"}]
[{"$f":"RIGHT(LEFT(B723,2),1)&RIGHT(LEFT(B723,7),4)","v":"  & Y"},"Q & Y"]
["11900","Q1 1900 Average",null,null,null,{"$error":"#DIV/0!"},{"$error":"#DIV/0!"}]
["  & Y","Q & Y"]
["11900","Q1 1900 Average",null,null,null,{"$error":"#DIV/0!"},{"$error":"#DIV/0!"}]
["  & Y","Q & Y"]
["11900","Q1 1900 Average",null,null,null,{"$error":"#DIV/0!"},{"$error":"#DIV/0!"}]
["  & Y","Q & Y"]
["11900","Q1 1900 Average",null,null,null,{"$error":"#DIV/0!"},{"$error":"#DIV/0!"}]
[""]
[null,"Site 26 Quarterly Summary"]
["Identifier #","Q & Y",null,"Date",null,"TTHM ppb","HAA5 ppb"]
[{"$f":"RIGHT(LEFT(B734,2),1)&RIGHT(LEFT(B734,7),4)","v":"  & Y"},"Q & Y"]
["11900","Q1 1900 Average",null,null,null,{"$error":"#DIV/0!"},{"$error":"#DIV/0!"}]
["  & Y","Q & Y"]
["11900","Q1 1900 Average",null,null,null,{"$error":"#DIV/0!"},{"$error":"#DIV/0!"}]
["  & Y","Q & Y"]
["11900","Q1 1900 Average",null,null,null,{"$error":"#DIV/0!"},{"$error":"#DIV/0!"}]
["  & Y","Q & Y"]
["11900","Q1 1900 Average",null,null,null,{"$error":"#DIV/0!"},{"$error":"#DIV/0!"}]
["  & Y","Q & Y"]
["11900","Q1 1900 Average",null,null,null,{"$error":"#DIV/0!"},{"$error":"#DIV/0!"}]
["  & Y","Q & Y"]
[{"$f":"RIGHT(LEFT(B745,2),1)&RIGHT(LEFT(B745,7),4)","v":"11900"},"Q1 1900 Average",null,null,null,{"$error":"#DIV/0!"},{"$error":"#DIV/0!"}]
[{"$f":"RIGHT(LEFT(B746,2),1)&RIGHT(LEFT(B746,7),4)","v":"  & Y"},"Q & Y"]
["11900","Q1 1900 Average",null,null,null,{"$error":"#DIV/0!"},{"$error":"#DIV/0!"}]
["  & Y","Q & Y"]
["11900","Q1 1900 Average",null,null,null,{"$error":"#DIV/0!"},{"$error":"#DIV/0!"}]
["  & Y","Q & Y"]
["11900","Q1 1900 Average",null,null,null,{"$error":"#DIV/0!"},{"$error":"#DIV/0!"}]
["  & Y","Q & Y"]
["11900","Q1 1900 Average",null,null,null,{"$error":"#DIV/0!"},{"$error":"#DIV/0!"}]
[""]
[null,"Site 27 Quarterly Summary"]
["Identifier #","Q & Y",null,"Date",null,"TTHM ppb","HAA5 ppb"]
[{"$f":"RIGHT(LEFT(B757,2),1)&RIGHT(LEFT(B757,7),4)","v":"  & Y"},"Q & Y"]
["11900","Q1 1900 Average",null,null,null,{"$error":"#DIV/0!"},{"$error":"#DIV/0!"}]
["  & Y","Q & Y"]
["11900","Q1 1900 Average",null,null,null,{"$error":"#DIV/0!"},{"$error":"#DIV/0!"}]
["  & Y","Q & Y"]
["11900","Q1 1900 Average",null,null,null,{"$error":"#DIV/0!"},{"$error":"#DIV/0!"}]
["  & Y","Q & Y"]
["11900","Q1 1900 Average",null,null,null,{"$error":"#DIV/0!"},{"$error":"#DIV/0!"}]
["  & Y","Q & Y"]
["11900","Q1 1900 Average",null,null,null,{"$error":"#DIV/0!"},{"$error":"#DIV/0!"}]
["  & Y","Q & Y"]
[{"$f":"RIGHT(LEFT(B768,2),1)&RIGHT(LEFT(B768,7),4)","v":"11900"},"Q1 1900 Average",null,null,null,{"$error":"#DIV/0!"},{"$error":"#DIV/0!"}]
[{"$f":"RIGHT(LEFT(B769,2),1)&RIGHT(LEFT(B769,7),4)","v":"  & Y"},"Q & Y"]
["11900","Q1 1900 Average",null,null,null,{"$error":"#DIV/0!"},{"$error":"#DIV/0!"}]
["  & Y","Q & Y"]
["11900","Q1 1900 Average",null,null,null,{"$error":"#DIV/0!"},{"$error":"#DIV/0!"}]
["  & Y","Q & Y"]
["11900","Q1 1900 Average",null,null,null,{"$error":"#DIV/0!"},{"$error":"#DIV/0!"}]
["  & Y","Q & Y"]
["11900","Q1 1900 Average",null,null,null,{"$error":"#DIV/0!"},{"$error":"#DIV/0!"}]
[""]
[null,"Site 28 Quarterly Summary"]
["Identifier #","Q & Y",null,"Date",null,"TTHM ppb","HAA5 ppb"]
[{"$f":"RIGHT(LEFT(B780,2),1)&RIGHT(LEFT(B780,7),4)","v":"  & Y"},"Q & Y"]
["11900","Q1 1900 Average",null,null,null,{"$error":"#DIV/0!"},{"$error":"#DIV/0!"}]
["  & Y","Q & Y"]
["11900","Q1 1900 Average",null,null,null,{"$error":"#DIV/0!"},{"$error":"#DIV/0!"}]
["  & Y","Q & Y"]
["11900","Q1 1900 Average",null,null,null,{"$error":"#DIV/0!"},{"$error":"#DIV/0!"}]
["  & Y","Q & Y"]
["11900","Q1 1900 Average",null,null,null,{"$error":"#DIV/0!"},{"$error":"#DIV/0!"}]
["  & Y","Q & Y"]
["11900","Q1 1900 Average",null,null,null,{"$error":"#DIV/0!"},{"$error":"#DIV/0!"}]
["  & Y","Q & Y"]
[{"$f":"RIGHT(LEFT(B791,2),1)&RIGHT(LEFT(B791,7),4)","v":"11900"},"Q1 1900 Average",null,null,null,{"$error":"#DIV/0!"},{"$error":"#DIV/0!"}]
[{"$f":"RIGHT(LEFT(B792,2),1)&RIGHT(LEFT(B792,7),4)","v":"  & Y"},"Q & Y"]
["11900","Q1 1900 Average",null,null,null,{"$error":"#DIV/0!"},{"$error":"#DIV/0!"}]
["  & Y","Q & Y"]
["11900","Q1 1900 Average",null,null,null,{"$error":"#DIV/0!"},{"$error":"#DIV/0!"}]
["  & Y","Q & Y"]
["11900","Q1 1900 Average",null,null,null,{"$error":"#DIV/0!"},{"$error":"#DIV/0!"}]
["  & Y","Q & Y"]
["11900","Q1 1900 Average",null,null,null,{"$error":"#DIV/0!"},{"$error":"#DIV/0!"}]
[""]
[null,"Site 29 Quarterly Summary"]
["Identifier #","Q & Y",null,"Date",null,"TTHM ppb","HAA5 ppb"]
[{"$f":"RIGHT(LEFT(B803,2),1)&RIGHT(LEFT(B803,7),4)","v":"  & Y"},"Q & Y"]
["11900","Q1 1900 Average",null,null,null,{"$error":"#DIV/0!"},{"$error":"#DIV/0!"}]
["  & Y","Q & Y"]
["11900","Q1 1900 Average",null,null,null,{"$error":"#DIV/0!"},{"$error":"#DIV/0!"}]
["  & Y","Q & Y"]
["11900","Q1 1900 Average",null,null,null,{"$error":"#DIV/0!"},{"$error":"#DIV/0!"}]
["  & Y","Q & Y"]
["11900","Q1 1900 Average",null,null,null,{"$error":"#DIV/0!"},{"$error":"#DIV/0!"}]
["  & Y","Q & Y"]
["11900","Q1 1900 Average",null,null,null,{"$error":"#DIV/0!"},{"$error":"#DIV/0!"}]
["  & Y","Q & Y"]
[{"$f":"RIGHT(LEFT(B814,2),1)&RIGHT(LEFT(B814,7),4)","v":"11900"},"Q1 1900 Average",null,null,null,{"$error":"#DIV/0!"},{"$error":"#DIV/0!"}]
[{"$f":"RIGHT(LEFT(B815,2),1)&RIGHT(LEFT(B815,7),4)","v":"  & Y"},"Q & Y"]
["11900","Q1 1900 Average",null,null,null,{"$error":"#DIV/0!"},{"$error":"#DIV/0!"}]
["  & Y","Q & Y"]
["11900","Q1 1900 Average",null,null,null,{"$error":"#DIV/0!"},{"$error":"#DIV/0!"}]
["  & Y","Q & Y"]
["11900","Q1 1900 Average",null,null,null,{"$error":"#DIV/0!"},{"$error":"#DIV/0!"}]
["  & Y","Q & Y"]
["11900","Q1 1900 Average",null,null,null,{"$error":"#DIV/0!"},{"$error":"#DIV/0!"}]
[""]
[null,"Site 30 Quarterly Summary"]
["Identifier #","Q & Y",null,"Date",null,"TTHM ppb","HAA5 ppb"]
[{"$f":"RIGHT(LEFT(B826,2),1)&RIGHT(LEFT(B826,7),4)","v":"  & Y"},"Q & Y"]
["11900","Q1 1900 Average",null,null,null,{"$error":"#DIV/0!"},{"$error":"#DIV/0!"}]
["  & Y","Q & Y"]
["11900","Q1 1900 Average",null,null,null,{"$error":"#DIV/0!"},{"$error":"#DIV/0!"}]
["  & Y","Q & Y"]
["11900","Q1 1900 Average",null,null,null,{"$error":"#DIV/0!"},{"$error":"#DIV/0!"}]
["  & Y","Q & Y"]
["11900","Q1 1900 Average",null,null,null,{"$error":"#DIV/0!"},{"$error":"#DIV/0!"}]
["  & Y","Q & Y"]
["11900","Q1 1900 Average",null,null,null,{"$error":"#DIV/0!"},{"$error":"#DIV/0!"}]
["  & Y","Q & Y"]
[{"$f":"RIGHT(LEFT(B837,2),1)&RIGHT(LEFT(B837,7),4)","v":"11900"},"Q1 1900 Average",null,null,null,{"$error":"#DIV/0!"},{"$error":"#DIV/0!"}]
[{"$f":"RIGHT(LEFT(B838,2),1)&RIGHT(LEFT(B838,7),4)","v":"  & Y"},"Q & Y"]
["11900","Q1 1900 Average",null,null,null,{"$error":"#DIV/0!"},{"$error":"#DIV/0!"}]
["  & Y","Q & Y"]
["11900","Q1 1900 Average",null,null,null,{"$error":"#DIV/0!"},{"$error":"#DIV/0!"}]
["  & Y","Q & Y"]
["11900","Q1 1900 Average",null,null,null,{"$error":"#DIV/0!"},{"$error":"#DIV/0!"}]
["  & Y","Q & Y"]
["11900","Q1 1900 Average",null,null,null,{"$error":"#DIV/0!"},{"$error":"#DIV/0!"}]

{"sheet":"HAA5 GOAL CALC","index":41,"n_rows":117,"n_cols":18,"rows_kept":117,"cut":false,"hidden":true,"merged":[]}
[]
[null,"HAA5 Goals Calculation"]
[null,"The data in the table below are calculated based on inputs from the individual sample site input worksheets. Click on the blue update buttom to update the table."]
[null,"If desired, the goals can be modified on a system-specific basis.  Defaults are 50 ppb for the Individual Site Goal and 40 ppb for the Long-Term System Goal."]
[null,null,null,"Individual Site Goal:",50]
[null,null,null,"Long-Term System Goal:",40]
[null,null,null,"HAA5 Compliance Avg. LRAA:",{"$f":"AVERAGE(R49:R78)","v":{"$error":"#DIV/0!"}}]
[null,null,null,"HAA5 Compliance Max. LRAA:",{"$f":"MAX(R49:R78)","v":0}]
[]
[null,"RED",null,"highlighted LRAA exceeds HAA5 compliance value (60 ppb) for that quarter"]
[null,"Blue",null,"highlighted LRAA exceeds the Individual Site Goal for that quarter; unless the LRAA exceeds the compliance value (see above)"]
[null,"Green",null,"highlighted data exceeds the HAA5 Long-Term System Goal identified above"]
[]
[]
[null,"System Name:",{"$f":"Main!C5","v":0}]
[null,null,null,{"$f":"IF(E16=4,3,IF(E16=3,2,IF(E16=2,1,IF(E16=1,4))))","v":3},4,1,2,3,4,1,2,3,4,{"$f":"'TTHM GOAL CALC'!D153","v":1}]
[null,null,null,{"$f":"IF(E16=4,E17,IF(E16=3,E17,IF(E16=2,E17,IF(E16=1,E17-1))))","v":1897},1897,1898,1898,1898,1898,1899,1899,1899,1899,{"$f":"'TTHM GOAL CALC'!E153","v":1900}]
[null,"Sample Location","Compliance Site",{"$f":"\"Q\"&D16&\" \"&D17","v":"Q3 1897"},{"$f":"\"Q\"&E16&\" \"&E17","v":"Q4 1897"},"Q1 1898","Q2 1898","Q3 1898","Q4 1898","Q1 1899","Q2 1899","Q3 1899","Q4 1899",{"$f":"\"Q\"&N16&\" \"&N17","v":"Q1 1900"}]
[null,{"$f":"'Site 1'!J5","v":"Entry Point"},{"$f":"IF(ISBLANK('Site 1'!$T$5),\"\",'Site 1'!$T$5)","v":""},{"$f":"IF(ISERROR(IF(SUM(S1Table)=0,\"\",VLOOKUP(D$16&D$17,'TTHM GOAL CALC'!$A$159:$G$178,7,FALSE))),\"\",(IF(SUM(S1Table)=0,\"\",VLOOKUP(D$16&D$17,'TTHM GOAL CALC'!$A$159:$G$178,7,FALSE))))","v":""},{"$f":"IF(ISERROR(IF(SUM(S1Table)=0,\"\",VLOOKUP(E$16&E$17,'TTHM GOAL CALC'!$A$159:$G$178,7,FALSE))),\"\",(IF(SUM(S1Table)=0,\"\",VLOOKUP(E$16&E$17,'TTHM GOAL CALC'!$A$159:$G$178,7,FALSE))))","v":""},{"$f":"IF(ISERROR(IF(SUM(S1Table)=0,\"\",VLOOKUP(F$16&F$17,'TTHM GOAL CALC'!$A$159:$G$178,7,FALSE))),\"\",(IF(SUM(S1Table)=0,\"\",VLOOKUP(F$16&F$17,'TTHM GOAL CALC'!$A$159:$G$178,7,FALSE))))","v":""},{"$f":"IF(ISERROR(IF(SUM(S1Table)=0,\"\",VLOOKUP(G$16&G$17,'TTHM GOAL CALC'!$A$159:$G$178,7,FALSE))),\"\",(IF(SUM(S1Table)=0,\"\",VLOOKUP(G$16&G$17,'TTHM GOAL CALC'!$A$159:$G$178,7,FALSE))))","v":""},{"$f":"IF(ISERROR(IF(SUM(S1Table)=0,\"\",VLOOKUP(H$16&H$17,'TTHM GOAL CALC'!$A$159:$G$178,7,FALSE))),\"\",(IF(SUM(S1Table)=0,\"\",VLOOKUP(H$16&H$17,'TTHM GOAL CALC'!$A$159:$G$178,7,FALSE))))","v":""},{"$f":"IF(ISERROR(IF(SUM(S1Table)=0,\"\",VLOOKUP(I$16&I$17,'TTHM GOAL CALC'!$A$159:$G$178,7,FALSE))),\"\",(IF(SUM(S1Table)=0,\"\",VLOOKUP(I$16&I$17,'TTHM GOAL CALC'!$A$159:$G$178,7,FALSE))))","v":""},{"$f":"IF(ISERROR(IF(SUM(S1Table)=0,\"\",VLOOKUP(J$16&J$17,'TTHM GOAL CALC'!$A$159:$G$178,7,FALSE))),\"\",(IF(SUM(S1Table)=0,\"\",VLOOKUP(J$16&J$17,'TTHM GOAL CALC'!$A$159:$G$178,7,FALSE))))","v":""},{"$f":"IF(ISERROR(IF(SUM(S1Table)=0,\"\",VLOOKUP(K$16&K$17,'TTHM GOAL CALC'!$A$159:$G$178,7,FALSE))),\"\",(IF(SUM(S1Table)=0,\"\",VLOOKUP(K$16&K$17,'TTHM GOAL CALC'!$A$159:$G$178,7,FALSE))))","v":""},{"$f":"IF(ISERROR(IF(SUM(S1Table)=0,\"\",VLOOKUP(L$16&L$17,'TTHM GOAL CALC'!$A$159:$G$178,7,FALSE))),\"\",(IF(SUM(S1Table)=0,\"\",VLOOKUP(L$16&L$17,'TTHM GOAL CALC'!$A$159:$G$178,7,FALSE))))","v":""},{"$f":"IF(ISERROR(IF(SUM(S1Table)=0,\"\",VLOOKUP(M$16&M$17,'TTHM GOAL CALC'!$A$159:$G$178,7,FALSE))),\"\",(IF(SUM(S1Table)=0,\"\",VLOOKUP(M$16&M$17,'TTHM GOAL CALC'!$A$159:$G$178,7,FALSE))))","v":""},{"$f":"IF(ISERROR(IF(SUM(S1Table)=0,\"\",VLOOKUP(N$16&N$17,'TTHM GOAL CALC'!$A$159:$G$178,7,FALSE))),\"\",(IF(SUM(S1Table)=0,\"\",VLOOKUP(N$16&N$17,'TTHM GOAL CALC'!$A$159:$G$178,7,FALSE))))","v":""}]
[null,{"$f":"'Site 2'!J5","v":"Site 2"},{"$f":"IF(ISBLANK('Site 2'!$T$5),\"\",'Site 2'!$T$5)","v":""},{"$f":"IF(ISERROR(IF(SUM(S2Table)=0,\"\",VLOOKUP(D$16&D$17,'TTHM GOAL CALC'!$A$182:$G$201,7,FALSE))),\"\",IF(SUM(S2Table)=0,\"\",VLOOKUP(D$16&D$17,'TTHM GOAL CALC'!$A$182:$G$201,7,FALSE)))","v":""},{"$f":"IF(ISERROR(IF(SUM(S2Table)=0,\"\",VLOOKUP(E$16&E$17,'TTHM GOAL CALC'!$A$182:$G$201,7,FALSE))),\"\",IF(SUM(S2Table)=0,\"\",VLOOKUP(E$16&E$17,'TTHM GOAL CALC'!$A$182:$G$201,7,FALSE)))","v":""},{"$f":"IF(ISERROR(IF(SUM(S2Table)=0,\"\",VLOOKUP(F$16&F$17,'TTHM GOAL CALC'!$A$182:$G$201,7,FALSE))),\"\",IF(SUM(S2Table)=0,\"\",VLOOKUP(F$16&F$17,'TTHM GOAL CALC'!$A$182:$G$201,7,FALSE)))","v":""},{"$f":"IF(ISERROR(IF(SUM(S2Table)=0,\"\",VLOOKUP(G$16&G$17,'TTHM GOAL CALC'!$A$182:$G$201,7,FALSE))),\"\",IF(SUM(S2Table)=0,\"\",VLOOKUP(G$16&G$17,'TTHM GOAL CALC'!$A$182:$G$201,7,FALSE)))","v":""},{"$f":"IF(ISERROR(IF(SUM(S2Table)=0,\"\",VLOOKUP(H$16&H$17,'TTHM GOAL CALC'!$A$182:$G$201,7,FALSE))),\"\",IF(SUM(S2Table)=0,\"\",VLOOKUP(H$16&H$17,'TTHM GOAL CALC'!$A$182:$G$201,7,FALSE)))","v":""},{"$f":"IF(ISERROR(IF(SUM(S2Table)=0,\"\",VLOOKUP(I$16&I$17,'TTHM GOAL CALC'!$A$182:$G$201,7,FALSE))),\"\",IF(SUM(S2Table)=0,\"\",VLOOKUP(I$16&I$17,'TTHM GOAL CALC'!$A$182:$G$201,7,FALSE)))","v":""},{"$f":"IF(ISERROR(IF(SUM(S2Table)=0,\"\",VLOOKUP(J$16&J$17,'TTHM GOAL CALC'!$A$182:$G$201,7,FALSE))),\"\",IF(SUM(S2Table)=0,\"\",VLOOKUP(J$16&J$17,'TTHM GOAL CALC'!$A$182:$G$201,7,FALSE)))","v":""},{"$f":"IF(ISERROR(IF(SUM(S2Table)=0,\"\",VLOOKUP(K$16&K$17,'TTHM GOAL CALC'!$A$182:$G$201,7,FALSE))),\"\",IF(SUM(S2Table)=0,\"\",VLOOKUP(K$16&K$17,'TTHM GOAL CALC'!$A$182:$G$201,7,FALSE)))","v":""},{"$f":"IF(ISERROR(IF(SUM(S2Table)=0,\"\",VLOOKUP(L$16&L$17,'TTHM GOAL CALC'!$A$182:$G$201,7,FALSE))),\"\",IF(SUM(S2Table)=0,\"\",VLOOKUP(L$16&L$17,'TTHM GOAL CALC'!$A$182:$G$201,7,FALSE)))","v":""},{"$f":"IF(ISERROR(IF(SUM(S2Table)=0,\"\",VLOOKUP(M$16&M$17,'TTHM GOAL CALC'!$A$182:$G$201,7,FALSE))),\"\",IF(SUM(S2Table)=0,\"\",VLOOKUP(M$16&M$17,'TTHM GOAL CALC'!$A$182:$G$201,7,FALSE)))","v":""},{"$f":"IF(ISERROR(IF(SUM(S2Table)=0,\"\",VLOOKUP(N$16&N$17,'TTHM GOAL CALC'!$A$182:$G$201,7,FALSE))),\"\",IF(SUM(S2Table)=0,\"\",VLOOKUP(N$16&N$17,'TTHM GOAL CALC'!$A$182:$G$201,7,FALSE)))","v":""}]
[null,{"$f":"'Site 3'!J5","v":"Site 3"},{"$f":"IF(ISBLANK('Site 3'!$T$5),\"\",'Site 3'!$T$5)","v":""},{"$f":"IF(ISERROR(IF(SUM(S3Table)=0,\"\",VLOOKUP(D$16&D$17,'TTHM GOAL CALC'!$A$205:$G$224,7,FALSE))),\"\",IF(SUM(S3Table)=0,\"\",VLOOKUP(D$16&D$17,'TTHM GOAL CALC'!$A$205:$G$224,7,FALSE)))","v":""},{"$f":"IF(ISERROR(IF(SUM(S3Table)=0,\"\",VLOOKUP(E$16&E$17,'TTHM GOAL CALC'!$A$205:$G$224,7,FALSE))),\"\",IF(SUM(S3Table)=0,\"\",VLOOKUP(E$16&E$17,'TTHM GOAL CALC'!$A$205:$G$224,7,FALSE)))","v":""},{"$f":"IF(ISERROR(IF(SUM(S3Table)=0,\"\",VLOOKUP(F$16&F$17,'TTHM GOAL CALC'!$A$205:$G$224,7,FALSE))),\"\",IF(SUM(S3Table)=0,\"\",VLOOKUP(F$16&F$17,'TTHM GOAL CALC'!$A$205:$G$224,7,FALSE)))","v":""},{"$f":"IF(ISERROR(IF(SUM(S3Table)=0,\"\",VLOOKUP(G$16&G$17,'TTHM GOAL CALC'!$A$205:$G$224,7,FALSE))),\"\",IF(SUM(S3Table)=0,\"\",VLOOKUP(G$16&G$17,'TTHM GOAL CALC'!$A$205:$G$224,7,FALSE)))","v":""},{"$f":"IF(ISERROR(IF(SUM(S3Table)=0,\"\",VLOOKUP(H$16&H$17,'TTHM GOAL CALC'!$A$205:$G$224,7,FALSE))),\"\",IF(SUM(S3Table)=0,\"\",VLOOKUP(H$16&H$17,'TTHM GOAL CALC'!$A$205:$G$224,7,FALSE)))","v":""},{"$f":"IF(ISERROR(IF(SUM(S3Table)=0,\"\",VLOOKUP(I$16&I$17,'TTHM GOAL CALC'!$A$205:$G$224,7,FALSE))),\"\",IF(SUM(S3Table)=0,\"\",VLOOKUP(I$16&I$17,'TTHM GOAL CALC'!$A$205:$G$224,7,FALSE)))","v":""},{"$f":"IF(ISERROR(IF(SUM(S3Table)=0,\"\",VLOOKUP(J$16&J$17,'TTHM GOAL CALC'!$A$205:$G$224,7,FALSE))),\"\",IF(SUM(S3Table)=0,\"\",VLOOKUP(J$16&J$17,'TTHM GOAL CALC'!$A$205:$G$224,7,FALSE)))","v":""},{"$f":"IF(ISERROR(IF(SUM(S3Table)=0,\"\",VLOOKUP(K$16&K$17,'TTHM GOAL CALC'!$A$205:$G$224,7,FALSE))),\"\",IF(SUM(S3Table)=0,\"\",VLOOKUP(K$16&K$17,'TTHM GOAL CALC'!$A$205:$G$224,7,FALSE)))","v":""},{"$f":"IF(ISERROR(IF(SUM(S3Table)=0,\"\",VLOOKUP(L$16&L$17,'TTHM GOAL CALC'!$A$205:$G$224,7,FALSE))),\"\",IF(SUM(S3Table)=0,\"\",VLOOKUP(L$16&L$17,'TTHM GOAL CALC'!$A$205:$G$224,7,FALSE)))","v":""},{"$f":"IF(ISERROR(IF(SUM(S3Table)=0,\"\",VLOOKUP(M$16&M$17,'TTHM GOAL CALC'!$A$205:$G$224,7,FALSE))),\"\",IF(SUM(S3Table)=0,\"\",VLOOKUP(M$16&M$17,'TTHM GOAL CALC'!$A$205:$G$224,7,FALSE)))","v":""},{"$f":"IF(ISERROR(IF(SUM(S3Table)=0,\"\",VLOOKUP(N$16&N$17,'TTHM GOAL CALC'!$A$205:$G$224,7,FALSE))),\"\",IF(SUM(S3Table)=0,\"\",VLOOKUP(N$16&N$17,'TTHM GOAL CALC'!$A$205:$G$224,7,FALSE)))","v":""}]
[null,{"$f":"'Site 4'!J5","v":"Site 4"},{"$f":"IF(ISBLANK('Site 4'!$T$5),\"\",'Site 4'!$T$5)","v":""},{"$f":"IF(ISERROR(IF(SUM(S4Table)=0,\"\",VLOOKUP(D$16&D$17,'TTHM GOAL CALC'!$A$228:$G$247,7,FALSE))),\"\",IF(SUM(S4Table)=0,\"\",VLOOKUP(D$16&D$17,'TTHM GOAL CALC'!$A$228:$G$247,7,FALSE)))","v":""},{"$f":"IF(ISERROR(IF(SUM(S4Table)=0,\"\",VLOOKUP(E$16&E$17,'TTHM GOAL CALC'!$A$228:$G$247,7,FALSE))),\"\",IF(SUM(S4Table)=0,\"\",VLOOKUP(E$16&E$17,'TTHM GOAL CALC'!$A$228:$G$247,7,FALSE)))","v":""},{"$f":"IF(ISERROR(IF(SUM(S4Table)=0,\"\",VLOOKUP(F$16&F$17,'TTHM GOAL CALC'!$A$228:$G$247,7,FALSE))),\"\",IF(SUM(S4Table)=0,\"\",VLOOKUP(F$16&F$17,'TTHM GOAL CALC'!$A$228:$G$247,7,FALSE)))","v":""},{"$f":"IF(ISERROR(IF(SUM(S4Table)=0,\"\",VLOOKUP(G$16&G$17,'TTHM GOAL CALC'!$A$228:$G$247,7,FALSE))),\"\",IF(SUM(S4Table)=0,\"\",VLOOKUP(G$16&G$17,'TTHM GOAL CALC'!$A$228:$G$247,7,FALSE)))","v":""},{"$f":"IF(ISERROR(IF(SUM(S4Table)=0,\"\",VLOOKUP(H$16&H$17,'TTHM GOAL CALC'!$A$228:$G$247,7,FALSE))),\"\",IF(SUM(S4Table)=0,\"\",VLOOKUP(H$16&H$17,'TTHM GOAL CALC'!$A$228:$G$247,7,FALSE)))","v":""},{"$f":"IF(ISERROR(IF(SUM(S4Table)=0,\"\",VLOOKUP(I$16&I$17,'TTHM GOAL CALC'!$A$228:$G$247,7,FALSE))),\"\",IF(SUM(S4Table)=0,\"\",VLOOKUP(I$16&I$17,'TTHM GOAL CALC'!$A$228:$G$247,7,FALSE)))","v":""},{"$f":"IF(ISERROR(IF(SUM(S4Table)=0,\"\",VLOOKUP(J$16&J$17,'TTHM GOAL CALC'!$A$228:$G$247,7,FALSE))),\"\",IF(SUM(S4Table)=0,\"\",VLOOKUP(J$16&J$17,'TTHM GOAL CALC'!$A$228:$G$247,7,FALSE)))","v":""},{"$f":"IF(ISERROR(IF(SUM(S4Table)=0,\"\",VLOOKUP(K$16&K$17,'TTHM GOAL CALC'!$A$228:$G$247,7,FALSE))),\"\",IF(SUM(S4Table)=0,\"\",VLOOKUP(K$16&K$17,'TTHM GOAL CALC'!$A$228:$G$247,7,FALSE)))","v":""},{"$f":"IF(ISERROR(IF(SUM(S4Table)=0,\"\",VLOOKUP(L$16&L$17,'TTHM GOAL CALC'!$A$228:$G$247,7,FALSE))),\"\",IF(SUM(S4Table)=0,\"\",VLOOKUP(L$16&L$17,'TTHM GOAL CALC'!$A$228:$G$247,7,FALSE)))","v":""},{"$f":"IF(ISERROR(IF(SUM(S4Table)=0,\"\",VLOOKUP(M$16&M$17,'TTHM GOAL CALC'!$A$228:$G$247,7,FALSE))),\"\",IF(SUM(S4Table)=0,\"\",VLOOKUP(M$16&M$17,'TTHM GOAL CALC'!$A$228:$G$247,7,FALSE)))","v":""},{"$f":"IF(ISERROR(IF(SUM(S4Table)=0,\"\",VLOOKUP(N$16&N$17,'TTHM GOAL CALC'!$A$228:$G$247,7,FALSE))),\"\",IF(SUM(S4Table)=0,\"\",VLOOKUP(N$16&N$17,'TTHM GOAL CALC'!$A$228:$G$247,7,FALSE)))","v":""}]
[null,{"$f":"'Site 5'!J5","v":"Site 5"},{"$f":"IF(ISBLANK('Site 5'!$T$5),\"\",'Site 5'!$T$5)","v":""},{"$f":"IF(ISERROR(IF(SUM(S5Table)=0,\"\",VLOOKUP(D$16&D$17,'TTHM GOAL CALC'!$A$251:$G$270,7,FALSE))),\"\",IF(SUM(S5Table)=0,\"\",VLOOKUP(D$16&D$17,'TTHM GOAL CALC'!$A$251:$G$270,7,FALSE)))","v":""},{"$f":"IF(ISERROR(IF(SUM(S5Table)=0,\"\",VLOOKUP(E$16&E$17,'TTHM GOAL CALC'!$A$251:$G$270,7,FALSE))),\"\",IF(SUM(S5Table)=0,\"\",VLOOKUP(E$16&E$17,'TTHM GOAL CALC'!$A$251:$G$270,7,FALSE)))","v":""},{"$f":"IF(ISERROR(IF(SUM(S5Table)=0,\"\",VLOOKUP(F$16&F$17,'TTHM GOAL CALC'!$A$251:$G$270,7,FALSE))),\"\",IF(SUM(S5Table)=0,\"\",VLOOKUP(F$16&F$17,'TTHM GOAL CALC'!$A$251:$G$270,7,FALSE)))","v":""},{"$f":"IF(ISERROR(IF(SUM(S5Table)=0,\"\",VLOOKUP(G$16&G$17,'TTHM GOAL CALC'!$A$251:$G$270,7,FALSE))),\"\",IF(SUM(S5Table)=0,\"\",VLOOKUP(G$16&G$17,'TTHM GOAL CALC'!$A$251:$G$270,7,FALSE)))","v":""},{"$f":"IF(ISERROR(IF(SUM(S5Table)=0,\"\",VLOOKUP(H$16&H$17,'TTHM GOAL CALC'!$A$251:$G$270,7,FALSE))),\"\",IF(SUM(S5Table)=0,\"\",VLOOKUP(H$16&H$17,'TTHM GOAL CALC'!$A$251:$G$270,7,FALSE)))","v":""},{"$f":"IF(ISERROR(IF(SUM(S5Table)=0,\"\",VLOOKUP(I$16&I$17,'TTHM GOAL CALC'!$A$251:$G$270,7,FALSE))),\"\",IF(SUM(S5Table)=0,\"\",VLOOKUP(I$16&I$17,'TTHM GOAL CALC'!$A$251:$G$270,7,FALSE)))","v":""},{"$f":"IF(ISERROR(IF(SUM(S5Table)=0,\"\",VLOOKUP(J$16&J$17,'TTHM GOAL CALC'!$A$251:$G$270,7,FALSE))),\"\",IF(SUM(S5Table)=0,\"\",VLOOKUP(J$16&J$17,'TTHM GOAL CALC'!$A$251:$G$270,7,FALSE)))","v":""},{"$f":"IF(ISERROR(IF(SUM(S5Table)=0,\"\",VLOOKUP(K$16&K$17,'TTHM GOAL CALC'!$A$251:$G$270,7,FALSE))),\"\",IF(SUM(S5Table)=0,\"\",VLOOKUP(K$16&K$17,'TTHM GOAL CALC'!$A$251:$G$270,7,FALSE)))","v":""},{"$f":"IF(ISERROR(IF(SUM(S5Table)=0,\"\",VLOOKUP(L$16&L$17,'TTHM GOAL CALC'!$A$251:$G$270,7,FALSE))),\"\",IF(SUM(S5Table)=0,\"\",VLOOKUP(L$16&L$17,'TTHM GOAL CALC'!$A$251:$G$270,7,FALSE)))","v":""},{"$f":"IF(ISERROR(IF(SUM(S5Table)=0,\"\",VLOOKUP(M$16&M$17,'TTHM GOAL CALC'!$A$251:$G$270,7,FALSE))),\"\",IF(SUM(S5Table)=0,\"\",VLOOKUP(M$16&M$17,'TTHM GOAL CALC'!$A$251:$G$270,7,FALSE)))","v":""},{"$f":"IF(ISERROR(IF(SUM(S5Table)=0,\"\",VLOOKUP(N$16&N$17,'TTHM GOAL CALC'!$A$251:$G$270,7,FALSE))),\"\",IF(SUM(S5Table)=0,\"\",VLOOKUP(N$16&N$17,'TTHM GOAL CALC'!$A$251:$G$270,7,FALSE)))","v":""}]
[null,{"$f":"'Site 6'!$J$5","v":"Site 6"},{"$f":"IF(ISBLANK('Site 6'!$T$5),\"\",'Site 6'!$T$5)","v":""},{"$f":"IF(ISERROR(IF(SUM(S6Table)=0,\"\",VLOOKUP(D$16&D$17,'TTHM GOAL CALC'!$A$274:$G$293,7,FALSE))),\"\",IF(SUM(S6Table)=0,\"\",VLOOKUP(D$16&D$17,'TTHM GOAL CALC'!$A$274:$G$293,7,FALSE)))","v":""},{"$f":"IF(ISERROR(IF(SUM(S6Table)=0,\"\",VLOOKUP(E$16&E$17,'TTHM GOAL CALC'!$A$274:$G$293,7,FALSE))),\"\",IF(SUM(S6Table)=0,\"\",VLOOKUP(E$16&E$17,'TTHM GOAL CALC'!$A$274:$G$293,7,FALSE)))","v":""},{"$f":"IF(ISERROR(IF(SUM(S6Table)=0,\"\",VLOOKUP(F$16&F$17,'TTHM GOAL CALC'!$A$274:$G$293,7,FALSE))),\"\",IF(SUM(S6Table)=0,\"\",VLOOKUP(F$16&F$17,'TTHM GOAL CALC'!$A$274:$G$293,7,FALSE)))","v":""},{"$f":"IF(ISERROR(IF(SUM(S6Table)=0,\"\",VLOOKUP(G$16&G$17,'TTHM GOAL CALC'!$A$274:$G$293,7,FALSE))),\"\",IF(SUM(S6Table)=0,\"\",VLOOKUP(G$16&G$17,'TTHM GOAL CALC'!$A$274:$G$293,7,FALSE)))","v":""},{"$f":"IF(ISERROR(IF(SUM(S6Table)=0,\"\",VLOOKUP(H$16&H$17,'TTHM GOAL CALC'!$A$274:$G$293,7,FALSE))),\"\",IF(SUM(S6Table)=0,\"\",VLOOKUP(H$16&H$17,'TTHM GOAL CALC'!$A$274:$G$293,7,FALSE)))","v":""},{"$f":"IF(ISERROR(IF(SUM(S6Table)=0,\"\",VLOOKUP(I$16&I$17,'TTHM GOAL CALC'!$A$274:$G$293,7,FALSE))),\"\",IF(SUM(S6Table)=0,\"\",VLOOKUP(I$16&I$17,'TTHM GOAL CALC'!$A$274:$G$293,7,FALSE)))","v":""},{"$f":"IF(ISERROR(IF(SUM(S6Table)=0,\"\",VLOOKUP(J$16&J$17,'TTHM GOAL CALC'!$A$274:$G$293,7,FALSE))),\"\",IF(SUM(S6Table)=0,\"\",VLOOKUP(J$16&J$17,'TTHM GOAL CALC'!$A$274:$G$293,7,FALSE)))","v":""},{"$f":"IF(ISERROR(IF(SUM(S6Table)=0,\"\",VLOOKUP(K$16&K$17,'TTHM GOAL CALC'!$A$274:$G$293,7,FALSE))),\"\",IF(SUM(S6Table)=0,\"\",VLOOKUP(K$16&K$17,'TTHM GOAL CALC'!$A$274:$G$293,7,FALSE)))","v":""},{"$f":"IF(ISERROR(IF(SUM(S6Table)=0,\"\",VLOOKUP(L$16&L$17,'TTHM GOAL CALC'!$A$274:$G$293,7,FALSE))),\"\",IF(SUM(S6Table)=0,\"\",VLOOKUP(L$16&L$17,'TTHM GOAL CALC'!$A$274:$G$293,7,FALSE)))","v":""},{"$f":"IF(ISERROR(IF(SUM(S6Table)=0,\"\",VLOOKUP(M$16&M$17,'TTHM GOAL CALC'!$A$274:$G$293,7,FALSE))),\"\",IF(SUM(S6Table)=0,\"\",VLOOKUP(M$16&M$17,'TTHM GOAL CALC'!$A$274:$G$293,7,FALSE)))","v":""},{"$f":"IF(ISERROR(IF(SUM(S6Table)=0,\"\",VLOOKUP(N$16&N$17,'TTHM GOAL CALC'!$A$274:$G$293,7,FALSE))),\"\",IF(SUM(S6Table)=0,\"\",VLOOKUP(N$16&N$17,'TTHM GOAL CALC'!$A$274:$G$293,7,FALSE)))","v":""}]
[null,{"$f":"'Site 7'!J5","v":"Site 7"},{"$f":"IF(ISBLANK('Site 7'!$T$5),\"\",'Site 7'!$T$5)","v":""},{"$f":"IF(ISERROR(IF(SUM(S7Table)=0,\"\",VLOOKUP(D$16&D$17,'TTHM GOAL CALC'!$A$297:$G$316,7,FALSE))),\"\",IF(SUM(S7Table)=0,\"\",VLOOKUP(D$16&D$17,'TTHM GOAL CALC'!$A$297:$G$316,7,FALSE)))","v":""},{"$f":"IF(ISERROR(IF(SUM(S7Table)=0,\"\",VLOOKUP(E$16&E$17,'TTHM GOAL CALC'!$A$297:$G$316,7,FALSE))),\"\",IF(SUM(S7Table)=0,\"\",VLOOKUP(E$16&E$17,'TTHM GOAL CALC'!$A$297:$G$316,7,FALSE)))","v":""},{"$f":"IF(ISERROR(IF(SUM(S7Table)=0,\"\",VLOOKUP(F$16&F$17,'TTHM GOAL CALC'!$A$297:$G$316,7,FALSE))),\"\",IF(SUM(S7Table)=0,\"\",VLOOKUP(F$16&F$17,'TTHM GOAL CALC'!$A$297:$G$316,7,FALSE)))","v":""},{"$f":"IF(ISERROR(IF(SUM(S7Table)=0,\"\",VLOOKUP(G$16&G$17,'TTHM GOAL CALC'!$A$297:$G$316,7,FALSE))),\"\",IF(SUM(S7Table)=0,\"\",VLOOKUP(G$16&G$17,'TTHM GOAL CALC'!$A$297:$G$316,7,FALSE)))","v":""},{"$f":"IF(ISERROR(IF(SUM(S7Table)=0,\"\",VLOOKUP(H$16&H$17,'TTHM GOAL CALC'!$A$297:$G$316,7,FALSE))),\"\",IF(SUM(S7Table)=0,\"\",VLOOKUP(H$16&H$17,'TTHM GOAL CALC'!$A$297:$G$316,7,FALSE)))","v":""},{"$f":"IF(ISERROR(IF(SUM(S7Table)=0,\"\",VLOOKUP(I$16&I$17,'TTHM GOAL CALC'!$A$297:$G$316,7,FALSE))),\"\",IF(SUM(S7Table)=0,\"\",VLOOKUP(I$16&I$17,'TTHM GOAL CALC'!$A$297:$G$316,7,FALSE)))","v":""},{"$f":"IF(ISERROR(IF(SUM(S7Table)=0,\"\",VLOOKUP(J$16&J$17,'TTHM GOAL CALC'!$A$297:$G$316,7,FALSE))),\"\",IF(SUM(S7Table)=0,\"\",VLOOKUP(J$16&J$17,'TTHM GOAL CALC'!$A$297:$G$316,7,FALSE)))","v":""},{"$f":"IF(ISERROR(IF(SUM(S7Table)=0,\"\",VLOOKUP(K$16&K$17,'TTHM GOAL CALC'!$A$297:$G$316,7,FALSE))),\"\",IF(SUM(S7Table)=0,\"\",VLOOKUP(K$16&K$17,'TTHM GOAL CALC'!$A$297:$G$316,7,FALSE)))","v":""},{"$f":"IF(ISERROR(IF(SUM(S7Table)=0,\"\",VLOOKUP(L$16&L$17,'TTHM GOAL CALC'!$A$297:$G$316,7,FALSE))),\"\",IF(SUM(S7Table)=0,\"\",VLOOKUP(L$16&L$17,'TTHM GOAL CALC'!$A$297:$G$316,7,FALSE)))","v":""},{"$f":"IF(ISERROR(IF(SUM(S7Table)=0,\"\",VLOOKUP(M$16&M$17,'TTHM GOAL CALC'!$A$297:$G$316,7,FALSE))),\"\",IF(SUM(S7Table)=0,\"\",VLOOKUP(M$16&M$17,'TTHM GOAL CALC'!$A$297:$G$316,7,FALSE)))","v":""},{"$f":"IF(ISERROR(IF(SUM(S7Table)=0,\"\",VLOOKUP(N$16&N$17,'TTHM GOAL CALC'!$A$297:$G$316,7,FALSE))),\"\",IF(SUM(S7Table)=0,\"\",VLOOKUP(N$16&N$17,'TTHM GOAL CALC'!$A$297:$G$316,7,FALSE)))","v":""}]
[null,{"$f":"'Site 8'!J5","v":"Site 8"},{"$f":"IF(ISBLANK('Site 8'!$T$5),\"\",'Site 8'!$T$5)","v":""},{"$f":"IF(ISERROR(IF(SUM(S8Table)=0,\"\",VLOOKUP(D$16&D$17,'TTHM GOAL CALC'!$A$320:$G$339,7,FALSE))),\"\",IF(SUM(S8Table)=0,\"\",VLOOKUP(D$16&D$17,'TTHM GOAL CALC'!$A$320:$G$339,7,FALSE)))","v":""},{"$f":"IF(ISERROR(IF(SUM(S8Table)=0,\"\",VLOOKUP(E$16&E$17,'TTHM GOAL CALC'!$A$320:$G$339,7,FALSE))),\"\",IF(SUM(S8Table)=0,\"\",VLOOKUP(E$16&E$17,'TTHM GOAL CALC'!$A$320:$G$339,7,FALSE)))","v":""},{"$f":"IF(ISERROR(IF(SUM(S8Table)=0,\"\",VLOOKUP(F$16&F$17,'TTHM GOAL CALC'!$A$320:$G$339,7,FALSE))),\"\",IF(SUM(S8Table)=0,\"\",VLOOKUP(F$16&F$17,'TTHM GOAL CALC'!$A$320:$G$339,7,FALSE)))","v":""},{"$f":"IF(ISERROR(IF(SUM(S8Table)=0,\"\",VLOOKUP(G$16&G$17,'TTHM GOAL CALC'!$A$320:$G$339,7,FALSE))),\"\",IF(SUM(S8Table)=0,\"\",VLOOKUP(G$16&G$17,'TTHM GOAL CALC'!$A$320:$G$339,7,FALSE)))","v":""},{"$f":"IF(ISERROR(IF(SUM(S8Table)=0,\"\",VLOOKUP(H$16&H$17,'TTHM GOAL CALC'!$A$320:$G$339,7,FALSE))),\"\",IF(SUM(S8Table)=0,\"\",VLOOKUP(H$16&H$17,'TTHM GOAL CALC'!$A$320:$G$339,7,FALSE)))","v":""},{"$f":"IF(ISERROR(IF(SUM(S8Table)=0,\"\",VLOOKUP(I$16&I$17,'TTHM GOAL CALC'!$A$320:$G$339,7,FALSE))),\"\",IF(SUM(S8Table)=0,\"\",VLOOKUP(I$16&I$17,'TTHM GOAL CALC'!$A$320:$G$339,7,FALSE)))","v":""},{"$f":"IF(ISERROR(IF(SUM(S8Table)=0,\"\",VLOOKUP(J$16&J$17,'TTHM GOAL CALC'!$A$320:$G$339,7,FALSE))),\"\",IF(SUM(S8Table)=0,\"\",VLOOKUP(J$16&J$17,'TTHM GOAL CALC'!$A$320:$G$339,7,FALSE)))","v":""},{"$f":"IF(ISERROR(IF(SUM(S8Table)=0,\"\",VLOOKUP(K$16&K$17,'TTHM GOAL CALC'!$A$320:$G$339,7,FALSE))),\"\",IF(SUM(S8Table)=0,\"\",VLOOKUP(K$16&K$17,'TTHM GOAL CALC'!$A$320:$G$339,7,FALSE)))","v":""},{"$f":"IF(ISERROR(IF(SUM(S8Table)=0,\"\",VLOOKUP(L$16&L$17,'TTHM GOAL CALC'!$A$320:$G$339,7,FALSE))),\"\",IF(SUM(S8Table)=0,\"\",VLOOKUP(L$16&L$17,'TTHM GOAL CALC'!$A$320:$G$339,7,FALSE)))","v":""},{"$f":"IF(ISERROR(IF(SUM(S8Table)=0,\"\",VLOOKUP(M$16&M$17,'TTHM GOAL CALC'!$A$320:$G$339,7,FALSE))),\"\",IF(SUM(S8Table)=0,\"\",VLOOKUP(M$16&M$17,'TTHM GOAL CALC'!$A$320:$G$339,7,FALSE)))","v":""},{"$f":"IF(ISERROR(IF(SUM(S8Table)=0,\"\",VLOOKUP(N$16&N$17,'TTHM GOAL CALC'!$A$320:$G$339,7,FALSE))),\"\",IF(SUM(S8Table)=0,\"\",VLOOKUP(N$16&N$17,'TTHM GOAL CALC'!$A$320:$G$339,7,FALSE)))","v":""}]
[null,{"$f":"'Site 9'!J5","v":"Site 9"},{"$f":"IF(ISBLANK('Site 9'!$T$5),\"\",'Site 9'!$T$5)","v":""},{"$f":"IF(ISERROR(IF(SUM(S9Table)=0,\"\",VLOOKUP(D$16&D$17,'TTHM GOAL CALC'!$A$343:$G$362,7,FALSE))),\"\",IF(SUM(S9Table)=0,\"\",VLOOKUP(D$16&D$17,'TTHM GOAL CALC'!$A$343:$G$362,7,FALSE)))","v":""},{"$f":"IF(ISERROR(IF(SUM(S9Table)=0,\"\",VLOOKUP(E$16&E$17,'TTHM GOAL CALC'!$A$343:$G$362,7,FALSE))),\"\",IF(SUM(S9Table)=0,\"\",VLOOKUP(E$16&E$17,'TTHM GOAL CALC'!$A$343:$G$362,7,FALSE)))","v":""},{"$f":"IF(ISERROR(IF(SUM(S9Table)=0,\"\",VLOOKUP(F$16&F$17,'TTHM GOAL CALC'!$A$343:$G$362,7,FALSE))),\"\",IF(SUM(S9Table)=0,\"\",VLOOKUP(F$16&F$17,'TTHM GOAL CALC'!$A$343:$G$362,7,FALSE)))","v":""},{"$f":"IF(ISERROR(IF(SUM(S9Table)=0,\"\",VLOOKUP(G$16&G$17,'TTHM GOAL CALC'!$A$343:$G$362,7,FALSE))),\"\",IF(SUM(S9Table)=0,\"\",VLOOKUP(G$16&G$17,'TTHM GOAL CALC'!$A$343:$G$362,7,FALSE)))","v":""},{"$f":"IF(ISERROR(IF(SUM(S9Table)=0,\"\",VLOOKUP(H$16&H$17,'TTHM GOAL CALC'!$A$343:$G$362,7,FALSE))),\"\",IF(SUM(S9Table)=0,\"\",VLOOKUP(H$16&H$17,'TTHM GOAL CALC'!$A$343:$G$362,7,FALSE)))","v":""},{"$f":"IF(ISERROR(IF(SUM(S9Table)=0,\"\",VLOOKUP(I$16&I$17,'TTHM GOAL CALC'!$A$343:$G$362,7,FALSE))),\"\",IF(SUM(S9Table)=0,\"\",VLOOKUP(I$16&I$17,'TTHM GOAL CALC'!$A$343:$G$362,7,FALSE)))","v":""},{"$f":"IF(ISERROR(IF(SUM(S9Table)=0,\"\",VLOOKUP(J$16&J$17,'TTHM GOAL CALC'!$A$343:$G$362,7,FALSE))),\"\",IF(SUM(S9Table)=0,\"\",VLOOKUP(J$16&J$17,'TTHM GOAL CALC'!$A$343:$G$362,7,FALSE)))","v":""},{"$f":"IF(ISERROR(IF(SUM(S9Table)=0,\"\",VLOOKUP(K$16&K$17,'TTHM GOAL CALC'!$A$343:$G$362,7,FALSE))),\"\",IF(SUM(S9Table)=0,\"\",VLOOKUP(K$16&K$17,'TTHM GOAL CALC'!$A$343:$G$362,7,FALSE)))","v":""},{"$f":"IF(ISERROR(IF(SUM(S9Table)=0,\"\",VLOOKUP(L$16&L$17,'TTHM GOAL CALC'!$A$343:$G$362,7,FALSE))),\"\",IF(SUM(S9Table)=0,\"\",VLOOKUP(L$16&L$17,'TTHM GOAL CALC'!$A$343:$G$362,7,FALSE)))","v":""},{"$f":"IF(ISERROR(IF(SUM(S9Table)=0,\"\",VLOOKUP(M$16&M$17,'TTHM GOAL CALC'!$A$343:$G$362,7,FALSE))),\"\",IF(SUM(S9Table)=0,\"\",VLOOKUP(M$16&M$17,'TTHM GOAL CALC'!$A$343:$G$362,7,FALSE)))","v":""},{"$f":"IF(ISERROR(IF(SUM(S9Table)=0,\"\",VLOOKUP(N$16&N$17,'TTHM GOAL CALC'!$A$343:$G$362,7,FALSE))),\"\",IF(SUM(S9Table)=0,\"\",VLOOKUP(N$16&N$17,'TTHM GOAL CALC'!$A$343:$G$362,7,FALSE)))","v":""}]
[null,{"$f":"'Site 10'!J5","v":"Site 10"},{"$f":"IF(ISBLANK('Site 10'!$T$5),\"\",'Site 10'!$T$5)","v":""},{"$f":"IF(ISERROR(IF(SUM(S10Table)=0,\"\",VLOOKUP(D$16&D$17,'TTHM GOAL CALC'!$A$366:$G$385,7,FALSE))),\"\",IF(SUM(S10Table)=0,\"\",VLOOKUP(D$16&D$17,'TTHM GOAL CALC'!$A$366:$G$385,7,FALSE)))","v":""},{"$f":"IF(ISERROR(IF(SUM(S10Table)=0,\"\",VLOOKUP(E$16&E$17,'TTHM GOAL CALC'!$A$366:$G$385,7,FALSE))),\"\",IF(SUM(S10Table)=0,\"\",VLOOKUP(E$16&E$17,'TTHM GOAL CALC'!$A$366:$G$385,7,FALSE)))","v":""},{"$f":"IF(ISERROR(IF(SUM(S10Table)=0,\"\",VLOOKUP(F$16&F$17,'TTHM GOAL CALC'!$A$366:$G$385,7,FALSE))),\"\",IF(SUM(S10Table)=0,\"\",VLOOKUP(F$16&F$17,'TTHM GOAL CALC'!$A$366:$G$385,7,FALSE)))","v":""},{"$f":"IF(ISERROR(IF(SUM(S10Table)=0,\"\",VLOOKUP(G$16&G$17,'TTHM GOAL CALC'!$A$366:$G$385,7,FALSE))),\"\",IF(SUM(S10Table)=0,\"\",VLOOKUP(G$16&G$17,'TTHM GOAL CALC'!$A$366:$G$385,7,FALSE)))","v":""},{"$f":"IF(ISERROR(IF(SUM(S10Table)=0,\"\",VLOOKUP(H$16&H$17,'TTHM GOAL CALC'!$A$366:$G$385,7,FALSE))),\"\",IF(SUM(S10Table)=0,\"\",VLOOKUP(H$16&H$17,'TTHM GOAL CALC'!$A$366:$G$385,7,FALSE)))","v":""},{"$f":"IF(ISERROR(IF(SUM(S10Table)=0,\"\",VLOOKUP(I$16&I$17,'TTHM GOAL CALC'!$A$366:$G$385,7,FALSE))),\"\",IF(SUM(S10Table)=0,\"\",VLOOKUP(I$16&I$17,'TTHM GOAL CALC'!$A$366:$G$385,7,FALSE)))","v":""},{"$f":"IF(ISERROR(IF(SUM(S10Table)=0,\"\",VLOOKUP(J$16&J$17,'TTHM GOAL CALC'!$A$366:$G$385,7,FALSE))),\"\",IF(SUM(S10Table)=0,\"\",VLOOKUP(J$16&J$17,'TTHM GOAL CALC'!$A$366:$G$385,7,FALSE)))","v":""},{"$f":"IF(ISERROR(IF(SUM(S10Table)=0,\"\",VLOOKUP(K$16&K$17,'TTHM GOAL CALC'!$A$366:$G$385,7,FALSE))),\"\",IF(SUM(S10Table)=0,\"\",VLOOKUP(K$16&K$17,'TTHM GOAL CALC'!$A$366:$G$385,7,FALSE)))","v":""},{"$f":"IF(ISERROR(IF(SUM(S10Table)=0,\"\",VLOOKUP(L$16&L$17,'TTHM GOAL CALC'!$A$366:$G$385,7,FALSE))),\"\",IF(SUM(S10Table)=0,\"\",VLOOKUP(L$16&L$17,'TTHM GOAL CALC'!$A$366:$G$385,7,FALSE)))","v":""},{"$f":"IF(ISERROR(IF(SUM(S10Table)=0,\"\",VLOOKUP(M$16&M$17,'TTHM GOAL CALC'!$A$366:$G$385,7,FALSE))),\"\",IF(SUM(S10Table)=0,\"\",VLOOKUP(M$16&M$17,'TTHM GOAL CALC'!$A$366:$G$385,7,FALSE)))","v":""},{"$f":"IF(ISERROR(IF(SUM(S10Table)=0,\"\",VLOOKUP(N$16&N$17,'TTHM GOAL CALC'!$A$366:$G$385,7,FALSE))),\"\",IF(SUM(S10Table)=0,\"\",VLOOKUP(N$16&N$17,'TTHM GOAL CALC'!$A$366:$G$385,7,FALSE)))","v":""}]
[null,{"$f":"'Site 11'!J5","v":"Site 11"},{"$f":"IF(ISBLANK('Site 11'!$T$5),\"\",'Site 11'!$T$5)","v":""},{"$f":"IF(ISERROR(IF(SUM(S10Table)=0,\"\",VLOOKUP(D$16&D$17,'TTHM GOAL CALC'!$A$389:$G$408,7,FALSE))),\"\",IF(SUM(S10Table)=0,\"\",VLOOKUP(D$16&D$17,'TTHM GOAL CALC'!$A$389:$G$408,7,FALSE)))","v":""},{"$f":"IF(ISERROR(IF(SUM(S10Table)=0,\"\",VLOOKUP(E$16&E$17,'TTHM GOAL CALC'!$A$389:$G$408,7,FALSE))),\"\",IF(SUM(S10Table)=0,\"\",VLOOKUP(E$16&E$17,'TTHM GOAL CALC'!$A$389:$G$408,7,FALSE)))","v":""},{"$f":"IF(ISERROR(IF(SUM(S10Table)=0,\"\",VLOOKUP(F$16&F$17,'TTHM GOAL CALC'!$A$389:$G$408,7,FALSE))),\"\",IF(SUM(S10Table)=0,\"\",VLOOKUP(F$16&F$17,'TTHM GOAL CALC'!$A$389:$G$408,7,FALSE)))","v":""},{"$f":"IF(ISERROR(IF(SUM(S10Table)=0,\"\",VLOOKUP(G$16&G$17,'TTHM GOAL CALC'!$A$389:$G$408,7,FALSE))),\"\",IF(SUM(S10Table)=0,\"\",VLOOKUP(G$16&G$17,'TTHM GOAL CALC'!$A$389:$G$408,7,FALSE)))","v":""},{"$f":"IF(ISERROR(IF(SUM(S10Table)=0,\"\",VLOOKUP(H$16&H$17,'TTHM GOAL CALC'!$A$389:$G$408,7,FALSE))),\"\",IF(SUM(S10Table)=0,\"\",VLOOKUP(H$16&H$17,'TTHM GOAL CALC'!$A$389:$G$408,7,FALSE)))","v":""},{"$f":"IF(ISERROR(IF(SUM(S10Table)=0,\"\",VLOOKUP(I$16&I$17,'TTHM GOAL CALC'!$A$389:$G$408,7,FALSE))),\"\",IF(SUM(S10Table)=0,\"\",VLOOKUP(I$16&I$17,'TTHM GOAL CALC'!$A$389:$G$408,7,FALSE)))","v":""},{"$f":"IF(ISERROR(IF(SUM(S10Table)=0,\"\",VLOOKUP(J$16&J$17,'TTHM GOAL CALC'!$A$389:$G$408,7,FALSE))),\"\",IF(SUM(S10Table)=0,\"\",VLOOKUP(J$16&J$17,'TTHM GOAL CALC'!$A$389:$G$408,7,FALSE)))","v":""},{"$f":"IF(ISERROR(IF(SUM(S10Table)=0,\"\",VLOOKUP(K$16&K$17,'TTHM GOAL CALC'!$A$389:$G$408,7,FALSE))),\"\",IF(SUM(S10Table)=0,\"\",VLOOKUP(K$16&K$17,'TTHM GOAL CALC'!$A$389:$G$408,7,FALSE)))","v":""},{"$f":"IF(ISERROR(IF(SUM(S10Table)=0,\"\",VLOOKUP(L$16&L$17,'TTHM GOAL CALC'!$A$389:$G$408,7,FALSE))),\"\",IF(SUM(S10Table)=0,\"\",VLOOKUP(L$16&L$17,'TTHM GOAL CALC'!$A$389:$G$408,7,FALSE)))","v":""},{"$f":"IF(ISERROR(IF(SUM(S10Table)=0,\"\",VLOOKUP(M$16&M$17,'TTHM GOAL CALC'!$A$389:$G$408,7,FALSE))),\"\",IF(SUM(S10Table)=0,\"\",VLOOKUP(M$16&M$17,'TTHM GOAL CALC'!$A$389:$G$408,7,FALSE)))","v":""},{"$f":"IF(ISERROR(IF(SUM(S10Table)=0,\"\",VLOOKUP(N$16&N$17,'TTHM GOAL CALC'!$A$389:$G$408,7,FALSE))),\"\",IF(SUM(S10Table)=0,\"\",VLOOKUP(N$16&N$17,'TTHM GOAL CALC'!$A$389:$G$408,7,FALSE)))","v":""}]
[null,{"$f":"'Site 12'!J5","v":"Site 12"},{"$f":"IF(ISBLANK('Site 12'!$T$5),\"\",'Site 12'!$T$5)","v":""},{"$f":"IF(ISERROR(IF(SUM(S10Table)=0,\"\",VLOOKUP(D$16&D$17,'TTHM GOAL CALC'!$A$412:$G$431,7,FALSE))),\"\",IF(SUM(S10Table)=0,\"\",VLOOKUP(D$16&D$17,'TTHM GOAL CALC'!$A$412:$G$431,7,FALSE)))","v":""},{"$f":"IF(ISERROR(IF(SUM(S10Table)=0,\"\",VLOOKUP(E$16&E$17,'TTHM GOAL CALC'!$A$412:$G$431,7,FALSE))),\"\",IF(SUM(S10Table)=0,\"\",VLOOKUP(E$16&E$17,'TTHM GOAL CALC'!$A$412:$G$431,7,FALSE)))","v":""},{"$f":"IF(ISERROR(IF(SUM(S10Table)=0,\"\",VLOOKUP(F$16&F$17,'TTHM GOAL CALC'!$A$412:$G$431,7,FALSE))),\"\",IF(SUM(S10Table)=0,\"\",VLOOKUP(F$16&F$17,'TTHM GOAL CALC'!$A$412:$G$431,7,FALSE)))","v":""},{"$f":"IF(ISERROR(IF(SUM(S10Table)=0,\"\",VLOOKUP(G$16&G$17,'TTHM GOAL CALC'!$A$412:$G$431,7,FALSE))),\"\",IF(SUM(S10Table)=0,\"\",VLOOKUP(G$16&G$17,'TTHM GOAL CALC'!$A$412:$G$431,7,FALSE)))","v":""},{"$f":"IF(ISERROR(IF(SUM(S10Table)=0,\"\",VLOOKUP(H$16&H$17,'TTHM GOAL CALC'!$A$412:$G$431,7,FALSE))),\"\",IF(SUM(S10Table)=0,\"\",VLOOKUP(H$16&H$17,'TTHM GOAL CALC'!$A$412:$G$431,7,FALSE)))","v":""},{"$f":"IF(ISERROR(IF(SUM(S10Table)=0,\"\",VLOOKUP(I$16&I$17,'TTHM GOAL CALC'!$A$412:$G$431,7,FALSE))),\"\",IF(SUM(S10Table)=0,\"\",VLOOKUP(I$16&I$17,'TTHM GOAL CALC'!$A$412:$G$431,7,FALSE)))","v":""},{"$f":"IF(ISERROR(IF(SUM(S10Table)=0,\"\",VLOOKUP(J$16&J$17,'TTHM GOAL CALC'!$A$412:$G$431,7,FALSE))),\"\",IF(SUM(S10Table)=0,\"\",VLOOKUP(J$16&J$17,'TTHM GOAL CALC'!$A$412:$G$431,7,FALSE)))","v":""},{"$f":"IF(ISERROR(IF(SUM(S10Table)=0,\"\",VLOOKUP(K$16&K$17,'TTHM GOAL CALC'!$A$412:$G$431,7,FALSE))),\"\",IF(SUM(S10Table)=0,\"\",VLOOKUP(K$16&K$17,'TTHM GOAL CALC'!$A$412:$G$431,7,FALSE)))","v":""},{"$f":"IF(ISERROR(IF(SUM(S10Table)=0,\"\",VLOOKUP(L$16&L$17,'TTHM GOAL CALC'!$A$412:$G$431,7,FALSE))),\"\",IF(SUM(S10Table)=0,\"\",VLOOKUP(L$16&L$17,'TTHM GOAL CALC'!$A$412:$G$431,7,FALSE)))","v":""},{"$f":"IF(ISERROR(IF(SUM(S10Table)=0,\"\",VLOOKUP(M$16&M$17,'TTHM GOAL CALC'!$A$412:$G$431,7,FALSE))),\"\",IF(SUM(S10Table)=0,\"\",VLOOKUP(M$16&M$17,'TTHM GOAL CALC'!$A$412:$G$431,7,FALSE)))","v":""},{"$f":"IF(ISERROR(IF(SUM(S10Table)=0,\"\",VLOOKUP(N$16&N$17,'TTHM GOAL CALC'!$A$412:$G$431,7,FALSE))),\"\",IF(SUM(S10Table)=0,\"\",VLOOKUP(N$16&N$17,'TTHM GOAL CALC'!$A$412:$G$431,7,FALSE)))","v":""}]
[null,{"$f":"'Site 13'!J5","v":"Site 13"},{"$f":"IF(ISBLANK('Site 13'!$T$5),\"\",'Site 13'!$T$5)","v":""},{"$f":"IF(ISERROR(IF(SUM(S10Table)=0,\"\",VLOOKUP(D$16&D$17,'TTHM GOAL CALC'!$A$435:$G$454,7,FALSE))),\"\",IF(SUM(S10Table)=0,\"\",VLOOKUP(D$16&D$17,'TTHM GOAL CALC'!$A$435:$G$454,7,FALSE)))","v":""},{"$f":"IF(ISERROR(IF(SUM(S10Table)=0,\"\",VLOOKUP(E$16&E$17,'TTHM GOAL CALC'!$A$435:$G$454,7,FALSE))),\"\",IF(SUM(S10Table)=0,\"\",VLOOKUP(E$16&E$17,'TTHM GOAL CALC'!$A$435:$G$454,7,FALSE)))","v":""},{"$f":"IF(ISERROR(IF(SUM(S10Table)=0,\"\",VLOOKUP(F$16&F$17,'TTHM GOAL CALC'!$A$435:$G$454,7,FALSE))),\"\",IF(SUM(S10Table)=0,\"\",VLOOKUP(F$16&F$17,'TTHM GOAL CALC'!$A$435:$G$454,7,FALSE)))","v":""},{"$f":"IF(ISERROR(IF(SUM(S10Table)=0,\"\",VLOOKUP(G$16&G$17,'TTHM GOAL CALC'!$A$435:$G$454,7,FALSE))),\"\",IF(SUM(S10Table)=0,\"\",VLOOKUP(G$16&G$17,'TTHM GOAL CALC'!$A$435:$G$454,7,FALSE)))","v":""},{"$f":"IF(ISERROR(IF(SUM(S10Table)=0,\"\",VLOOKUP(H$16&H$17,'TTHM GOAL CALC'!$A$435:$G$454,7,FALSE))),\"\",IF(SUM(S10Table)=0,\"\",VLOOKUP(H$16&H$17,'TTHM GOAL CALC'!$A$435:$G$454,7,FALSE)))","v":""},{"$f":"IF(ISERROR(IF(SUM(S10Table)=0,\"\",VLOOKUP(I$16&I$17,'TTHM GOAL CALC'!$A$435:$G$454,7,FALSE))),\"\",IF(SUM(S10Table)=0,\"\",VLOOKUP(I$16&I$17,'TTHM GOAL CALC'!$A$435:$G$454,7,FALSE)))","v":""},{"$f":"IF(ISERROR(IF(SUM(S10Table)=0,\"\",VLOOKUP(J$16&J$17,'TTHM GOAL CALC'!$A$435:$G$454,7,FALSE))),\"\",IF(SUM(S10Table)=0,\"\",VLOOKUP(J$16&J$17,'TTHM GOAL CALC'!$A$435:$G$454,7,FALSE)))","v":""},{"$f":"IF(ISERROR(IF(SUM(S10Table)=0,\"\",VLOOKUP(K$16&K$17,'TTHM GOAL CALC'!$A$435:$G$454,7,FALSE))),\"\",IF(SUM(S10Table)=0,\"\",VLOOKUP(K$16&K$17,'TTHM GOAL CALC'!$A$435:$G$454,7,FALSE)))","v":""},{"$f":"IF(ISERROR(IF(SUM(S10Table)=0,\"\",VLOOKUP(L$16&L$17,'TTHM GOAL CALC'!$A$435:$G$454,7,FALSE))),\"\",IF(SUM(S10Table)=0,\"\",VLOOKUP(L$16&L$17,'TTHM GOAL CALC'!$A$435:$G$454,7,FALSE)))","v":""},{"$f":"IF(ISERROR(IF(SUM(S10Table)=0,\"\",VLOOKUP(M$16&M$17,'TTHM GOAL CALC'!$A$435:$G$454,7,FALSE))),\"\",IF(SUM(S10Table)=0,\"\",VLOOKUP(M$16&M$17,'TTHM GOAL CALC'!$A$435:$G$454,7,FALSE)))","v":""},{"$f":"IF(ISERROR(IF(SUM(S10Table)=0,\"\",VLOOKUP(N$16&N$17,'TTHM GOAL CALC'!$A$435:$G$454,7,FALSE))),\"\",IF(SUM(S10Table)=0,\"\",VLOOKUP(N$16&N$17,'TTHM GOAL CALC'!$A$435:$G$454,7,FALSE)))","v":""}]
[null,{"$f":"'Site 14'!J5","v":"Site 14"},{"$f":"IF(ISBLANK('Site 14'!$T$5),\"\",'Site 14'!$T$5)","v":""},{"$f":"IF(ISERROR(IF(SUM(S10Table)=0,\"\",VLOOKUP(D$16&D$17,'TTHM GOAL CALC'!$A$458:$G$477,7,FALSE))),\"\",IF(SUM(S10Table)=0,\"\",VLOOKUP(D$16&D$17,'TTHM GOAL CALC'!$A$458:$G$477,7,FALSE)))","v":""},{"$f":"IF(ISERROR(IF(SUM(S10Table)=0,\"\",VLOOKUP(E$16&E$17,'TTHM GOAL CALC'!$A$458:$G$477,7,FALSE))),\"\",IF(SUM(S10Table)=0,\"\",VLOOKUP(E$16&E$17,'TTHM GOAL CALC'!$A$458:$G$477,7,FALSE)))","v":""},{"$f":"IF(ISERROR(IF(SUM(S10Table)=0,\"\",VLOOKUP(F$16&F$17,'TTHM GOAL CALC'!$A$458:$G$477,7,FALSE))),\"\",IF(SUM(S10Table)=0,\"\",VLOOKUP(F$16&F$17,'TTHM GOAL CALC'!$A$458:$G$477,7,FALSE)))","v":""},{"$f":"IF(ISERROR(IF(SUM(S10Table)=0,\"\",VLOOKUP(G$16&G$17,'TTHM GOAL CALC'!$A$458:$G$477,7,FALSE))),\"\",IF(SUM(S10Table)=0,\"\",VLOOKUP(G$16&G$17,'TTHM GOAL CALC'!$A$458:$G$477,7,FALSE)))","v":""},{"$f":"IF(ISERROR(IF(SUM(S10Table)=0,\"\",VLOOKUP(H$16&H$17,'TTHM GOAL CALC'!$A$458:$G$477,7,FALSE))),\"\",IF(SUM(S10Table)=0,\"\",VLOOKUP(H$16&H$17,'TTHM GOAL CALC'!$A$458:$G$477,7,FALSE)))","v":""},{"$f":"IF(ISERROR(IF(SUM(S10Table)=0,\"\",VLOOKUP(I$16&I$17,'TTHM GOAL CALC'!$A$458:$G$477,7,FALSE))),\"\",IF(SUM(S10Table)=0,\"\",VLOOKUP(I$16&I$17,'TTHM GOAL CALC'!$A$458:$G$477,7,FALSE)))","v":""},{"$f":"IF(ISERROR(IF(SUM(S10Table)=0,\"\",VLOOKUP(J$16&J$17,'TTHM GOAL CALC'!$A$458:$G$477,7,FALSE))),\"\",IF(SUM(S10Table)=0,\"\",VLOOKUP(J$16&J$17,'TTHM GOAL CALC'!$A$458:$G$477,7,FALSE)))","v":""},{"$f":"IF(ISERROR(IF(SUM(S10Table)=0,\"\",VLOOKUP(K$16&K$17,'TTHM GOAL CALC'!$A$458:$G$477,7,FALSE))),\"\",IF(SUM(S10Table)=0,\"\",VLOOKUP(K$16&K$17,'TTHM GOAL CALC'!$A$458:$G$477,7,FALSE)))","v":""},{"$f":"IF(ISERROR(IF(SUM(S10Table)=0,\"\",VLOOKUP(L$16&L$17,'TTHM GOAL CALC'!$A$458:$G$477,7,FALSE))),\"\",IF(SUM(S10Table)=0,\"\",VLOOKUP(L$16&L$17,'TTHM GOAL CALC'!$A$458:$G$477,7,FALSE)))","v":""},{"$f":"IF(ISERROR(IF(SUM(S10Table)=0,\"\",VLOOKUP(M$16&M$17,'TTHM GOAL CALC'!$A$458:$G$477,7,FALSE))),\"\",IF(SUM(S10Table)=0,\"\",VLOOKUP(M$16&M$17,'TTHM GOAL CALC'!$A$458:$G$477,7,FALSE)))","v":""},{"$f":"IF(ISERROR(IF(SUM(S10Table)=0,\"\",VLOOKUP(N$16&N$17,'TTHM GOAL CALC'!$A$458:$G$477,7,FALSE))),\"\",IF(SUM(S10Table)=0,\"\",VLOOKUP(N$16&N$17,'TTHM GOAL CALC'!$A$458:$G$477,7,FALSE)))","v":""}]
[null,{"$f":"'Site 15'!J5","v":"Site 15"},{"$f":"IF(ISBLANK('Site 15'!$T$5),\"\",'Site 15'!$T$5)","v":""},{"$f":"IF(ISERROR(IF(SUM(S10Table)=0,\"\",VLOOKUP(D$16&D$17,'TTHM GOAL CALC'!$A$481:$G$500,7,FALSE))),\"\",IF(SUM(S10Table)=0,\"\",VLOOKUP(D$16&D$17,'TTHM GOAL CALC'!$A$481:$G$500,7,FALSE)))","v":""},{"$f":"IF(ISERROR(IF(SUM(S10Table)=0,\"\",VLOOKUP(E$16&E$17,'TTHM GOAL CALC'!$A$481:$G$500,7,FALSE))),\"\",IF(SUM(S10Table)=0,\"\",VLOOKUP(E$16&E$17,'TTHM GOAL CALC'!$A$481:$G$500,7,FALSE)))","v":""},{"$f":"IF(ISERROR(IF(SUM(S10Table)=0,\"\",VLOOKUP(F$16&F$17,'TTHM GOAL CALC'!$A$481:$G$500,7,FALSE))),\"\",IF(SUM(S10Table)=0,\"\",VLOOKUP(F$16&F$17,'TTHM GOAL CALC'!$A$481:$G$500,7,FALSE)))","v":""},{"$f":"IF(ISERROR(IF(SUM(S10Table)=0,\"\",VLOOKUP(G$16&G$17,'TTHM GOAL CALC'!$A$481:$G$500,7,FALSE))),\"\",IF(SUM(S10Table)=0,\"\",VLOOKUP(G$16&G$17,'TTHM GOAL CALC'!$A$481:$G$500,7,FALSE)))","v":""},{"$f":"IF(ISERROR(IF(SUM(S10Table)=0,\"\",VLOOKUP(H$16&H$17,'TTHM GOAL CALC'!$A$481:$G$500,7,FALSE))),\"\",IF(SUM(S10Table)=0,\"\",VLOOKUP(H$16&H$17,'TTHM GOAL CALC'!$A$481:$G$500,7,FALSE)))","v":""},{"$f":"IF(ISERROR(IF(SUM(S10Table)=0,\"\",VLOOKUP(I$16&I$17,'TTHM GOAL CALC'!$A$481:$G$500,7,FALSE))),\"\",IF(SUM(S10Table)=0,\"\",VLOOKUP(I$16&I$17,'TTHM GOAL CALC'!$A$481:$G$500,7,FALSE)))","v":""},{"$f":"IF(ISERROR(IF(SUM(S10Table)=0,\"\",VLOOKUP(J$16&J$17,'TTHM GOAL CALC'!$A$481:$G$500,7,FALSE))),\"\",IF(SUM(S10Table)=0,\"\",VLOOKUP(J$16&J$17,'TTHM GOAL CALC'!$A$481:$G$500,7,FALSE)))","v":""},{"$f":"IF(ISERROR(IF(SUM(S10Table)=0,\"\",VLOOKUP(K$16&K$17,'TTHM GOAL CALC'!$A$481:$G$500,7,FALSE))),\"\",IF(SUM(S10Table)=0,\"\",VLOOKUP(K$16&K$17,'TTHM GOAL CALC'!$A$481:$G$500,7,FALSE)))","v":""},{"$f":"IF(ISERROR(IF(SUM(S10Table)=0,\"\",VLOOKUP(L$16&L$17,'TTHM GOAL CALC'!$A$481:$G$500,7,FALSE))),\"\",IF(SUM(S10Table)=0,\"\",VLOOKUP(L$16&L$17,'TTHM GOAL CALC'!$A$481:$G$500,7,FALSE)))","v":""},{"$f":"IF(ISERROR(IF(SUM(S10Table)=0,\"\",VLOOKUP(M$16&M$17,'TTHM GOAL CALC'!$A$481:$G$500,7,FALSE))),\"\",IF(SUM(S10Table)=0,\"\",VLOOKUP(M$16&M$17,'TTHM GOAL CALC'!$A$481:$G$500,7,FALSE)))","v":""},{"$f":"IF(ISERROR(IF(SUM(S10Table)=0,\"\",VLOOKUP(N$16&N$17,'TTHM GOAL CALC'!$A$481:$G$500,7,FALSE))),\"\",IF(SUM(S10Table)=0,\"\",VLOOKUP(N$16&N$17,'TTHM GOAL CALC'!$A$481:$G$500,7,FALSE)))","v":""}]
[null,{"$f":"'Site 16'!J5","v":"Site 16"},{"$f":"IF(ISBLANK('Site 16'!$T$5),\"\",'Site 16'!$T$5)","v":""},{"$f":"IF(ISERROR(IF(SUM(S10Table)=0,\"\",VLOOKUP(D$16&D$17,'TTHM GOAL CALC'!$A$504:$G$523,7,FALSE))),\"\",IF(SUM(S10Table)=0,\"\",VLOOKUP(D$16&D$17,'TTHM GOAL CALC'!$A$504:$G$523,7,FALSE)))","v":""},{"$f":"IF(ISERROR(IF(SUM(S10Table)=0,\"\",VLOOKUP(E$16&E$17,'TTHM GOAL CALC'!$A$504:$G$523,7,FALSE))),\"\",IF(SUM(S10Table)=0,\"\",VLOOKUP(E$16&E$17,'TTHM GOAL CALC'!$A$504:$G$523,7,FALSE)))","v":""},{"$f":"IF(ISERROR(IF(SUM(S10Table)=0,\"\",VLOOKUP(F$16&F$17,'TTHM GOAL CALC'!$A$504:$G$523,7,FALSE))),\"\",IF(SUM(S10Table)=0,\"\",VLOOKUP(F$16&F$17,'TTHM GOAL CALC'!$A$504:$G$523,7,FALSE)))","v":""},{"$f":"IF(ISERROR(IF(SUM(S10Table)=0,\"\",VLOOKUP(G$16&G$17,'TTHM GOAL CALC'!$A$504:$G$523,7,FALSE))),\"\",IF(SUM(S10Table)=0,\"\",VLOOKUP(G$16&G$17,'TTHM GOAL CALC'!$A$504:$G$523,7,FALSE)))","v":""},{"$f":"IF(ISERROR(IF(SUM(S10Table)=0,\"\",VLOOKUP(H$16&H$17,'TTHM GOAL CALC'!$A$504:$G$523,7,FALSE))),\"\",IF(SUM(S10Table)=0,\"\",VLOOKUP(H$16&H$17,'TTHM GOAL CALC'!$A$504:$G$523,7,FALSE)))","v":""},{"$f":"IF(ISERROR(IF(SUM(S10Table)=0,\"\",VLOOKUP(I$16&I$17,'TTHM GOAL CALC'!$A$504:$G$523,7,FALSE))),\"\",IF(SUM(S10Table)=0,\"\",VLOOKUP(I$16&I$17,'TTHM GOAL CALC'!$A$504:$G$523,7,FALSE)))","v":""},{"$f":"IF(ISERROR(IF(SUM(S10Table)=0,\"\",VLOOKUP(J$16&J$17,'TTHM GOAL CALC'!$A$504:$G$523,7,FALSE))),\"\",IF(SUM(S10Table)=0,\"\",VLOOKUP(J$16&J$17,'TTHM GOAL CALC'!$A$504:$G$523,7,FALSE)))","v":""},{"$f":"IF(ISERROR(IF(SUM(S10Table)=0,\"\",VLOOKUP(K$16&K$17,'TTHM GOAL CALC'!$A$504:$G$523,7,FALSE))),\"\",IF(SUM(S10Table)=0,\"\",VLOOKUP(K$16&K$17,'TTHM GOAL CALC'!$A$504:$G$523,7,FALSE)))","v":""},{"$f":"IF(ISERROR(IF(SUM(S10Table)=0,\"\",VLOOKUP(L$16&L$17,'TTHM GOAL CALC'!$A$504:$G$523,7,FALSE))),\"\",IF(SUM(S10Table)=0,\"\",VLOOKUP(L$16&L$17,'TTHM GOAL CALC'!$A$504:$G$523,7,FALSE)))","v":""},{"$f":"IF(ISERROR(IF(SUM(S10Table)=0,\"\",VLOOKUP(M$16&M$17,'TTHM GOAL CALC'!$A$504:$G$523,7,FALSE))),\"\",IF(SUM(S10Table)=0,\"\",VLOOKUP(M$16&M$17,'TTHM GOAL CALC'!$A$504:$G$523,7,FALSE)))","v":""},{"$f":"IF(ISERROR(IF(SUM(S10Table)=0,\"\",VLOOKUP(N$16&N$17,'TTHM GOAL CALC'!$A$504:$G$523,7,FALSE))),\"\",IF(SUM(S10Table)=0,\"\",VLOOKUP(N$16&N$17,'TTHM GOAL CALC'!$A$504:$G$523,7,FALSE)))","v":""}]
[null,{"$f":"'Site 17'!J5","v":"Site 17"},{"$f":"IF(ISBLANK('Site 17'!$T$5),\"\",'Site 17'!$T$5)","v":""},{"$f":"IF(ISERROR(IF(SUM(S10Table)=0,\"\",VLOOKUP(D$16&D$17,'TTHM GOAL CALC'!$A$527:$G$546,7,FALSE))),\"\",IF(SUM(S10Table)=0,\"\",VLOOKUP(D$16&D$17,'TTHM GOAL CALC'!$A$527:$G$546,7,FALSE)))","v":""},{"$f":"IF(ISERROR(IF(SUM(S10Table)=0,\"\",VLOOKUP(E$16&E$17,'TTHM GOAL CALC'!$A$527:$G$546,7,FALSE))),\"\",IF(SUM(S10Table)=0,\"\",VLOOKUP(E$16&E$17,'TTHM GOAL CALC'!$A$527:$G$546,7,FALSE)))","v":""},{"$f":"IF(ISERROR(IF(SUM(S10Table)=0,\"\",VLOOKUP(F$16&F$17,'TTHM GOAL CALC'!$A$527:$G$546,7,FALSE))),\"\",IF(SUM(S10Table)=0,\"\",VLOOKUP(F$16&F$17,'TTHM GOAL CALC'!$A$527:$G$546,7,FALSE)))","v":""},{"$f":"IF(ISERROR(IF(SUM(S10Table)=0,\"\",VLOOKUP(G$16&G$17,'TTHM GOAL CALC'!$A$527:$G$546,7,FALSE))),\"\",IF(SUM(S10Table)=0,\"\",VLOOKUP(G$16&G$17,'TTHM GOAL CALC'!$A$527:$G$546,7,FALSE)))","v":""},{"$f":"IF(ISERROR(IF(SUM(S10Table)=0,\"\",VLOOKUP(H$16&H$17,'TTHM GOAL CALC'!$A$527:$G$546,7,FALSE))),\"\",IF(SUM(S10Table)=0,\"\",VLOOKUP(H$16&H$17,'TTHM GOAL CALC'!$A$527:$G$546,7,FALSE)))","v":""},{"$f":"IF(ISERROR(IF(SUM(S10Table)=0,\"\",VLOOKUP(I$16&I$17,'TTHM GOAL CALC'!$A$527:$G$546,7,FALSE))),\"\",IF(SUM(S10Table)=0,\"\",VLOOKUP(I$16&I$17,'TTHM GOAL CALC'!$A$527:$G$546,7,FALSE)))","v":""},{"$f":"IF(ISERROR(IF(SUM(S10Table)=0,\"\",VLOOKUP(J$16&J$17,'TTHM GOAL CALC'!$A$527:$G$546,7,FALSE))),\"\",IF(SUM(S10Table)=0,\"\",VLOOKUP(J$16&J$17,'TTHM GOAL CALC'!$A$527:$G$546,7,FALSE)))","v":""},{"$f":"IF(ISERROR(IF(SUM(S10Table)=0,\"\",VLOOKUP(K$16&K$17,'TTHM GOAL CALC'!$A$527:$G$546,7,FALSE))),\"\",IF(SUM(S10Table)=0,\"\",VLOOKUP(K$16&K$17,'TTHM GOAL CALC'!$A$527:$G$546,7,FALSE)))","v":""},{"$f":"IF(ISERROR(IF(SUM(S10Table)=0,\"\",VLOOKUP(L$16&L$17,'TTHM GOAL CALC'!$A$527:$G$546,7,FALSE))),\"\",IF(SUM(S10Table)=0,\"\",VLOOKUP(L$16&L$17,'TTHM GOAL CALC'!$A$527:$G$546,7,FALSE)))","v":""},{"$f":"IF(ISERROR(IF(SUM(S10Table)=0,\"\",VLOOKUP(M$16&M$17,'TTHM GOAL CALC'!$A$527:$G$546,7,FALSE))),\"\",IF(SUM(S10Table)=0,\"\",VLOOKUP(M$16&M$17,'TTHM GOAL CALC'!$A$527:$G$546,7,FALSE)))","v":""},{"$f":"IF(ISERROR(IF(SUM(S10Table)=0,\"\",VLOOKUP(N$16&N$17,'TTHM GOAL CALC'!$A$527:$G$546,7,FALSE))),\"\",IF(SUM(S10Table)=0,\"\",VLOOKUP(N$16&N$17,'TTHM GOAL CALC'!$A$527:$G$546,7,FALSE)))","v":""}]
[null,{"$f":"'Site 18'!J5","v":"Site 18"},{"$f":"IF(ISBLANK('Site 18'!$T$5),\"\",'Site 18'!$T$5)","v":""},{"$f":"IF(ISERROR(IF(SUM(S10Table)=0,\"\",VLOOKUP(D$16&D$17,'TTHM GOAL CALC'!$A$550:$G$569,7,FALSE))),\"\",IF(SUM(S10Table)=0,\"\",VLOOKUP(D$16&D$17,'TTHM GOAL CALC'!$A$550:$G$569,7,FALSE)))","v":""},{"$f":"IF(ISERROR(IF(SUM(S10Table)=0,\"\",VLOOKUP(E$16&E$17,'TTHM GOAL CALC'!$A$550:$G$569,7,FALSE))),\"\",IF(SUM(S10Table)=0,\"\",VLOOKUP(E$16&E$17,'TTHM GOAL CALC'!$A$550:$G$569,7,FALSE)))","v":""},{"$f":"IF(ISERROR(IF(SUM(S10Table)=0,\"\",VLOOKUP(F$16&F$17,'TTHM GOAL CALC'!$A$550:$G$569,7,FALSE))),\"\",IF(SUM(S10Table)=0,\"\",VLOOKUP(F$16&F$17,'TTHM GOAL CALC'!$A$550:$G$569,7,FALSE)))","v":""},{"$f":"IF(ISERROR(IF(SUM(S10Table)=0,\"\",VLOOKUP(G$16&G$17,'TTHM GOAL CALC'!$A$550:$G$569,7,FALSE))),\"\",IF(SUM(S10Table)=0,\"\",VLOOKUP(G$16&G$17,'TTHM GOAL CALC'!$A$550:$G$569,7,FALSE)))","v":""},{"$f":"IF(ISERROR(IF(SUM(S10Table)=0,\"\",VLOOKUP(H$16&H$17,'TTHM GOAL CALC'!$A$550:$G$569,7,FALSE))),\"\",IF(SUM(S10Table)=0,\"\",VLOOKUP(H$16&H$17,'TTHM GOAL CALC'!$A$550:$G$569,7,FALSE)))","v":""},{"$f":"IF(ISERROR(IF(SUM(S10Table)=0,\"\",VLOOKUP(I$16&I$17,'TTHM GOAL CALC'!$A$550:$G$569,7,FALSE))),\"\",IF(SUM(S10Table)=0,\"\",VLOOKUP(I$16&I$17,'TTHM GOAL CALC'!$A$550:$G$569,7,FALSE)))","v":""},{"$f":"IF(ISERROR(IF(SUM(S10Table)=0,\"\",VLOOKUP(J$16&J$17,'TTHM GOAL CALC'!$A$550:$G$569,7,FALSE))),\"\",IF(SUM(S10Table)=0,\"\",VLOOKUP(J$16&J$17,'TTHM GOAL CALC'!$A$550:$G$569,7,FALSE)))","v":""},{"$f":"IF(ISERROR(IF(SUM(S10Table)=0,\"\",VLOOKUP(K$16&K$17,'TTHM GOAL CALC'!$A$550:$G$569,7,FALSE))),\"\",IF(SUM(S10Table)=0,\"\",VLOOKUP(K$16&K$17,'TTHM GOAL CALC'!$A$550:$G$569,7,FALSE)))","v":""},{"$f":"IF(ISERROR(IF(SUM(S10Table)=0,\"\",VLOOKUP(L$16&L$17,'TTHM GOAL CALC'!$A$550:$G$569,7,FALSE))),\"\",IF(SUM(S10Table)=0,\"\",VLOOKUP(L$16&L$17,'TTHM GOAL CALC'!$A$550:$G$569,7,FALSE)))","v":""},{"$f":"IF(ISERROR(IF(SUM(S10Table)=0,\"\",VLOOKUP(M$16&M$17,'TTHM GOAL CALC'!$A$550:$G$569,7,FALSE))),\"\",IF(SUM(S10Table)=0,\"\",VLOOKUP(M$16&M$17,'TTHM GOAL CALC'!$A$550:$G$569,7,FALSE)))","v":""},{"$f":"IF(ISERROR(IF(SUM(S10Table)=0,\"\",VLOOKUP(N$16&N$17,'TTHM GOAL CALC'!$A$550:$G$569,7,FALSE))),\"\",IF(SUM(S10Table)=0,\"\",VLOOKUP(N$16&N$17,'TTHM GOAL CALC'!$A$550:$G$569,7,FALSE)))","v":""}]
[null,{"$f":"'Site 19'!J5","v":"Site 19"},{"$f":"IF(ISBLANK('Site 19'!$T$5),\"\",'Site 19'!$T$5)","v":""},{"$f":"IF(ISERROR(IF(SUM(S10Table)=0,\"\",VLOOKUP(D$16&D$17,'TTHM GOAL CALC'!$A$573:$G$592,7,FALSE))),\"\",IF(SUM(S10Table)=0,\"\",VLOOKUP(D$16&D$17,'TTHM GOAL CALC'!$A$573:$G$592,7,FALSE)))","v":""},{"$f":"IF(ISERROR(IF(SUM(S10Table)=0,\"\",VLOOKUP(E$16&E$17,'TTHM GOAL CALC'!$A$573:$G$592,7,FALSE))),\"\",IF(SUM(S10Table)=0,\"\",VLOOKUP(E$16&E$17,'TTHM GOAL CALC'!$A$573:$G$592,7,FALSE)))","v":""},{"$f":"IF(ISERROR(IF(SUM(S10Table)=0,\"\",VLOOKUP(F$16&F$17,'TTHM GOAL CALC'!$A$573:$G$592,7,FALSE))),\"\",IF(SUM(S10Table)=0,\"\",VLOOKUP(F$16&F$17,'TTHM GOAL CALC'!$A$573:$G$592,7,FALSE)))","v":""},{"$f":"IF(ISERROR(IF(SUM(S10Table)=0,\"\",VLOOKUP(G$16&G$17,'TTHM GOAL CALC'!$A$573:$G$592,7,FALSE))),\"\",IF(SUM(S10Table)=0,\"\",VLOOKUP(G$16&G$17,'TTHM GOAL CALC'!$A$573:$G$592,7,FALSE)))","v":""},{"$f":"IF(ISERROR(IF(SUM(S10Table)=0,\"\",VLOOKUP(H$16&H$17,'TTHM GOAL CALC'!$A$573:$G$592,7,FALSE))),\"\",IF(SUM(S10Table)=0,\"\",VLOOKUP(H$16&H$17,'TTHM GOAL CALC'!$A$573:$G$592,7,FALSE)))","v":""},{"$f":"IF(ISERROR(IF(SUM(S10Table)=0,\"\",VLOOKUP(I$16&I$17,'TTHM GOAL CALC'!$A$573:$G$592,7,FALSE))),\"\",IF(SUM(S10Table)=0,\"\",VLOOKUP(I$16&I$17,'TTHM GOAL CALC'!$A$573:$G$592,7,FALSE)))","v":""},{"$f":"IF(ISERROR(IF(SUM(S10Table)=0,\"\",VLOOKUP(J$16&J$17,'TTHM GOAL CALC'!$A$573:$G$592,7,FALSE))),\"\",IF(SUM(S10Table)=0,\"\",VLOOKUP(J$16&J$17,'TTHM GOAL CALC'!$A$573:$G$592,7,FALSE)))","v":""},{"$f":"IF(ISERROR(IF(SUM(S10Table)=0,\"\",VLOOKUP(K$16&K$17,'TTHM GOAL CALC'!$A$573:$G$592,7,FALSE))),\"\",IF(SUM(S10Table)=0,\"\",VLOOKUP(K$16&K$17,'TTHM GOAL CALC'!$A$573:$G$592,7,FALSE)))","v":""},{"$f":"IF(ISERROR(IF(SUM(S10Table)=0,\"\",VLOOKUP(L$16&L$17,'TTHM GOAL CALC'!$A$573:$G$592,7,FALSE))),\"\",IF(SUM(S10Table)=0,\"\",VLOOKUP(L$16&L$17,'TTHM GOAL CALC'!$A$573:$G$592,7,FALSE)))","v":""},{"$f":"IF(ISERROR(IF(SUM(S10Table)=0,\"\",VLOOKUP(M$16&M$17,'TTHM GOAL CALC'!$A$573:$G$592,7,FALSE))),\"\",IF(SUM(S10Table)=0,\"\",VLOOKUP(M$16&M$17,'TTHM GOAL CALC'!$A$573:$G$592,7,FALSE)))","v":""},{"$f":"IF(ISERROR(IF(SUM(S10Table)=0,\"\",VLOOKUP(N$16&N$17,'TTHM GOAL CALC'!$A$573:$G$592,7,FALSE))),\"\",IF(SUM(S10Table)=0,\"\",VLOOKUP(N$16&N$17,'TTHM GOAL CALC'!$A$573:$G$592,7,FALSE)))","v":""}]
[null,{"$f":"'Site 20'!J5","v":"Site 20"},{"$f":"IF(ISBLANK('Site 20'!$T$5),\"\",'Site 20'!$T$5)","v":""},{"$f":"IF(ISERROR(IF(SUM(S10Table)=0,\"\",VLOOKUP(D$16&D$17,'TTHM GOAL CALC'!$A$596:$G$615,7,FALSE))),\"\",IF(SUM(S10Table)=0,\"\",VLOOKUP(D$16&D$17,'TTHM GOAL CALC'!$A$596:$G$615,7,FALSE)))","v":""},{"$f":"IF(ISERROR(IF(SUM(S10Table)=0,\"\",VLOOKUP(E$16&E$17,'TTHM GOAL CALC'!$A$596:$G$615,7,FALSE))),\"\",IF(SUM(S10Table)=0,\"\",VLOOKUP(E$16&E$17,'TTHM GOAL CALC'!$A$596:$G$615,7,FALSE)))","v":""},{"$f":"IF(ISERROR(IF(SUM(S10Table)=0,\"\",VLOOKUP(F$16&F$17,'TTHM GOAL CALC'!$A$596:$G$615,7,FALSE))),\"\",IF(SUM(S10Table)=0,\"\",VLOOKUP(F$16&F$17,'TTHM GOAL CALC'!$A$596:$G$615,7,FALSE)))","v":""},{"$f":"IF(ISERROR(IF(SUM(S10Table)=0,\"\",VLOOKUP(G$16&G$17,'TTHM GOAL CALC'!$A$596:$G$615,7,FALSE))),\"\",IF(SUM(S10Table)=0,\"\",VLOOKUP(G$16&G$17,'TTHM GOAL CALC'!$A$596:$G$615,7,FALSE)))","v":""},{"$f":"IF(ISERROR(IF(SUM(S10Table)=0,\"\",VLOOKUP(H$16&H$17,'TTHM GOAL CALC'!$A$596:$G$615,7,FALSE))),\"\",IF(SUM(S10Table)=0,\"\",VLOOKUP(H$16&H$17,'TTHM GOAL CALC'!$A$596:$G$615,7,FALSE)))","v":""},{"$f":"IF(ISERROR(IF(SUM(S10Table)=0,\"\",VLOOKUP(I$16&I$17,'TTHM GOAL CALC'!$A$596:$G$615,7,FALSE))),\"\",IF(SUM(S10Table)=0,\"\",VLOOKUP(I$16&I$17,'TTHM GOAL CALC'!$A$596:$G$615,7,FALSE)))","v":""},{"$f":"IF(ISERROR(IF(SUM(S10Table)=0,\"\",VLOOKUP(J$16&J$17,'TTHM GOAL CALC'!$A$596:$G$615,7,FALSE))),\"\",IF(SUM(S10Table)=0,\"\",VLOOKUP(J$16&J$17,'TTHM GOAL CALC'!$A$596:$G$615,7,FALSE)))","v":""},{"$f":"IF(ISERROR(IF(SUM(S10Table)=0,\"\",VLOOKUP(K$16&K$17,'TTHM GOAL CALC'!$A$596:$G$615,7,FALSE))),\"\",IF(SUM(S10Table)=0,\"\",VLOOKUP(K$16&K$17,'TTHM GOAL CALC'!$A$596:$G$615,7,FALSE)))","v":""},{"$f":"IF(ISERROR(IF(SUM(S10Table)=0,\"\",VLOOKUP(L$16&L$17,'TTHM GOAL CALC'!$A$596:$G$615,7,FALSE))),\"\",IF(SUM(S10Table)=0,\"\",VLOOKUP(L$16&L$17,'TTHM GOAL CALC'!$A$596:$G$615,7,FALSE)))","v":""},{"$f":"IF(ISERROR(IF(SUM(S10Table)=0,\"\",VLOOKUP(M$16&M$17,'TTHM GOAL CALC'!$A$596:$G$615,7,FALSE))),\"\",IF(SUM(S10Table)=0,\"\",VLOOKUP(M$16&M$17,'TTHM GOAL CALC'!$A$596:$G$615,7,FALSE)))","v":""},{"$f":"IF(ISERROR(IF(SUM(S10Table)=0,\"\",VLOOKUP(N$16&N$17,'TTHM GOAL CALC'!$A$596:$G$615,7,FALSE))),\"\",IF(SUM(S10Table)=0,\"\",VLOOKUP(N$16&N$17,'TTHM GOAL CALC'!$A$596:$G$615,7,FALSE)))","v":""}]
[null,{"$f":"'Site 21'!J5","v":"Site 21"},{"$f":"IF(ISBLANK('Site 21'!$T$5),\"\",'Site 21'!$T$5)","v":""},{"$f":"IF(ISERROR(IF(SUM(S10Table)=0,\"\",VLOOKUP(D$16&D$17,'TTHM GOAL CALC'!$A$619:$G$638,7,FALSE))),\"\",IF(SUM(S10Table)=0,\"\",VLOOKUP(D$16&D$17,'TTHM GOAL CALC'!$A$619:$G$638,7,FALSE)))","v":""},{"$f":"IF(ISERROR(IF(SUM(S10Table)=0,\"\",VLOOKUP(E$16&E$17,'TTHM GOAL CALC'!$A$619:$G$638,7,FALSE))),\"\",IF(SUM(S10Table)=0,\"\",VLOOKUP(E$16&E$17,'TTHM GOAL CALC'!$A$619:$G$638,7,FALSE)))","v":""},{"$f":"IF(ISERROR(IF(SUM(S10Table)=0,\"\",VLOOKUP(F$16&F$17,'TTHM GOAL CALC'!$A$619:$G$638,7,FALSE))),\"\",IF(SUM(S10Table)=0,\"\",VLOOKUP(F$16&F$17,'TTHM GOAL CALC'!$A$619:$G$638,7,FALSE)))","v":""},{"$f":"IF(ISERROR(IF(SUM(S10Table)=0,\"\",VLOOKUP(G$16&G$17,'TTHM GOAL CALC'!$A$619:$G$638,7,FALSE))),\"\",IF(SUM(S10Table)=0,\"\",VLOOKUP(G$16&G$17,'TTHM GOAL CALC'!$A$619:$G$638,7,FALSE)))","v":""},{"$f":"IF(ISERROR(IF(SUM(S10Table)=0,\"\",VLOOKUP(H$16&H$17,'TTHM GOAL CALC'!$A$619:$G$638,7,FALSE))),\"\",IF(SUM(S10Table)=0,\"\",VLOOKUP(H$16&H$17,'TTHM GOAL CALC'!$A$619:$G$638,7,FALSE)))","v":""},{"$f":"IF(ISERROR(IF(SUM(S10Table)=0,\"\",VLOOKUP(I$16&I$17,'TTHM GOAL CALC'!$A$619:$G$638,7,FALSE))),\"\",IF(SUM(S10Table)=0,\"\",VLOOKUP(I$16&I$17,'TTHM GOAL CALC'!$A$619:$G$638,7,FALSE)))","v":""},{"$f":"IF(ISERROR(IF(SUM(S10Table)=0,\"\",VLOOKUP(J$16&J$17,'TTHM GOAL CALC'!$A$619:$G$638,7,FALSE))),\"\",IF(SUM(S10Table)=0,\"\",VLOOKUP(J$16&J$17,'TTHM GOAL CALC'!$A$619:$G$638,7,FALSE)))","v":""},{"$f":"IF(ISERROR(IF(SUM(S10Table)=0,\"\",VLOOKUP(K$16&K$17,'TTHM GOAL CALC'!$A$619:$G$638,7,FALSE))),\"\",IF(SUM(S10Table)=0,\"\",VLOOKUP(K$16&K$17,'TTHM GOAL CALC'!$A$619:$G$638,7,FALSE)))","v":""},{"$f":"IF(ISERROR(IF(SUM(S10Table)=0,\"\",VLOOKUP(L$16&L$17,'TTHM GOAL CALC'!$A$619:$G$638,7,FALSE))),\"\",IF(SUM(S10Table)=0,\"\",VLOOKUP(L$16&L$17,'TTHM GOAL CALC'!$A$619:$G$638,7,FALSE)))","v":""},{"$f":"IF(ISERROR(IF(SUM(S10Table)=0,\"\",VLOOKUP(M$16&M$17,'TTHM GOAL CALC'!$A$619:$G$638,7,FALSE))),\"\",IF(SUM(S10Table)=0,\"\",VLOOKUP(M$16&M$17,'TTHM GOAL CALC'!$A$619:$G$638,7,FALSE)))","v":""},{"$f":"IF(ISERROR(IF(SUM(S10Table)=0,\"\",VLOOKUP(N$16&N$17,'TTHM GOAL CALC'!$A$619:$G$638,7,FALSE))),\"\",IF(SUM(S10Table)=0,\"\",VLOOKUP(N$16&N$17,'TTHM GOAL CALC'!$A$619:$G$638,7,FALSE)))","v":""}]
[null,{"$f":"'Site 22'!J5","v":"Site 22"},{"$f":"IF(ISBLANK('Site 22'!$T$5),\"\",'Site 22'!$T$5)","v":""},{"$f":"IF(ISERROR(IF(SUM(S10Table)=0,\"\",VLOOKUP(D$16&D$17,'TTHM GOAL CALC'!$A$642:$G$661,7,FALSE))),\"\",IF(SUM(S10Table)=0,\"\",VLOOKUP(D$16&D$17,'TTHM GOAL CALC'!$A$642:$G$661,7,FALSE)))","v":""},{"$f":"IF(ISERROR(IF(SUM(S10Table)=0,\"\",VLOOKUP(E$16&E$17,'TTHM GOAL CALC'!$A$642:$G$661,7,FALSE))),\"\",IF(SUM(S10Table)=0,\"\",VLOOKUP(E$16&E$17,'TTHM GOAL CALC'!$A$642:$G$661,7,FALSE)))","v":""},{"$f":"IF(ISERROR(IF(SUM(S10Table)=0,\"\",VLOOKUP(F$16&F$17,'TTHM GOAL CALC'!$A$642:$G$661,7,FALSE))),\"\",IF(SUM(S10Table)=0,\"\",VLOOKUP(F$16&F$17,'TTHM GOAL CALC'!$A$642:$G$661,7,FALSE)))","v":""},{"$f":"IF(ISERROR(IF(SUM(S10Table)=0,\"\",VLOOKUP(G$16&G$17,'TTHM GOAL CALC'!$A$642:$G$661,7,FALSE))),\"\",IF(SUM(S10Table)=0,\"\",VLOOKUP(G$16&G$17,'TTHM GOAL CALC'!$A$642:$G$661,7,FALSE)))","v":""},{"$f":"IF(ISERROR(IF(SUM(S10Table)=0,\"\",VLOOKUP(H$16&H$17,'TTHM GOAL CALC'!$A$642:$G$661,7,FALSE))),\"\",IF(SUM(S10Table)=0,\"\",VLOOKUP(H$16&H$17,'TTHM GOAL CALC'!$A$642:$G$661,7,FALSE)))","v":""},{"$f":"IF(ISERROR(IF(SUM(S10Table)=0,\"\",VLOOKUP(I$16&I$17,'TTHM GOAL CALC'!$A$642:$G$661,7,FALSE))),\"\",IF(SUM(S10Table)=0,\"\",VLOOKUP(I$16&I$17,'TTHM GOAL CALC'!$A$642:$G$661,7,FALSE)))","v":""},{"$f":"IF(ISERROR(IF(SUM(S10Table)=0,\"\",VLOOKUP(J$16&J$17,'TTHM GOAL CALC'!$A$642:$G$661,7,FALSE))),\"\",IF(SUM(S10Table)=0,\"\",VLOOKUP(J$16&J$17,'TTHM GOAL CALC'!$A$642:$G$661,7,FALSE)))","v":""},{"$f":"IF(ISERROR(IF(SUM(S10Table)=0,\"\",VLOOKUP(K$16&K$17,'TTHM GOAL CALC'!$A$642:$G$661,7,FALSE))),\"\",IF(SUM(S10Table)=0,\"\",VLOOKUP(K$16&K$17,'TTHM GOAL CALC'!$A$642:$G$661,7,FALSE)))","v":""},{"$f":"IF(ISERROR(IF(SUM(S10Table)=0,\"\",VLOOKUP(L$16&L$17,'TTHM GOAL CALC'!$A$642:$G$661,7,FALSE))),\"\",IF(SUM(S10Table)=0,\"\",VLOOKUP(L$16&L$17,'TTHM GOAL CALC'!$A$642:$G$661,7,FALSE)))","v":""},{"$f":"IF(ISERROR(IF(SUM(S10Table)=0,\"\",VLOOKUP(M$16&M$17,'TTHM GOAL CALC'!$A$642:$G$661,7,FALSE))),\"\",IF(SUM(S10Table)=0,\"\",VLOOKUP(M$16&M$17,'TTHM GOAL CALC'!$A$642:$G$661,7,FALSE)))","v":""},{"$f":"IF(ISERROR(IF(SUM(S10Table)=0,\"\",VLOOKUP(N$16&N$17,'TTHM GOAL CALC'!$A$642:$G$661,7,FALSE))),\"\",IF(SUM(S10Table)=0,\"\",VLOOKUP(N$16&N$17,'TTHM GOAL CALC'!$A$642:$G$661,7,FALSE)))","v":""}]
[null,{"$f":"'Site 23'!J5","v":"Site 23"},{"$f":"IF(ISBLANK('Site 23'!$T$5),\"\",'Site 23'!$T$5)","v":""},{"$f":"IF(ISERROR(IF(SUM(S10Table)=0,\"\",VLOOKUP(D$16&D$17,'TTHM GOAL CALC'!$A$665:$G$684,7,FALSE))),\"\",IF(SUM(S10Table)=0,\"\",VLOOKUP(D$16&D$17,'TTHM GOAL CALC'!$A$665:$G$684,7,FALSE)))","v":""},{"$f":"IF(ISERROR(IF(SUM(S10Table)=0,\"\",VLOOKUP(E$16&E$17,'TTHM GOAL CALC'!$A$665:$G$684,7,FALSE))),\"\",IF(SUM(S10Table)=0,\"\",VLOOKUP(E$16&E$17,'TTHM GOAL CALC'!$A$665:$G$684,7,FALSE)))","v":""},{"$f":"IF(ISERROR(IF(SUM(S10Table)=0,\"\",VLOOKUP(F$16&F$17,'TTHM GOAL CALC'!$A$665:$G$684,7,FALSE))),\"\",IF(SUM(S10Table)=0,\"\",VLOOKUP(F$16&F$17,'TTHM GOAL CALC'!$A$665:$G$684,7,FALSE)))","v":""},{"$f":"IF(ISERROR(IF(SUM(S10Table)=0,\"\",VLOOKUP(G$16&G$17,'TTHM GOAL CALC'!$A$665:$G$684,7,FALSE))),\"\",IF(SUM(S10Table)=0,\"\",VLOOKUP(G$16&G$17,'TTHM GOAL CALC'!$A$665:$G$684,7,FALSE)))","v":""},{"$f":"IF(ISERROR(IF(SUM(S10Table)=0,\"\",VLOOKUP(H$16&H$17,'TTHM GOAL CALC'!$A$665:$G$684,7,FALSE))),\"\",IF(SUM(S10Table)=0,\"\",VLOOKUP(H$16&H$17,'TTHM GOAL CALC'!$A$665:$G$684,7,FALSE)))","v":""},{"$f":"IF(ISERROR(IF(SUM(S10Table)=0,\"\",VLOOKUP(I$16&I$17,'TTHM GOAL CALC'!$A$665:$G$684,7,FALSE))),\"\",IF(SUM(S10Table)=0,\"\",VLOOKUP(I$16&I$17,'TTHM GOAL CALC'!$A$665:$G$684,7,FALSE)))","v":""},{"$f":"IF(ISERROR(IF(SUM(S10Table)=0,\"\",VLOOKUP(J$16&J$17,'TTHM GOAL CALC'!$A$665:$G$684,7,FALSE))),\"\",IF(SUM(S10Table)=0,\"\",VLOOKUP(J$16&J$17,'TTHM GOAL CALC'!$A$665:$G$684,7,FALSE)))","v":""},{"$f":"IF(ISERROR(IF(SUM(S10Table)=0,\"\",VLOOKUP(K$16&K$17,'TTHM GOAL CALC'!$A$665:$G$684,7,FALSE))),\"\",IF(SUM(S10Table)=0,\"\",VLOOKUP(K$16&K$17,'TTHM GOAL CALC'!$A$665:$G$684,7,FALSE)))","v":""},{"$f":"IF(ISERROR(IF(SUM(S10Table)=0,\"\",VLOOKUP(L$16&L$17,'TTHM GOAL CALC'!$A$665:$G$684,7,FALSE))),\"\",IF(SUM(S10Table)=0,\"\",VLOOKUP(L$16&L$17,'TTHM GOAL CALC'!$A$665:$G$684,7,FALSE)))","v":""},{"$f":"IF(ISERROR(IF(SUM(S10Table)=0,\"\",VLOOKUP(M$16&M$17,'TTHM GOAL CALC'!$A$665:$G$684,7,FALSE))),\"\",IF(SUM(S10Table)=0,\"\",VLOOKUP(M$16&M$17,'TTHM GOAL CALC'!$A$665:$G$684,7,FALSE)))","v":""},{"$f":"IF(ISERROR(IF(SUM(S10Table)=0,\"\",VLOOKUP(N$16&N$17,'TTHM GOAL CALC'!$A$665:$G$684,7,FALSE))),\"\",IF(SUM(S10Table)=0,\"\",VLOOKUP(N$16&N$17,'TTHM GOAL CALC'!$A$665:$G$684,7,FALSE)))","v":""}]
[null,{"$f":"'Site 24'!J5","v":"Site 24"},{"$f":"IF(ISBLANK('Site 24'!$T$5),\"\",'Site 24'!$T$5)","v":""},{"$f":"IF(ISERROR(IF(SUM(S10Table)=0,\"\",VLOOKUP(D$16&D$17,'TTHM GOAL CALC'!$A$688:$G$707,7,FALSE))),\"\",IF(SUM(S10Table)=0,\"\",VLOOKUP(D$16&D$17,'TTHM GOAL CALC'!$A$688:$G$707,7,FALSE)))","v":""},{"$f":"IF(ISERROR(IF(SUM(S10Table)=0,\"\",VLOOKUP(E$16&E$17,'TTHM GOAL CALC'!$A$688:$G$707,7,FALSE))),\"\",IF(SUM(S10Table)=0,\"\",VLOOKUP(E$16&E$17,'TTHM GOAL CALC'!$A$688:$G$707,7,FALSE)))","v":""},{"$f":"IF(ISERROR(IF(SUM(S10Table)=0,\"\",VLOOKUP(F$16&F$17,'TTHM GOAL CALC'!$A$688:$G$707,7,FALSE))),\"\",IF(SUM(S10Table)=0,\"\",VLOOKUP(F$16&F$17,'TTHM GOAL CALC'!$A$688:$G$707,7,FALSE)))","v":""},{"$f":"IF(ISERROR(IF(SUM(S10Table)=0,\"\",VLOOKUP(G$16&G$17,'TTHM GOAL CALC'!$A$688:$G$707,7,FALSE))),\"\",IF(SUM(S10Table)=0,\"\",VLOOKUP(G$16&G$17,'TTHM GOAL CALC'!$A$688:$G$707,7,FALSE)))","v":""},{"$f":"IF(ISERROR(IF(SUM(S10Table)=0,\"\",VLOOKUP(H$16&H$17,'TTHM GOAL CALC'!$A$688:$G$707,7,FALSE))),\"\",IF(SUM(S10Table)=0,\"\",VLOOKUP(H$16&H$17,'TTHM GOAL CALC'!$A$688:$G$707,7,FALSE)))","v":""},{"$f":"IF(ISERROR(IF(SUM(S10Table)=0,\"\",VLOOKUP(I$16&I$17,'TTHM GOAL CALC'!$A$688:$G$707,7,FALSE))),\"\",IF(SUM(S10Table)=0,\"\",VLOOKUP(I$16&I$17,'TTHM GOAL CALC'!$A$688:$G$707,7,FALSE)))","v":""},{"$f":"IF(ISERROR(IF(SUM(S10Table)=0,\"\",VLOOKUP(J$16&J$17,'TTHM GOAL CALC'!$A$688:$G$707,7,FALSE))),\"\",IF(SUM(S10Table)=0,\"\",VLOOKUP(J$16&J$17,'TTHM GOAL CALC'!$A$688:$G$707,7,FALSE)))","v":""},{"$f":"IF(ISERROR(IF(SUM(S10Table)=0,\"\",VLOOKUP(K$16&K$17,'TTHM GOAL CALC'!$A$688:$G$707,7,FALSE))),\"\",IF(SUM(S10Table)=0,\"\",VLOOKUP(K$16&K$17,'TTHM GOAL CALC'!$A$688:$G$707,7,FALSE)))","v":""},{"$f":"IF(ISERROR(IF(SUM(S10Table)=0,\"\",VLOOKUP(L$16&L$17,'TTHM GOAL CALC'!$A$688:$G$707,7,FALSE))),\"\",IF(SUM(S10Table)=0,\"\",VLOOKUP(L$16&L$17,'TTHM GOAL CALC'!$A$688:$G$707,7,FALSE)))","v":""},{"$f":"IF(ISERROR(IF(SUM(S10Table)=0,\"\",VLOOKUP(M$16&M$17,'TTHM GOAL CALC'!$A$688:$G$707,7,FALSE))),\"\",IF(SUM(S10Table)=0,\"\",VLOOKUP(M$16&M$17,'TTHM GOAL CALC'!$A$688:$G$707,7,FALSE)))","v":""},{"$f":"IF(ISERROR(IF(SUM(S10Table)=0,\"\",VLOOKUP(N$16&N$17,'TTHM GOAL CALC'!$A$688:$G$707,7,FALSE))),\"\",IF(SUM(S10Table)=0,\"\",VLOOKUP(N$16&N$17,'TTHM GOAL CALC'!$A$688:$G$707,7,FALSE)))","v":""}]
[null,{"$f":"'Site 25'!J5","v":"Site 25"},{"$f":"IF(ISBLANK('Site 25'!$T$5),\"\",'Site 25'!$T$5)","v":""},{"$f":"IF(ISERROR(IF(SUM(S10Table)=0,\"\",VLOOKUP(D$16&D$17,'TTHM GOAL CALC'!$A$711:$G$730,7,FALSE))),\"\",IF(SUM(S10Table)=0,\"\",VLOOKUP(D$16&D$17,'TTHM GOAL CALC'!$A$711:$G$730,7,FALSE)))","v":""},{"$f":"IF(ISERROR(IF(SUM(S10Table)=0,\"\",VLOOKUP(E$16&E$17,'TTHM GOAL CALC'!$A$711:$G$730,7,FALSE))),\"\",IF(SUM(S10Table)=0,\"\",VLOOKUP(E$16&E$17,'TTHM GOAL CALC'!$A$711:$G$730,7,FALSE)))","v":""},{"$f":"IF(ISERROR(IF(SUM(S10Table)=0,\"\",VLOOKUP(F$16&F$17,'TTHM GOAL CALC'!$A$711:$G$730,7,FALSE))),\"\",IF(SUM(S10Table)=0,\"\",VLOOKUP(F$16&F$17,'TTHM GOAL CALC'!$A$711:$G$730,7,FALSE)))","v":""},{"$f":"IF(ISERROR(IF(SUM(S10Table)=0,\"\",VLOOKUP(G$16&G$17,'TTHM GOAL CALC'!$A$711:$G$730,7,FALSE))),\"\",IF(SUM(S10Table)=0,\"\",VLOOKUP(G$16&G$17,'TTHM GOAL CALC'!$A$711:$G$730,7,FALSE)))","v":""},{"$f":"IF(ISERROR(IF(SUM(S10Table)=0,\"\",VLOOKUP(H$16&H$17,'TTHM GOAL CALC'!$A$711:$G$730,7,FALSE))),\"\",IF(SUM(S10Table)=0,\"\",VLOOKUP(H$16&H$17,'TTHM GOAL CALC'!$A$711:$G$730,7,FALSE)))","v":""},{"$f":"IF(ISERROR(IF(SUM(S10Table)=0,\"\",VLOOKUP(I$16&I$17,'TTHM GOAL CALC'!$A$711:$G$730,7,FALSE))),\"\",IF(SUM(S10Table)=0,\"\",VLOOKUP(I$16&I$17,'TTHM GOAL CALC'!$A$711:$G$730,7,FALSE)))","v":""},{"$f":"IF(ISERROR(IF(SUM(S10Table)=0,\"\",VLOOKUP(J$16&J$17,'TTHM GOAL CALC'!$A$711:$G$730,7,FALSE))),\"\",IF(SUM(S10Table)=0,\"\",VLOOKUP(J$16&J$17,'TTHM GOAL CALC'!$A$711:$G$730,7,FALSE)))","v":""},{"$f":"IF(ISERROR(IF(SUM(S10Table)=0,\"\",VLOOKUP(K$16&K$17,'TTHM GOAL CALC'!$A$711:$G$730,7,FALSE))),\"\",IF(SUM(S10Table)=0,\"\",VLOOKUP(K$16&K$17,'TTHM GOAL CALC'!$A$711:$G$730,7,FALSE)))","v":""},{"$f":"IF(ISERROR(IF(SUM(S10Table)=0,\"\",VLOOKUP(L$16&L$17,'TTHM GOAL CALC'!$A$711:$G$730,7,FALSE))),\"\",IF(SUM(S10Table)=0,\"\",VLOOKUP(L$16&L$17,'TTHM GOAL CALC'!$A$711:$G$730,7,FALSE)))","v":""},{"$f":"IF(ISERROR(IF(SUM(S10Table)=0,\"\",VLOOKUP(M$16&M$17,'TTHM GOAL CALC'!$A$711:$G$730,7,FALSE))),\"\",IF(SUM(S10Table)=0,\"\",VLOOKUP(M$16&M$17,'TTHM GOAL CALC'!$A$711:$G$730,7,FALSE)))","v":""},{"$f":"IF(ISERROR(IF(SUM(S10Table)=0,\"\",VLOOKUP(N$16&N$17,'TTHM GOAL CALC'!$A$711:$G$730,7,FALSE))),\"\",IF(SUM(S10Table)=0,\"\",VLOOKUP(N$16&N$17,'TTHM GOAL CALC'!$A$711:$G$730,7,FALSE)))","v":""}]
[null,{"$f":"'Site 26'!J5","v":"Site 26"},{"$f":"IF(ISBLANK('Site 26'!$T$5),\"\",'Site 26'!$T$5)","v":""},{"$f":"IF(ISERROR(IF(SUM(S10Table)=0,\"\",VLOOKUP(D$16&D$17,'TTHM GOAL CALC'!$A$734:$G$753,7,FALSE))),\"\",IF(SUM(S10Table)=0,\"\",VLOOKUP(D$16&D$17,'TTHM GOAL CALC'!$A$734:$G$753,7,FALSE)))","v":""},{"$f":"IF(ISERROR(IF(SUM(S10Table)=0,\"\",VLOOKUP(E$16&E$17,'TTHM GOAL CALC'!$A$734:$G$753,7,FALSE))),\"\",IF(SUM(S10Table)=0,\"\",VLOOKUP(E$16&E$17,'TTHM GOAL CALC'!$A$734:$G$753,7,FALSE)))","v":""},{"$f":"IF(ISERROR(IF(SUM(S10Table)=0,\"\",VLOOKUP(F$16&F$17,'TTHM GOAL CALC'!$A$734:$G$753,7,FALSE))),\"\",IF(SUM(S10Table)=0,\"\",VLOOKUP(F$16&F$17,'TTHM GOAL CALC'!$A$734:$G$753,7,FALSE)))","v":""},{"$f":"IF(ISERROR(IF(SUM(S10Table)=0,\"\",VLOOKUP(G$16&G$17,'TTHM GOAL CALC'!$A$734:$G$753,7,FALSE))),\"\",IF(SUM(S10Table)=0,\"\",VLOOKUP(G$16&G$17,'TTHM GOAL CALC'!$A$734:$G$753,7,FALSE)))","v":""},{"$f":"IF(ISERROR(IF(SUM(S10Table)=0,\"\",VLOOKUP(H$16&H$17,'TTHM GOAL CALC'!$A$734:$G$753,7,FALSE))),\"\",IF(SUM(S10Table)=0,\"\",VLOOKUP(H$16&H$17,'TTHM GOAL CALC'!$A$734:$G$753,7,FALSE)))","v":""},{"$f":"IF(ISERROR(IF(SUM(S10Table)=0,\"\",VLOOKUP(I$16&I$17,'TTHM GOAL CALC'!$A$734:$G$753,7,FALSE))),\"\",IF(SUM(S10Table)=0,\"\",VLOOKUP(I$16&I$17,'TTHM GOAL CALC'!$A$734:$G$753,7,FALSE)))","v":""},{"$f":"IF(ISERROR(IF(SUM(S10Table)=0,\"\",VLOOKUP(J$16&J$17,'TTHM GOAL CALC'!$A$734:$G$753,7,FALSE))),\"\",IF(SUM(S10Table)=0,\"\",VLOOKUP(J$16&J$17,'TTHM GOAL CALC'!$A$734:$G$753,7,FALSE)))","v":""},{"$f":"IF(ISERROR(IF(SUM(S10Table)=0,\"\",VLOOKUP(K$16&K$17,'TTHM GOAL CALC'!$A$734:$G$753,7,FALSE))),\"\",IF(SUM(S10Table)=0,\"\",VLOOKUP(K$16&K$17,'TTHM GOAL CALC'!$A$734:$G$753,7,FALSE)))","v":""},{"$f":"IF(ISERROR(IF(SUM(S10Table)=0,\"\",VLOOKUP(L$16&L$17,'TTHM GOAL CALC'!$A$734:$G$753,7,FALSE))),\"\",IF(SUM(S10Table)=0,\"\",VLOOKUP(L$16&L$17,'TTHM GOAL CALC'!$A$734:$G$753,7,FALSE)))","v":""},{"$f":"IF(ISERROR(IF(SUM(S10Table)=0,\"\",VLOOKUP(M$16&M$17,'TTHM GOAL CALC'!$A$734:$G$753,7,FALSE))),\"\",IF(SUM(S10Table)=0,\"\",VLOOKUP(M$16&M$17,'TTHM GOAL CALC'!$A$734:$G$753,7,FALSE)))","v":""},{"$f":"IF(ISERROR(IF(SUM(S10Table)=0,\"\",VLOOKUP(N$16&N$17,'TTHM GOAL CALC'!$A$734:$G$753,7,FALSE))),\"\",IF(SUM(S10Table)=0,\"\",VLOOKUP(N$16&N$17,'TTHM GOAL CALC'!$A$734:$G$753,7,FALSE)))","v":""}]
[null,{"$f":"'Site 27'!J5","v":"Site 27"},{"$f":"IF(ISBLANK('Site 27'!$T$5),\"\",'Site 27'!$T$5)","v":""},{"$f":"IF(ISERROR(IF(SUM(S10Table)=0,\"\",VLOOKUP(D$16&D$17,'TTHM GOAL CALC'!$A$757:$G$776,7,FALSE))),\"\",IF(SUM(S10Table)=0,\"\",VLOOKUP(D$16&D$17,'TTHM GOAL CALC'!$A$757:$G$776,7,FALSE)))","v":""},{"$f":"IF(ISERROR(IF(SUM(S10Table)=0,\"\",VLOOKUP(E$16&E$17,'TTHM GOAL CALC'!$A$757:$G$776,7,FALSE))),\"\",IF(SUM(S10Table)=0,\"\",VLOOKUP(E$16&E$17,'TTHM GOAL CALC'!$A$757:$G$776,7,FALSE)))","v":""},{"$f":"IF(ISERROR(IF(SUM(S10Table)=0,\"\",VLOOKUP(F$16&F$17,'TTHM GOAL CALC'!$A$757:$G$776,7,FALSE))),\"\",IF(SUM(S10Table)=0,\"\",VLOOKUP(F$16&F$17,'TTHM GOAL CALC'!$A$757:$G$776,7,FALSE)))","v":""},{"$f":"IF(ISERROR(IF(SUM(S10Table)=0,\"\",VLOOKUP(G$16&G$17,'TTHM GOAL CALC'!$A$757:$G$776,7,FALSE))),\"\",IF(SUM(S10Table)=0,\"\",VLOOKUP(G$16&G$17,'TTHM GOAL CALC'!$A$757:$G$776,7,FALSE)))","v":""},{"$f":"IF(ISERROR(IF(SUM(S10Table)=0,\"\",VLOOKUP(H$16&H$17,'TTHM GOAL CALC'!$A$757:$G$776,7,FALSE))),\"\",IF(SUM(S10Table)=0,\"\",VLOOKUP(H$16&H$17,'TTHM GOAL CALC'!$A$757:$G$776,7,FALSE)))","v":""},{"$f":"IF(ISERROR(IF(SUM(S10Table)=0,\"\",VLOOKUP(I$16&I$17,'TTHM GOAL CALC'!$A$757:$G$776,7,FALSE))),\"\",IF(SUM(S10Table)=0,\"\",VLOOKUP(I$16&I$17,'TTHM GOAL CALC'!$A$757:$G$776,7,FALSE)))","v":""},{"$f":"IF(ISERROR(IF(SUM(S10Table)=0,\"\",VLOOKUP(J$16&J$17,'TTHM GOAL CALC'!$A$757:$G$776,7,FALSE))),\"\",IF(SUM(S10Table)=0,\"\",VLOOKUP(J$16&J$17,'TTHM GOAL CALC'!$A$757:$G$776,7,FALSE)))","v":""},{"$f":"IF(ISERROR(IF(SUM(S10Table)=0,\"\",VLOOKUP(K$16&K$17,'TTHM GOAL CALC'!$A$757:$G$776,7,FALSE))),\"\",IF(SUM(S10Table)=0,\"\",VLOOKUP(K$16&K$17,'TTHM GOAL CALC'!$A$757:$G$776,7,FALSE)))","v":""},{"$f":"IF(ISERROR(IF(SUM(S10Table)=0,\"\",VLOOKUP(L$16&L$17,'TTHM GOAL CALC'!$A$757:$G$776,7,FALSE))),\"\",IF(SUM(S10Table)=0,\"\",VLOOKUP(L$16&L$17,'TTHM GOAL CALC'!$A$757:$G$776,7,FALSE)))","v":""},{"$f":"IF(ISERROR(IF(SUM(S10Table)=0,\"\",VLOOKUP(M$16&M$17,'TTHM GOAL CALC'!$A$757:$G$776,7,FALSE))),\"\",IF(SUM(S10Table)=0,\"\",VLOOKUP(M$16&M$17,'TTHM GOAL CALC'!$A$757:$G$776,7,FALSE)))","v":""},{"$f":"IF(ISERROR(IF(SUM(S10Table)=0,\"\",VLOOKUP(N$16&N$17,'TTHM GOAL CALC'!$A$757:$G$776,7,FALSE))),\"\",IF(SUM(S10Table)=0,\"\",VLOOKUP(N$16&N$17,'TTHM GOAL CALC'!$A$757:$G$776,7,FALSE)))","v":""}]
[null,{"$f":"'Site 28'!J5","v":"Site 28"},{"$f":"IF(ISBLANK('Site 28'!$T$5),\"\",'Site 28'!$T$5)","v":""},{"$f":"IF(ISERROR(IF(SUM(S10Table)=0,\"\",VLOOKUP(D$16&D$17,'TTHM GOAL CALC'!$A$780:$G$799,7,FALSE))),\"\",IF(SUM(S10Table)=0,\"\",VLOOKUP(D$16&D$17,'TTHM GOAL CALC'!$A$780:$G$799,7,FALSE)))","v":""},{"$f":"IF(ISERROR(IF(SUM(S10Table)=0,\"\",VLOOKUP(E$16&E$17,'TTHM GOAL CALC'!$A$780:$G$799,7,FALSE))),\"\",IF(SUM(S10Table)=0,\"\",VLOOKUP(E$16&E$17,'TTHM GOAL CALC'!$A$780:$G$799,7,FALSE)))","v":""},{"$f":"IF(ISERROR(IF(SUM(S10Table)=0,\"\",VLOOKUP(F$16&F$17,'TTHM GOAL CALC'!$A$780:$G$799,7,FALSE))),\"\",IF(SUM(S10Table)=0,\"\",VLOOKUP(F$16&F$17,'TTHM GOAL CALC'!$A$780:$G$799,7,FALSE)))","v":""},{"$f":"IF(ISERROR(IF(SUM(S10Table)=0,\"\",VLOOKUP(G$16&G$17,'TTHM GOAL CALC'!$A$780:$G$799,7,FALSE))),\"\",IF(SUM(S10Table)=0,\"\",VLOOKUP(G$16&G$17,'TTHM GOAL CALC'!$A$780:$G$799,7,FALSE)))","v":""},{"$f":"IF(ISERROR(IF(SUM(S10Table)=0,\"\",VLOOKUP(H$16&H$17,'TTHM GOAL CALC'!$A$780:$G$799,7,FALSE))),\"\",IF(SUM(S10Table)=0,\"\",VLOOKUP(H$16&H$17,'TTHM GOAL CALC'!$A$780:$G$799,7,FALSE)))","v":""},{"$f":"IF(ISERROR(IF(SUM(S10Table)=0,\"\",VLOOKUP(I$16&I$17,'TTHM GOAL CALC'!$A$780:$G$799,7,FALSE))),\"\",IF(SUM(S10Table)=0,\"\",VLOOKUP(I$16&I$17,'TTHM GOAL CALC'!$A$780:$G$799,7,FALSE)))","v":""},{"$f":"IF(ISERROR(IF(SUM(S10Table)=0,\"\",VLOOKUP(J$16&J$17,'TTHM GOAL CALC'!$A$780:$G$799,7,FALSE))),\"\",IF(SUM(S10Table)=0,\"\",VLOOKUP(J$16&J$17,'TTHM GOAL CALC'!$A$780:$G$799,7,FALSE)))","v":""},{"$f":"IF(ISERROR(IF(SUM(S10Table)=0,\"\",VLOOKUP(K$16&K$17,'TTHM GOAL CALC'!$A$780:$G$799,7,FALSE))),\"\",IF(SUM(S10Table)=0,\"\",VLOOKUP(K$16&K$17,'TTHM GOAL CALC'!$A$780:$G$799,7,FALSE)))","v":""},{"$f":"IF(ISERROR(IF(SUM(S10Table)=0,\"\",VLOOKUP(L$16&L$17,'TTHM GOAL CALC'!$A$780:$G$799,7,FALSE))),\"\",IF(SUM(S10Table)=0,\"\",VLOOKUP(L$16&L$17,'TTHM GOAL CALC'!$A$780:$G$799,7,FALSE)))","v":""},{"$f":"IF(ISERROR(IF(SUM(S10Table)=0,\"\",VLOOKUP(M$16&M$17,'TTHM GOAL CALC'!$A$780:$G$799,7,FALSE))),\"\",IF(SUM(S10Table)=0,\"\",VLOOKUP(M$16&M$17,'TTHM GOAL CALC'!$A$780:$G$799,7,FALSE)))","v":""},{"$f":"IF(ISERROR(IF(SUM(S10Table)=0,\"\",VLOOKUP(N$16&N$17,'TTHM GOAL CALC'!$A$780:$G$799,7,FALSE))),\"\",IF(SUM(S10Table)=0,\"\",VLOOKUP(N$16&N$17,'TTHM GOAL CALC'!$A$780:$G$799,7,FALSE)))","v":""}]
[null,{"$f":"'Site 29'!J5","v":"Site 29"},{"$f":"IF(ISBLANK('Site 29'!$T$5),\"\",'Site 29'!$T$5)","v":""},{"$f":"IF(ISERROR(IF(SUM(S10Table)=0,\"\",VLOOKUP(D$16&D$17,'TTHM GOAL CALC'!$A$803:$G$822,7,FALSE))),\"\",IF(SUM(S10Table)=0,\"\",VLOOKUP(D$16&D$17,'TTHM GOAL CALC'!$A$803:$G$822,7,FALSE)))","v":""},{"$f":"IF(ISERROR(IF(SUM(S10Table)=0,\"\",VLOOKUP(E$16&E$17,'TTHM GOAL CALC'!$A$803:$G$822,7,FALSE))),\"\",IF(SUM(S10Table)=0,\"\",VLOOKUP(E$16&E$17,'TTHM GOAL CALC'!$A$803:$G$822,7,FALSE)))","v":""},{"$f":"IF(ISERROR(IF(SUM(S10Table)=0,\"\",VLOOKUP(F$16&F$17,'TTHM GOAL CALC'!$A$803:$G$822,7,FALSE))),\"\",IF(SUM(S10Table)=0,\"\",VLOOKUP(F$16&F$17,'TTHM GOAL CALC'!$A$803:$G$822,7,FALSE)))","v":""},{"$f":"IF(ISERROR(IF(SUM(S10Table)=0,\"\",VLOOKUP(G$16&G$17,'TTHM GOAL CALC'!$A$803:$G$822,7,FALSE))),\"\",IF(SUM(S10Table)=0,\"\",VLOOKUP(G$16&G$17,'TTHM GOAL CALC'!$A$803:$G$822,7,FALSE)))","v":""},{"$f":"IF(ISERROR(IF(SUM(S10Table)=0,\"\",VLOOKUP(H$16&H$17,'TTHM GOAL CALC'!$A$803:$G$822,7,FALSE))),\"\",IF(SUM(S10Table)=0,\"\",VLOOKUP(H$16&H$17,'TTHM GOAL CALC'!$A$803:$G$822,7,FALSE)))","v":""},{"$f":"IF(ISERROR(IF(SUM(S10Table)=0,\"\",VLOOKUP(I$16&I$17,'TTHM GOAL CALC'!$A$803:$G$822,7,FALSE))),\"\",IF(SUM(S10Table)=0,\"\",VLOOKUP(I$16&I$17,'TTHM GOAL CALC'!$A$803:$G$822,7,FALSE)))","v":""},{"$f":"IF(ISERROR(IF(SUM(S10Table)=0,\"\",VLOOKUP(J$16&J$17,'TTHM GOAL CALC'!$A$803:$G$822,7,FALSE))),\"\",IF(SUM(S10Table)=0,\"\",VLOOKUP(J$16&J$17,'TTHM GOAL CALC'!$A$803:$G$822,7,FALSE)))","v":""},{"$f":"IF(ISERROR(IF(SUM(S10Table)=0,\"\",VLOOKUP(K$16&K$17,'TTHM GOAL CALC'!$A$803:$G$822,7,FALSE))),\"\",IF(SUM(S10Table)=0,\"\",VLOOKUP(K$16&K$17,'TTHM GOAL CALC'!$A$803:$G$822,7,FALSE)))","v":""},{"$f":"IF(ISERROR(IF(SUM(S10Table)=0,\"\",VLOOKUP(L$16&L$17,'TTHM GOAL CALC'!$A$803:$G$822,7,FALSE))),\"\",IF(SUM(S10Table)=0,\"\",VLOOKUP(L$16&L$17,'TTHM GOAL CALC'!$A$803:$G$822,7,FALSE)))","v":""},{"$f":"IF(ISERROR(IF(SUM(S10Table)=0,\"\",VLOOKUP(M$16&M$17,'TTHM GOAL CALC'!$A$803:$G$822,7,FALSE))),\"\",IF(SUM(S10Table)=0,\"\",VLOOKUP(M$16&M$17,'TTHM GOAL CALC'!$A$803:$G$822,7,FALSE)))","v":""},{"$f":"IF(ISERROR(IF(SUM(S10Table)=0,\"\",VLOOKUP(N$16&N$17,'TTHM GOAL CALC'!$A$803:$G$822,7,FALSE))),\"\",IF(SUM(S10Table)=0,\"\",VLOOKUP(N$16&N$17,'TTHM GOAL CALC'!$A$803:$G$822,7,FALSE)))","v":""}]
[null,{"$f":"'Site 30'!J5","v":"Site 30"},{"$f":"IF(ISBLANK('Site 30'!$T$5),\"\",'Site 30'!$T$5)","v":""},{"$f":"IF(ISERROR(IF(SUM(S10Table)=0,\"\",VLOOKUP(D$16&D$17,'TTHM GOAL CALC'!$A$826:$G$845,7,FALSE))),\"\",IF(SUM(S10Table)=0,\"\",VLOOKUP(D$16&D$17,'TTHM GOAL CALC'!$A$826:$G$845,7,FALSE)))","v":""},{"$f":"IF(ISERROR(IF(SUM(S10Table)=0,\"\",VLOOKUP(E$16&E$17,'TTHM GOAL CALC'!$A$826:$G$845,7,FALSE))),\"\",IF(SUM(S10Table)=0,\"\",VLOOKUP(E$16&E$17,'TTHM GOAL CALC'!$A$826:$G$845,7,FALSE)))","v":""},{"$f":"IF(ISERROR(IF(SUM(S10Table)=0,\"\",VLOOKUP(F$16&F$17,'TTHM GOAL CALC'!$A$826:$G$845,7,FALSE))),\"\",IF(SUM(S10Table)=0,\"\",VLOOKUP(F$16&F$17,'TTHM GOAL CALC'!$A$826:$G$845,7,FALSE)))","v":""},{"$f":"IF(ISERROR(IF(SUM(S10Table)=0,\"\",VLOOKUP(G$16&G$17,'TTHM GOAL CALC'!$A$826:$G$845,7,FALSE))),\"\",IF(SUM(S10Table)=0,\"\",VLOOKUP(G$16&G$17,'TTHM GOAL CALC'!$A$826:$G$845,7,FALSE)))","v":""},{"$f":"IF(ISERROR(IF(SUM(S10Table)=0,\"\",VLOOKUP(H$16&H$17,'TTHM GOAL CALC'!$A$826:$G$845,7,FALSE))),\"\",IF(SUM(S10Table)=0,\"\",VLOOKUP(H$16&H$17,'TTHM GOAL CALC'!$A$826:$G$845,7,FALSE)))","v":""},{"$f":"IF(ISERROR(IF(SUM(S10Table)=0,\"\",VLOOKUP(I$16&I$17,'TTHM GOAL CALC'!$A$826:$G$845,7,FALSE))),\"\",IF(SUM(S10Table)=0,\"\",VLOOKUP(I$16&I$17,'TTHM GOAL CALC'!$A$826:$G$845,7,FALSE)))","v":""},{"$f":"IF(ISERROR(IF(SUM(S10Table)=0,\"\",VLOOKUP(J$16&J$17,'TTHM GOAL CALC'!$A$826:$G$845,7,FALSE))),\"\",IF(SUM(S10Table)=0,\"\",VLOOKUP(J$16&J$17,'TTHM GOAL CALC'!$A$826:$G$845,7,FALSE)))","v":""},{"$f":"IF(ISERROR(IF(SUM(S10Table)=0,\"\",VLOOKUP(K$16&K$17,'TTHM GOAL CALC'!$A$826:$G$845,7,FALSE))),\"\",IF(SUM(S10Table)=0,\"\",VLOOKUP(K$16&K$17,'TTHM GOAL CALC'!$A$826:$G$845,7,FALSE)))","v":""},{"$f":"IF(ISERROR(IF(SUM(S10Table)=0,\"\",VLOOKUP(L$16&L$17,'TTHM GOAL CALC'!$A$826:$G$845,7,FALSE))),\"\",IF(SUM(S10Table)=0,\"\",VLOOKUP(L$16&L$17,'TTHM GOAL CALC'!$A$826:$G$845,7,FALSE)))","v":""},{"$f":"IF(ISERROR(IF(SUM(S10Table)=0,\"\",VLOOKUP(M$16&M$17,'TTHM GOAL CALC'!$A$826:$G$845,7,FALSE))),\"\",IF(SUM(S10Table)=0,\"\",VLOOKUP(M$16&M$17,'TTHM GOAL CALC'!$A$826:$G$845,7,FALSE)))","v":""},{"$f":"IF(ISERROR(IF(SUM(S10Table)=0,\"\",VLOOKUP(N$16&N$17,'TTHM GOAL CALC'!$A$826:$G$845,7,FALSE))),\"\",IF(SUM(S10Table)=0,\"\",VLOOKUP(N$16&N$17,'TTHM GOAL CALC'!$A$826:$G$845,7,FALSE)))","v":""},null,"Formulas for labeling max. LRAA sites on LT charts",null,"Compliance Check"]
[null,{"$f":"B19","v":"Entry Point"},{"$f":"C19","v":""},"LRAA",null,null,{"$f":"IF(COUNT(D19:G19)<4,\"NA\",AVERAGE(D19:G19))","v":"NA"},{"$f":"IF(COUNT(E19:H19)<4,\"NA\",AVERAGE(E19:H19))","v":"NA"},"NA","NA","NA","NA","NA","NA",null,{"$f":"B49","v":"Entry Point"},{"$f":"IF($G$86=B49,B49,IF($H$86=B49,B49,IF($I$86=B49,B49,IF($J$86=B49,B49,IF($K$86=B49,B49,IF($L$86=B49,B49,IF($M$86=B49,B49,IF($N$86=B49,B49,\"\"))))))))","v":""},{"$f":"IF(C49=\"y\",N49,\"\")","v":""}]
[null,{"$f":"B20","v":"Site 2"},"","LRAA",null,null,{"$f":"IF(COUNT(D20:G20)<4,\"NA\",AVERAGE(D20:G20))","v":"NA"},{"$f":"IF(COUNT(E20:H20)<4,\"NA\",AVERAGE(E20:H20))","v":"NA"},{"$f":"IF(COUNT(F20:I20)<4,\"NA\",AVERAGE(F20:I20))","v":"NA"},{"$f":"IF(COUNT(G20:J20)<4,\"NA\",AVERAGE(G20:J20))","v":"NA"},{"$f":"IF(COUNT(H20:K20)<4,\"NA\",AVERAGE(H20:K20))","v":"NA"},{"$f":"IF(COUNT(I20:L20)<4,\"NA\",AVERAGE(I20:L20))","v":"NA"},{"$f":"IF(COUNT(J20:M20)<4,\"NA\",AVERAGE(J20:M20))","v":"NA"},{"$f":"IF(COUNT(K20:N20)<4,\"NA\",AVERAGE(K20:N20))","v":"NA"},null,"Site 2",{"$f":"IF($G$86=B50,B50,IF($H$86=B50,B50,IF($I$86=B50,B50,IF($J$86=B50,B50,IF($K$86=B50,B50,IF($L$86=B50,B50,IF($M$86=B50,B50,IF($N$86=B50,B50,\"\"))))))))","v":""},{"$f":"IF(C50=\"y\",N50,\"\")","v":""}]
[null,"Site 3","","LRAA",null,null,"NA","NA","NA","NA","NA","NA","NA","NA",null,"Site 3","",""]
[null,"Site 4","","LRAA",null,null,"NA","NA","NA","NA","NA","NA","NA","NA",null,"Site 4","",""]
[null,"Site 5","","LRAA",null,null,"NA","NA","NA","NA","NA","NA","NA",{"$f":"IF(COUNT(K23:N23)<4,\"NA\",AVERAGE(K23:N23))","v":"NA"},null,"Site 5","",""]
[null,"Site 6","","LRAA",null,null,"NA","NA","NA","NA","NA","NA","NA","NA",null,"Site 6","",""]
[null,"Site 7","","LRAA",null,null,"NA","NA","NA","NA","NA","NA","NA","NA",null,"Site 7","",""]
[null,"Site 8","","LRAA",null,null,"NA","NA","NA","NA","NA","NA","NA","NA",null,"Site 8","",""]
[null,"Site 9","","LRAA",null,null,{"$f":"IF(COUNT(D27:G27)<4,\"NA\",AVERAGE(D27:G27))","v":"NA"},"NA","NA","NA","NA","NA","NA","NA",null,"Site 9","",""]
[null,"Site 10","","LRAA",null,null,"NA","NA","NA","NA","NA","NA","NA","NA",null,"Site 10","",""]
[null,"Site 11","","LRAA",null,null,"NA","NA","NA","NA","NA","NA","NA","NA",null,"Site 11","",""]
[null,"Site 12","","LRAA",null,null,"NA","NA","NA","NA","NA","NA","NA","NA",null,"Site 12","",""]
[null,"Site 13","","LRAA",null,null,"NA","NA","NA","NA","NA","NA","NA","NA",null,"Site 13","",""]
[null,"Site 14","","LRAA",null,null,"NA","NA","NA","NA","NA","NA","NA","NA",null,"Site 14","",""]
[null,"Site 15","","LRAA",null,null,"NA","NA","NA","NA","NA","NA","NA","NA",null,"Site 15","",""]
[null,"Site 16","","LRAA",null,null,"NA","NA","NA","NA","NA","NA","NA","NA",null,"Site 16","",""]
[null,"Site 17","","LRAA",null,null,"NA","NA","NA","NA","NA","NA","NA","NA",null,"Site 17","",""]
[null,"Site 18","","LRAA",null,null,"NA","NA","NA","NA","NA","NA","NA","NA",null,"Site 18","",""]
[null,"Site 19","","LRAA",null,null,"NA","NA","NA","NA","NA","NA","NA","NA",null,"Site 19","",""]
[null,"Site 20","","LRAA",null,null,"NA","NA","NA","NA","NA","NA","NA","NA",null,"Site 20","",""]
[null,"Site 21","","LRAA",null,null,"NA","NA","NA","NA","NA","NA","NA","NA",null,"Site 21","",""]
[null,"Site 22","","LRAA",null,null,"NA","NA","NA","NA","NA","NA","NA","NA",null,"Site 22","",""]
[null,"Site 23","","LRAA",null,null,"NA","NA","NA","NA","NA","NA","NA","NA",null,"Site 23","",""]
[null,"Site 24","","LRAA",null,null,"NA","NA","NA","NA","NA","NA","NA","NA",null,"Site 24","",""]
[null,"Site 25","","LRAA",null,null,"NA","NA","NA","NA","NA","NA","NA","NA",null,"Site 25","",""]
[null,"Site 26","","LRAA",null,null,"NA","NA","NA","NA","NA","NA","NA","NA",null,"Site 26","",""]
[null,"Site 27","","LRAA",null,null,"NA","NA","NA","NA","NA","NA","NA","NA",null,"Site 27","",""]
[null,"Site 28","","LRAA",null,null,"NA","NA","NA","NA","NA","NA","NA","NA",null,"Site 28","",""]
[null,"Site 29","","LRAA",null,null,"NA","NA","NA","NA","NA","NA","NA","NA",null,"Site 29","",""]
[null,"Site 30","","LRAA",null,null,"NA","NA","NA","NA","NA","NA","NA","NA",null,"Site 30","",""]
[null,"Max LRAA",{"$f":"C49","v":""},null,null,null,{"$f":"IF(COUNT(G49:G78)=0,\"NA\",MAX(G49:G78))","v":"NA"},"NA","NA","NA","NA","NA","NA","NA",null,null,{"$f":"Q48&\" \"&Q49&\" \"&Q50&\" \"&Q51&\" \"&Q52&\" \"&Q53&\" \"&Q54&\" \"&Q55&\" \"&Q56&\" \"&Q57&\" \"&Q58&\" \"&Q59&\" \"&Q60&\" \"&Q61&\" \"&Q62&\" \"&Q63&\" \"&Q64&\" \"&Q65&\" \"&Q66&\" \"&Q67&\" \"&Q68&\" \"&Q69&\" \"&Q70&\" \"&Q71&\" \"&Q72&\" \"&Q73&\" \"&Q74&\" \"&Q75&\" \"&Q76&\" \"&Q77","v":"                             "}]
[null,"Avg of Max LRAAs",null,null,null,null,null,null,null,null,null,null,null,{"$f":"IF(COUNT(G79:N79)<8,\"NA\",AVERAGE(G79:N79))","v":"NA"}]
[]
[null,"Data for plotting"]
[null,"Avg of Max LRAAs",null,null,null,null,{"$f":"+$N$80","v":"NA"},"NA","NA","NA","NA","NA","NA","NA"]
[null,"Individual Site Goal",null,null,null,null,{"$f":"+$E$5","v":50},50,50,50,50,50,50,50]
[null,"Long-Term System Goal",null,null,null,null,{"$f":"+$E$6","v":40},40,40,40,40,40,40,40]
[null,null,null,null,null,null,{"$f":"IF(SUM(G49:G78)=0,\"\",(VLOOKUP(MAX(G49:G78),$G$49:$P$78,10,FALSE)))","v":""},{"$f":"IF(SUM(H49:H78)=0,\"\",VLOOKUP(MAX(H49:H78),$H$49:$P$78,9,FALSE))","v":""},{"$f":"IF(SUM(I49:I78)=0,\"\",VLOOKUP(MAX(I49:I78),$I$49:$P$78,8,FALSE))","v":""},{"$f":"IF(SUM(J49:J78)=0,\"\",VLOOKUP(MAX(J49:J78),$J$49:$P$78,7,FALSE))","v":""},{"$f":"IF(SUM(K49:K78)=0,\"\",VLOOKUP(MAX(K49:K78),$K$49:$P$78,6,FALSE))","v":""},{"$f":"IF(SUM(L49:L78)=0,\"\",VLOOKUP(MAX(L49:L78),$L$49:$P$78,5,FALSE))","v":""},{"$f":"IF(SUM(M49:M78)=0,\"\",VLOOKUP(MAX(M49:M78),$M$49:$P$78,4,FALSE))","v":""},{"$f":"IF(SUM(N49:N78)=0,\"\",VLOOKUP(MAX(N49:N78),$N$49:$P$78,3,FALSE))","v":""}]
[]
[null,{"$f":"B19","v":"Entry Point"},null,"HAA5 Goal",null,null,{"$f":"'Site 1'!$M$7","v":15},{"$f":"'Site 1'!$M$7","v":15},{"$f":"'Site 1'!$M$7","v":15},{"$f":"'Site 1'!$M$7","v":15},{"$f":"'Site 1'!$M$7","v":15},{"$f":"'Site 1'!$M$7","v":15},{"$f":"'Site 1'!$M$7","v":15},{"$f":"'Site 1'!$M$7","v":15}]
[null,{"$f":"B20","v":"Site 2"},null,"HAA5 Goal",null,null,{"$f":"'Site 2'!$M$7","v":0},{"$f":"'Site 2'!$M$7","v":0},{"$f":"'Site 2'!$M$7","v":0},{"$f":"'Site 2'!$M$7","v":0},{"$f":"'Site 2'!$M$7","v":0},{"$f":"'Site 2'!$M$7","v":0},{"$f":"'Site 2'!$M$7","v":0},{"$f":"'Site 2'!$M$7","v":0}]
[null,"Site 3",null,"HAA5 Goal",null,null,{"$f":"'Site 3'!$M$7","v":0},{"$f":"'Site 3'!$M$7","v":0},{"$f":"'Site 3'!$M$7","v":0},{"$f":"'Site 3'!$M$7","v":0},{"$f":"'Site 3'!$M$7","v":0},{"$f":"'Site 3'!$M$7","v":0},{"$f":"'Site 3'!$M$7","v":0},{"$f":"'Site 3'!$M$7","v":0}]
[null,"Site 4",null,"HAA5 Goal",null,null,{"$f":"'Site 4'!$M$7","v":0},{"$f":"'Site 4'!$M$7","v":0},{"$f":"'Site 4'!$M$7","v":0},{"$f":"'Site 4'!$M$7","v":0},{"$f":"'Site 4'!$M$7","v":0},{"$f":"'Site 4'!$M$7","v":0},{"$f":"'Site 4'!$M$7","v":0},{"$f":"'Site 4'!$M$7","v":0}]
[null,"Site 5",null,"HAA5 Goal",null,null,{"$f":"'Site 5'!$M$7","v":0},{"$f":"'Site 5'!$M$7","v":0},{"$f":"'Site 5'!$M$7","v":0},{"$f":"'Site 5'!$M$7","v":0},{"$f":"'Site 5'!$M$7","v":0},{"$f":"'Site 5'!$M$7","v":0},{"$f":"'Site 5'!$M$7","v":0},{"$f":"'Site 5'!$M$7","v":0}]
[null,"Site 6",null,"HAA5 Goal",null,null,{"$f":"'Site 6'!$M$7","v":0},{"$f":"'Site 6'!$M$7","v":0},{"$f":"'Site 6'!$M$7","v":0},{"$f":"'Site 6'!$M$7","v":0},{"$f":"'Site 6'!$M$7","v":0},{"$f":"'Site 6'!$M$7","v":0},{"$f":"'Site 6'!$M$7","v":0},{"$f":"'Site 6'!$M$7","v":0}]
[null,"Site 7",null,"HAA5 Goal",null,null,{"$f":"'Site 7'!$M$7","v":0},{"$f":"'Site 7'!$M$7","v":0},{"$f":"'Site 7'!$M$7","v":0},{"$f":"'Site 7'!$M$7","v":0},{"$f":"'Site 7'!$M$7","v":0},{"$f":"'Site 7'!$M$7","v":0},{"$f":"'Site 7'!$M$7","v":0},{"$f":"'Site 7'!$M$7","v":0}]
[null,"Site 8",null,"HAA5 Goal",null,null,{"$f":"'Site 8'!$M$7","v":0},{"$f":"'Site 8'!$M$7","v":0},{"$f":"'Site 8'!$M$7","v":0},{"$f":"'Site 8'!$M$7","v":0},{"$f":"'Site 8'!$M$7","v":0},{"$f":"'Site 8'!$M$7","v":0},{"$f":"'Site 8'!$M$7","v":0},{"$f":"'Site 8'!$M$7","v":0}]
[null,"Site 9",null,"HAA5 Goal",null,null,{"$f":"'Site 9'!$M$7","v":0},{"$f":"'Site 9'!$M$7","v":0},{"$f":"'Site 9'!$M$7","v":0},{"$f":"'Site 9'!$M$7","v":0},{"$f":"'Site 9'!$M$7","v":0},{"$f":"'Site 9'!$M$7","v":0},{"$f":"'Site 9'!$M$7","v":0},{"$f":"'Site 9'!$M$7","v":0}]
[null,"Site 10",null,"HAA5 Goal",null,null,{"$f":"'Site 10'!$M$7","v":0},{"$f":"'Site 10'!$M$7","v":0},{"$f":"'Site 10'!$M$7","v":0},{"$f":"'Site 10'!$M$7","v":0},{"$f":"'Site 10'!$M$7","v":0},{"$f":"'Site 10'!$M$7","v":0},{"$f":"'Site 10'!$M$7","v":0},{"$f":"'Site 10'!$M$7","v":0}]
[null,"Site 11",null,"HAA5 Goal",null,null,{"$f":"'Site 11'!$M$7","v":0},{"$f":"'Site 11'!$M$7","v":0},{"$f":"'Site 11'!$M$7","v":0},{"$f":"'Site 11'!$M$7","v":0},{"$f":"'Site 11'!$M$7","v":0},{"$f":"'Site 11'!$M$7","v":0},{"$f":"'Site 11'!$M$7","v":0},{"$f":"'Site 11'!$M$7","v":0}]
[null,"Site 12",null,"HAA5 Goal",null,null,{"$f":"'Site 12'!$M$7","v":0},{"$f":"'Site 12'!$M$7","v":0},{"$f":"'Site 12'!$M$7","v":0},{"$f":"'Site 12'!$M$7","v":0},{"$f":"'Site 12'!$M$7","v":0},{"$f":"'Site 12'!$M$7","v":0},{"$f":"'Site 12'!$M$7","v":0},{"$f":"'Site 12'!$M$7","v":0}]
[null,"Site 13",null,"HAA5 Goal",null,null,{"$f":"'Site 13'!$M$7","v":0},{"$f":"'Site 13'!$M$7","v":0},{"$f":"'Site 13'!$M$7","v":0},{"$f":"'Site 13'!$M$7","v":0},{"$f":"'Site 13'!$M$7","v":0},{"$f":"'Site 13'!$M$7","v":0},{"$f":"'Site 13'!$M$7","v":0},{"$f":"'Site 13'!$M$7","v":0}]
[null,"Site 14",null,"HAA5 Goal",null,null,{"$f":"'Site 14'!$M$7","v":0},{"$f":"'Site 14'!$M$7","v":0},{"$f":"'Site 14'!$M$7","v":0},{"$f":"'Site 14'!$M$7","v":0},{"$f":"'Site 14'!$M$7","v":0},{"$f":"'Site 14'!$M$7","v":0},{"$f":"'Site 14'!$M$7","v":0},{"$f":"'Site 14'!$M$7","v":0}]
[null,"Site 15",null,"HAA5 Goal",null,null,{"$f":"'Site 15'!$M$7","v":0},{"$f":"'Site 15'!$M$7","v":0},{"$f":"'Site 15'!$M$7","v":0},{"$f":"'Site 15'!$M$7","v":0},{"$f":"'Site 15'!$M$7","v":0},{"$f":"'Site 15'!$M$7","v":0},{"$f":"'Site 15'!$M$7","v":0},{"$f":"'Site 15'!$M$7","v":0}]
[null,"Site 16",null,"HAA5 Goal",null,null,{"$f":"'Site 16'!$M$7","v":0},{"$f":"'Site 16'!$M$7","v":0},{"$f":"'Site 16'!$M$7","v":0},{"$f":"'Site 16'!$M$7","v":0},{"$f":"'Site 16'!$M$7","v":0},{"$f":"'Site 16'!$M$7","v":0},{"$f":"'Site 16'!$M$7","v":0},{"$f":"'Site 16'!$M$7","v":0}]
[null,"Site 17",null,"HAA5 Goal",null,null,{"$f":"'Site 17'!$M$7","v":0},{"$f":"'Site 17'!$M$7","v":0},{"$f":"'Site 17'!$M$7","v":0},{"$f":"'Site 17'!$M$7","v":0},{"$f":"'Site 17'!$M$7","v":0},{"$f":"'Site 17'!$M$7","v":0},{"$f":"'Site 17'!$M$7","v":0},{"$f":"'Site 17'!$M$7","v":0}]
[null,"Site 18",null,"HAA5 Goal",null,null,{"$f":"'Site 18'!$M$7","v":0},{"$f":"'Site 18'!$M$7","v":0},{"$f":"'Site 18'!$M$7","v":0},{"$f":"'Site 18'!$M$7","v":0},{"$f":"'Site 18'!$M$7","v":0},{"$f":"'Site 18'!$M$7","v":0},{"$f":"'Site 18'!$M$7","v":0},{"$f":"'Site 18'!$M$7","v":0}]
[null,"Site 19",null,"HAA5 Goal",null,null,{"$f":"'Site 19'!$M$7","v":0},{"$f":"'Site 19'!$M$7","v":0},{"$f":"'Site 19'!$M$7","v":0},{"$f":"'Site 19'!$M$7","v":0},{"$f":"'Site 19'!$M$7","v":0},{"$f":"'Site 19'!$M$7","v":0},{"$f":"'Site 19'!$M$7","v":0},{"$f":"'Site 19'!$M$7","v":0}]
[null,"Site 20",null,"HAA5 Goal",null,null,{"$f":"'Site 20'!$M$7","v":0},{"$f":"'Site 20'!$M$7","v":0},{"$f":"'Site 20'!$M$7","v":0},{"$f":"'Site 20'!$M$7","v":0},{"$f":"'Site 20'!$M$7","v":0},{"$f":"'Site 20'!$M$7","v":0},{"$f":"'Site 20'!$M$7","v":0},{"$f":"'Site 20'!$M$7","v":0}]
[null,"Site 21",null,"HAA5 Goal",null,null,{"$f":"'Site 21'!$M$7","v":0},{"$f":"'Site 21'!$M$7","v":0},{"$f":"'Site 21'!$M$7","v":0},{"$f":"'Site 21'!$M$7","v":0},{"$f":"'Site 21'!$M$7","v":0},{"$f":"'Site 21'!$M$7","v":0},{"$f":"'Site 21'!$M$7","v":0},{"$f":"'Site 21'!$M$7","v":0}]
[null,"Site 22",null,"HAA5 Goal",null,null,{"$f":"'Site 22'!$M$7","v":0},{"$f":"'Site 22'!$M$7","v":0},{"$f":"'Site 22'!$M$7","v":0},{"$f":"'Site 22'!$M$7","v":0},{"$f":"'Site 22'!$M$7","v":0},{"$f":"'Site 22'!$M$7","v":0},{"$f":"'Site 22'!$M$7","v":0},{"$f":"'Site 22'!$M$7","v":0}]
[null,"Site 23",null,"HAA5 Goal",null,null,{"$f":"'Site 23'!$M$7","v":0},{"$f":"'Site 23'!$M$7","v":0},{"$f":"'Site 23'!$M$7","v":0},{"$f":"'Site 23'!$M$7","v":0},{"$f":"'Site 23'!$M$7","v":0},{"$f":"'Site 23'!$M$7","v":0},{"$f":"'Site 23'!$M$7","v":0},{"$f":"'Site 23'!$M$7","v":0}]
[null,"Site 24",null,"HAA5 Goal",null,null,{"$f":"'Site 24'!$M$7","v":0},{"$f":"'Site 24'!$M$7","v":0},{"$f":"'Site 24'!$M$7","v":0},{"$f":"'Site 24'!$M$7","v":0},{"$f":"'Site 24'!$M$7","v":0},{"$f":"'Site 24'!$M$7","v":0},{"$f":"'Site 24'!$M$7","v":0},{"$f":"'Site 24'!$M$7","v":0}]
[null,"Site 25",null,"HAA5 Goal",null,null,{"$f":"'Site 25'!$M$7","v":0},{"$f":"'Site 25'!$M$7","v":0},{"$f":"'Site 25'!$M$7","v":0},{"$f":"'Site 25'!$M$7","v":0},{"$f":"'Site 25'!$M$7","v":0},{"$f":"'Site 25'!$M$7","v":0},{"$f":"'Site 25'!$M$7","v":0},{"$f":"'Site 25'!$M$7","v":0}]
[null,"Site 26",null,"HAA5 Goal",null,null,{"$f":"'Site 26'!$M$7","v":0},{"$f":"'Site 26'!$M$7","v":0},{"$f":"'Site 26'!$M$7","v":0},{"$f":"'Site 26'!$M$7","v":0},{"$f":"'Site 26'!$M$7","v":0},{"$f":"'Site 26'!$M$7","v":0},{"$f":"'Site 26'!$M$7","v":0},{"$f":"'Site 26'!$M$7","v":0}]
[null,"Site 27",null,"HAA5 Goal",null,null,{"$f":"'Site 27'!$M$7","v":0},{"$f":"'Site 27'!$M$7","v":0},{"$f":"'Site 27'!$M$7","v":0},{"$f":"'Site 27'!$M$7","v":0},{"$f":"'Site 27'!$M$7","v":0},{"$f":"'Site 27'!$M$7","v":0},{"$f":"'Site 27'!$M$7","v":0},{"$f":"'Site 27'!$M$7","v":0}]
[null,"Site 28",null,"HAA5 Goal",null,null,{"$f":"'Site 28'!$M$7","v":0},{"$f":"'Site 28'!$M$7","v":0},{"$f":"'Site 28'!$M$7","v":0},{"$f":"'Site 28'!$M$7","v":0},{"$f":"'Site 28'!$M$7","v":0},{"$f":"'Site 28'!$M$7","v":0},{"$f":"'Site 28'!$M$7","v":0},{"$f":"'Site 28'!$M$7","v":0}]
[null,"Site 29",null,"HAA5 Goal",null,null,{"$f":"'Site 29'!$M$7","v":0},{"$f":"'Site 29'!$M$7","v":0},{"$f":"'Site 29'!$M$7","v":0},{"$f":"'Site 29'!$M$7","v":0},{"$f":"'Site 29'!$M$7","v":0},{"$f":"'Site 29'!$M$7","v":0},{"$f":"'Site 29'!$M$7","v":0},{"$f":"'Site 29'!$M$7","v":0}]
[null,"Site 30",null,"HAA5 Goal",null,null,{"$f":"'Site 30'!$M$7","v":0},{"$f":"'Site 30'!$M$7","v":0},{"$f":"'Site 30'!$M$7","v":0},{"$f":"'Site 30'!$M$7","v":0},{"$f":"'Site 30'!$M$7","v":0},{"$f":"'Site 30'!$M$7","v":0},{"$f":"'Site 30'!$M$7","v":0},{"$f":"'Site 30'!$M$7","v":0}]

{"sheet":"LT GOAL SMRY","index":42,"n_rows":2,"n_cols":1,"rows_kept":2,"cut":false,"hidden":true,"merged":[]}
[]
["Long-Term System Goal Assessment"]

{"sheet":"Example","index":43,"n_rows":144,"n_cols":28,"rows_kept":144,"cut":false,"hidden":true,"merged":[[60,1,61,12],[60,16,61,27],[115,16,116,27],[143,16,144,27],[143,1,144,12],[115,1,116,12]]}
[null,"DBP Goals Example "]
[]
[null,"Data in red is inputted by user.   DBP data should be entered in units of ppb or ug/L"]
[null,"Data in black is calculated.  NOTE: \"NA\" will appear if not enough data are inputted for calculation."]
[]
[null,"TTHM Data",null,null,null,null,null,null,null,null,null,null,null,null,null,null,"HAA5 Data"]
[null,"Yellow","highlighted LRAA exceeds TTHM Individual Site Goal (i.e., LRAA is > 80 ppb) for that quarter",null,null,null,null,null,null,null,null,null,null,null,null,null,"Yellow","highlighted LRAA exceeds HAA5 Individual Site Goal (i.e., LRAA is > 60 ppb) for that quarter"]
[null,"Blue","highlighted LRAA is the max LRAA for that quarter; unless the LRAA is > 80 ppb (see above)",null,null,null,null,null,null,null,null,null,null,null,null,null,"Blue","highlighted LRAA is the max LRAA for that quarter; unless the LRAA is > 60 ppb (see above)"]
[null,"Green","highlighted data exceeds the TTHM Long-Term System Goal (i.e., avg Max LRAAs > 60 ppb)",null,null,null,null,null,null,null,null,null,null,null,null,null,"Green","highlighted data exceeds the HAA5 Long-Term System Goal (i.e., avg Max LRAAs > 40 ppb)"]
[]
[null,"System:","A ",null,"Comments:","example system with 8 DBP sample sites & 11 quarters of data",null,null,null,null,null,null,null,null,null,null,"System:","A ",null,"Comments:","example system with 8 DBP sample sites & 11 quarters of data"]
[null,"Enter Starting Quarter:",null,null,4,null,null,null,null,null,null,null,null,null,null,null,"Enter Starting Quarter:",null,null,4]
[null,"Enter Starting Year:",null,null,2002,null,null,null,null,null,null,null,null,null,null,null,"Enter Starting Year:",null,null,2002]
[null,"qtr",{"$f":"+E12","v":4},{"$f":"IF(C14<4,C14+1,IF(C14=4,1,4))","v":1},{"$f":"IF(D14<4,D14+1,IF(D14=4,1,4))","v":2},3,4,1,2,3,4,1,2,null,null,null,"qtr",{"$f":"+T12","v":4},{"$f":"IF(R14<4,R14+1,IF(R14=4,1,4))","v":1},{"$f":"IF(S14<4,S14+1,IF(S14=4,1,4))","v":2},3,4,1,2,3,4,1,2]
[null,"year",{"$f":"+E13","v":2002},{"$f":"IF(C14<=3,C15,C15+1)","v":2003},{"$f":"IF(D14<=3,D15,D15+1)","v":2003},{"$f":"IF(E14<=3,E15,E15+1)","v":2003},2003,2004,2004,2004,2004,2005,2005,null,null,null,"year",{"$f":"+T13","v":2002},{"$f":"IF(R14<=3,R15,R15+1)","v":2003},2003,2003,2003,2004,2004,2004,2004,2005,2005]
[null,"Sample Location",{"$f":"\"Q\"&C14&\" \"&C15","v":"Q4 2002"},"Q1 2003","Q2 2003","Q3 2003","Q4 2003","Q1 2004","Q2 2004","Q3 2004","Q4 2004","Q1 2005","Q2 2005",null,null,null,"Sample Location",{"$f":"\"Q\"&R14&\" \"&R15","v":"Q4 2002"},"Q1 2003","Q2 2003","Q3 2003","Q4 2003","Q1 2004","Q2 2004","Q3 2004","Q4 2004","Q1 2005","Q2 2005"]
[null,"Site 1",100,115,75,55,56,60,55,60,70,85,60,null,null,null,"Site 1",34,32,33,17,44,43,48,11,24,2,20]
[null,"Site 2",54.6,85,60,21,60,93,50,20.7,31,29.3,30,null,null,null,"Site 2",33,37,30,26,37,52,59,12,22,15.47,17]
[null,"Site 3",48.9,58.6,43.9,22.5,80,95,48.3,19.5,29.8,32.799999999999997,42,null,null,null,"Site 3",31,31,30,20,42,46,76,12,25,13.97,70]
[null,"Site 4",77.599999999999994,73.400000000000006,95.95,42.8,57.8,82.2,63.6,45.7,82.3,72.900000000000006,62,null,null,null,"Site 4",51,27,54,45,44,74,69,35,25,13.27,29]
[null,"Site 5",55,85,75,30,70,99,65,75,85,90,60,null,null,null,"Site 5",39,37,38,22,49,48,53,16,29,7,25]
[null,"Site 6",60,60,73,60,75,90,55,72,66,80,55,null,null,null,"Site 6",38,42,35,31,42,57,64,17,27,20.47,22]
[null,"Site 7",35,38,65,70,85,100,50,70,95,110,72,null,null,null,"Site 7",36,36,35,25,47,51,81,17,30,18.97,75]
[null,"Site 8",20,25,55,75,80,85,90,70,81,90,75,null,null,null,"Site 8",56,32,59,50,49,79,74,40,30,18.27,34]
[null,{"$f":"+B17","v":"Site 1"},"LRAA",null,null,{"$f":"IF(COUNT(C17:F17)<4,\"NA\",AVERAGE(C17:F17))","v":86.25},{"$f":"IF(COUNT(D17:G17)<4,\"NA\",AVERAGE(D17:G17))","v":75.25},61.5,56.5,57.75,61.25,67.5,68.75,null,null,null,{"$f":"+Q17","v":"Site 1"},"LRAA",null,null,{"$f":"IF(COUNT(R17:U17)<4,\"NA\",AVERAGE(R17:U17))","v":29},{"$f":"IF(COUNT(S17:V17)<4,\"NA\",AVERAGE(S17:V17))","v":31.5},34.25,38,36.5,31.5,21.25,14.25]
[null,{"$f":"+B18","v":"Site 2"},"LRAA",null,null,{"$f":"IF(COUNT(C18:F18)<4,\"NA\",AVERAGE(C18:F18))","v":55.15},56.5,58.5,56,55.924999999999997,48.674999999999997,32.75,27.75,null,null,null,{"$f":"+Q18","v":"Site 2"},"LRAA",null,null,{"$f":"IF(COUNT(R18:U18)<4,\"NA\",AVERAGE(R18:U18))","v":31.5},32.5,36.25,43.5,40,36.25,27.1175,16.6175]
[null,"Site 3","LRAA",null,null,43.475000000000001,51.25,60.35,61.45,60.7,48.150000000000006,32.599999999999994,31.024999999999999,null,null,null,"Site 3","LRAA",null,null,28,30.75,34.5,46,44,39.75,31.7425,30.2425]
[null,"Site 4","LRAA",null,null,72.4375,67.487500000000011,69.6875,61.6,62.325000000000003,68.45,66.125,65.724999999999994,null,null,null,"Site 4","LRAA",null,null,44.25,42.5,54.25,58,55.5,50.75,35.567500000000003,25.567499999999999]
[null,"Site 5","LRAA",null,null,61.25,65,68.5,66,77.25,81,78.75,77.5,null,null,null,"Site 5","LRAA",null,null,34,36.5,39.25,43,41.5,36.5,26.25,19.25]
[null,"Site 6","LRAA",null,null,63.25,67,74.5,70,73,70.75,68.25,68.25,null,null,null,"Site 6","LRAA",null,null,36.5,37.5,41.25,48.5,45,41.25,32.1175,21.6175]
[null,"Site 7","LRAA",null,null,52,64.5,80,76.25,76.25,78.75,81.25,86.75,null,null,null,"Site 7","LRAA",null,null,33,35.75,39.5,51,49,44.75,36.7425,35.2425]
[null,"Site 8","LRAA",null,null,43.75,58.75,73.75,82.5,81.25,81.5,82.75,79,null,null,null,"Site 8","LRAA",null,null,49.25,47.5,59.25,63,60.5,55.75,40.567500000000003,30.567499999999999]
[null,"Max LRAA",null,null,null,{"$f":"IF(COUNT(F25:F32)=0,\"NA\",MAX(F25:F32))","v":86.25},75.25,80,82.5,81.25,81.5,82.75,86.75,null,null,null,"Max LRAA",null,null,null,{"$f":"IF(COUNT(U25:U32)=0,\"NA\",MAX(U25:U32))","v":49.25},{"$f":"IF(COUNT(V25:V32)=0,\"NA\",MAX(V25:V32))","v":47.5},59.25,63,60.5,55.75,40.567500000000003,35.2425]
[null,"Avg of Max LRAAs",null,null,null,null,null,null,null,null,null,null,{"$f":"IF(COUNT(F33:M33)<8,\"NA\",AVERAGE(F33:M33))","v":82.03125},null,null,null,"Avg of Max LRAAs",null,null,null,null,null,null,null,null,null,null,{"$f":"IF(COUNT(U33:AB33)<8,\"NA\",AVERAGE(U33:AB33))","v":51.3825}]
[]
[]
[null,"System:","B",null,"Comments:","example system without 11 quarters of data",null,null,null,null,null,null,null,null,null,null,"System:","B",null,"Comments:","example system without 11 quarters of data"]
[null,"Enter Starting Quarter:",null,null,4,null,null,null,null,null,null,null,null,null,null,null,"Enter Starting Quarter:",null,null,4]
[null,"Enter Starting Year:",null,null,2002,null,null,null,null,null,null,null,null,null,null,null,"Enter Starting Year:",null,null,2002]
[null,"qtr",{"$f":"+E38","v":4},{"$f":"IF(C40<4,C40+1,IF(C40=4,1,4))","v":1},{"$f":"IF(D40<4,D40+1,IF(D40=4,1,4))","v":2},3,4,1,2,3,4,1,2,null,null,null,"qtr",{"$f":"+T38","v":4},{"$f":"IF(R40<4,R40+1,IF(R40=4,1,4))","v":1},{"$f":"IF(S40<4,S40+1,IF(S40=4,1,4))","v":2},3,4,1,2,3,4,1,2]
[null,"year",{"$f":"+E39","v":2002},{"$f":"IF(C40<=3,C41,C41+1)","v":2003},2003,2003,2003,2004,2004,2004,2004,2005,2005,null,null,null,"year",{"$f":"+T39","v":2002},{"$f":"IF(R40<=3,R41,R41+1)","v":2003},2003,2003,2003,2004,2004,2004,2004,2005,2005]
[null,"Sample Location",{"$f":"\"Q\"&C40&\" \"&C41","v":"Q4 2002"},"Q1 2003","Q2 2003","Q3 2003","Q4 2003","Q1 2004","Q2 2004","Q3 2004","Q4 2004","Q1 2005","Q2 2005",null,null,null,"Sample Location",{"$f":"\"Q\"&R40&\" \"&R41","v":"Q4 2002"},"Q1 2003","Q2 2003","Q3 2003","Q4 2003","Q1 2004","Q2 2004","Q3 2004","Q4 2004","Q1 2005","Q2 2005"]
[null,"Site 1",null,120,72,35.200000000000003,54,66,49,56,72,88,50,null,null,null,"Site 1",null,37,30,40,42,49,42,7,26,5,10]
[null,"Site 2",null,90,57,40.700000000000003,58,99,44,16.7,33,32.299999999999997,20,null,null,null,"Site 2",null,42,27,45.7,35,58,53,8,24,18.47,7]
[null,"Site 3",null,63.6,40.9,34.1,78,101,42.3,15.5,31.8,35.799999999999997,32,null,null,null,"Site 3",null,36,27,31.6,40,52,90,30,50,80,60]
[null,"Site 4",null,78.400000000000006,92.95,29.7,55.8,88.2,57.6,41.7,84.3,75.900000000000006,52,null,null,null,"Site 4",null,32,51,31.9,42,80,63,31,27,16.27,19]
[null,"Site 5",null,90,72,40.700000000000003,68,105,59,71,87,93,50,null,null,null,"Site 5",null,42,35,32.700000000000003,47,54,47,12,31,10,15]
[null,"Site 6",null,65,70,46.2,73,96,49,68,68,83,45,null,null,null,"Site 6",null,47,32,17.2,40,63,58,13,29,23.47,12]
[null,"Site 7",null,43,62,39.6,83,106,44,66,97,113,62,null,null,null,"Site 7",null,41,32,12,45,57,75,13,32,21.97,65]
[null,"Site 8",null,30,52,35.200000000000003,78,91,84,66,83,93,65,null,null,null,"Site 8",null,37,56,10.199999999999999,47,85,68,36,32,21.27,24]
[null,{"$f":"+B43","v":"Site 1"},"LRAA",null,null,{"$f":"IF(COUNT(C43:F43)<4,\"NA\",AVERAGE(C43:F43))","v":"NA"},{"$f":"IF(COUNT(D43:G43)<4,\"NA\",AVERAGE(D43:G43))","v":70.3},56.8,51.05,56.25,60.75,66.25,66.5,null,null,null,{"$f":"+Q43","v":"Site 1"},"LRAA",null,null,{"$f":"IF(COUNT(R43:U43)<4,\"NA\",AVERAGE(R43:U43))","v":"NA"},{"$f":"IF(COUNT(S43:V43)<4,\"NA\",AVERAGE(S43:V43))","v":37.25},40.25,43.25,35,31,20,12]
[null,{"$f":"+B44","v":"Site 2"},"LRAA",null,null,{"$f":"IF(COUNT(C44:F44)<4,\"NA\",AVERAGE(C44:F44))","v":"NA"},61.424999999999997,63.674999999999997,60.424999999999997,54.424999999999997,48.174999999999997,31.5,25.5,null,null,null,{"$f":"+Q44","v":"Site 2"},"LRAA",null,null,{"$f":"IF(COUNT(R44:U44)<4,\"NA\",AVERAGE(R44:U44))","v":"NA"},37.424999999999997,41.424999999999997,47.924999999999997,38.5,35.75,25.8675,14.3675]
[null,"Site 3","LRAA",null,null,"NA",54.15,63.5,63.849999999999994,59.2,47.650000000000006,31.349999999999998,28.774999999999999,null,null,null,"Site 3","LRAA",null,null,"NA",33.65,37.65,53.4,53,55.5,62.5,55]
[null,"Site 4","LRAA",null,null,"NA",64.212500000000006,66.662499999999994,57.824999999999996,60.825000000000003,67.95,64.875,63.475000000000001,null,null,null,"Site 4","LRAA",null,null,"NA",39.225000000000001,51.225000000000001,54.225000000000001,54,50.25,34.317500000000003,23.317499999999999]
[null,"Site 5","LRAA",null,null,"NA",67.674999999999997,71.424999999999997,68.174999999999997,75.75,80.5,77.5,75.25,null,null,null,"Site 5","LRAA",null,null,"NA",39.174999999999997,42.174999999999997,45.174999999999997,40,36,25,17]
[null,"Site 6","LRAA",null,null,"NA",63.55,71.3,66.05,71.5,70.25,67,66,null,null,null,"Site 6","LRAA",null,null,"NA",34.049999999999997,38.049999999999997,44.55,43.5,40.75,30.8675,19.3675]
[null,"Site 7","LRAA",null,null,"NA",56.9,72.650000000000006,68.150000000000006,74.75,78.25,80,84.5,null,null,null,"Site 7","LRAA",null,null,"NA",32.5,36.5,47.25,47.5,44.25,35.4925,32.9925]
[null,"Site 8","LRAA",null,null,"NA",48.8,64.05,72.05,79.75,81,81.5,76.75,null,null,null,"Site 8","LRAA",null,null,"NA",37.549999999999997,49.55,52.55,59,55.25,39.317500000000003,28.317499999999999]
[null,"Max LRAA",null,null,null,{"$f":"IF(COUNT(F51:F58)=0,\"NA\",MAX(F51:F58))","v":"NA"},70.3,72.650000000000006,72.05,79.75,81,81.5,84.5,null,null,null,"Max LRAA",null,null,null,{"$f":"IF(COUNT(U51:U58)=0,\"NA\",MAX(U51:U58))","v":"NA"},{"$f":"IF(COUNT(V51:V58)=0,\"NA\",MAX(V51:V58))","v":39.225000000000001},51.225000000000001,54.225000000000001,59,55.5,62.5,55]
[null,"Avg of Max LRAAs",null,null,null,null,null,null,null,null,null,null,{"$f":"IF(COUNT(F59:M59)<8,\"NA\",AVERAGE(F59:M59))","v":"NA"},null,null,null,"Avg of Max LRAAs",null,null,null,null,null,null,null,null,null,null,{"$f":"IF(COUNT(U59:AB59)<8,\"NA\",AVERAGE(U59:AB59))","v":"NA"}]
[null,"Since System B has only 10 quarters of DBP data, the Long-Term System Goal does not apply.  System may only be assessed against individual site goal (exceedances highlighted in yellow).",null,null,null,null,null,null,null,null,null,null,null,null,null,null,"Since System B has only 10 quarters of DBP data, the Long-Term System Goal does not apply.  System may only be assessed against individual site goal (exceedances highlighted in yellow)."]
[]
[]
[]
[null,"System:","C",null,"Comments:","example system with 4 DBP sample sites & 11 quarters of data",null,null,null,null,null,null,null,null,null,null,"System:","C",null,"Comments:","example system with 4 DBP sample sites & 11 quarters of data"]
[null,"Enter Starting Quarter:",null,null,4,null,null,null,null,null,null,null,null,null,null,null,"Enter Starting Quarter:",null,null,4]
[null,"Enter Starting Year:",null,null,2002,null,null,null,null,null,null,null,null,null,null,null,"Enter Starting Year:",null,null,2002]
[null,"qtr",{"$f":"+E66","v":4},{"$f":"IF(C68<4,C68+1,IF(C68=4,1,4))","v":1},{"$f":"IF(D68<4,D68+1,IF(D68=4,1,4))","v":2},3,4,1,2,3,4,1,2,null,null,null,"qtr",{"$f":"+T66","v":4},{"$f":"IF(R68<4,R68+1,IF(R68=4,1,4))","v":1},{"$f":"IF(S68<4,S68+1,IF(S68=4,1,4))","v":2},3,4,1,2,3,4,1,2]
[null,"year",{"$f":"E67","v":2002},{"$f":"IF(C68<=3,C69,C69+1)","v":2003},2003,2003,2003,2004,2004,2004,2004,2005,2005,null,null,null,"year",{"$f":"T67","v":2002},{"$f":"IF(R68<=3,R69,R69+1)","v":2003},2003,2003,2003,2004,2004,2004,2004,2005,2005]
[null,"Sample Location",{"$f":"\"Q\"&C68&\" \"&C69","v":"Q4 2002"},"Q1 2003","Q2 2003","Q3 2003","Q4 2003","Q1 2004","Q2 2004","Q3 2004","Q4 2004","Q1 2005","Q2 2005",null,null,null,"Sample Location",{"$f":"\"Q\"&R68&\" \"&R69","v":"Q4 2002"},"Q1 2003","Q2 2003","Q3 2003","Q4 2003","Q1 2004","Q2 2004","Q3 2004","Q4 2004","Q1 2005","Q2 2005"]
[null,"Site 1",100,115,75,55,56,60,55,60,70,85,60,null,null,null,"Site 1",35,33,34,18,45,44,49,12,25,3,21]
[null,"Site 2",54.6,85,60,21,60,93,50,20.7,31,29.3,30,null,null,null,"Site 2",34,38,31,27,38,53,60,13,23,16.47,18]
[null,"Site 3",48.9,58.6,43.9,22.5,80,95,48.3,19.5,29.8,32.799999999999997,42,null,null,null,"Site 3",32,32,31,21,43,47,77,13,26,14.97,71]
[null,"Site 4",77.599999999999994,73.400000000000006,95.95,42.8,57.8,82.2,63.6,45.7,82.3,72.900000000000006,62,null,null,null,"Site 4",52,28,55,46,45,75,70,36,26,14.27,30]
[null,"NA",null,null,null,null,null,null,null,null,null,null,null,null,null,null,"NA"]
[null,"NA",null,null,null,null,null,null,null,null,null,null,null,null,null,null,"NA"]
[null,"NA",null,null,null,null,null,null,null,null,null,null,null,null,null,null,"NA"]
[null,"NA",null,null,null,null,null,null,null,null,null,null,null,null,null,null,"NA"]
[null,{"$f":"+B71","v":"Site 1"},"LRAA",null,null,{"$f":"IF(COUNT(C71:F71)<4,\"NA\",AVERAGE(C71:F71))","v":86.25},{"$f":"IF(COUNT(D71:G71)<4,\"NA\",AVERAGE(D71:G71))","v":75.25},61.5,56.5,57.75,61.25,67.5,68.75,null,null,null,{"$f":"+Q71","v":"Site 1"},"LRAA",null,null,{"$f":"IF(COUNT(R71:U71)<4,\"NA\",AVERAGE(R71:U71))","v":30},{"$f":"IF(COUNT(S71:V71)<4,\"NA\",AVERAGE(S71:V71))","v":32.5},35.25,39,37.5,32.5,22.25,15.25]
[null,{"$f":"+B72","v":"Site 2"},"LRAA",null,null,{"$f":"IF(COUNT(C72:F72)<4,\"NA\",AVERAGE(C72:F72))","v":55.15},56.5,58.5,56,55.924999999999997,48.674999999999997,32.75,27.75,null,null,null,{"$f":"+Q72","v":"Site 2"},"LRAA",null,null,{"$f":"IF(COUNT(R72:U72)<4,\"NA\",AVERAGE(R72:U72))","v":32.5},33.5,37.25,44.5,41,37.25,28.1175,17.6175]
[null,{"$f":"+B73","v":"Site 3"},"LRAA",null,null,43.475000000000001,51.25,60.35,61.45,60.7,48.150000000000006,32.599999999999994,31.024999999999999,null,null,null,{"$f":"+Q73","v":"Site 3"},"LRAA",null,null,29,31.75,35.5,47,45,40.75,32.7425,31.2425]
[null,{"$f":"+B74","v":"Site 4"},"LRAA",null,null,72.4375,67.487500000000011,69.6875,61.6,62.325000000000003,68.45,66.125,65.724999999999994,null,null,null,{"$f":"+Q74","v":"Site 4"},"LRAA",null,null,45.25,43.5,55.25,59,56.5,51.75,36.567500000000003,26.567499999999999]
[null,null,"LRAA",null,null,"NA","NA","NA","NA","NA","NA","NA","NA",null,null,null,null,"LRAA",null,null,"NA","NA","NA","NA","NA","NA","NA","NA"]
[null,null,"LRAA",null,null,"NA","NA","NA","NA","NA","NA","NA","NA",null,null,null,null,"LRAA",null,null,"NA","NA","NA","NA","NA","NA","NA","NA"]
[null,null,"LRAA",null,null,"NA","NA","NA","NA","NA","NA","NA","NA",null,null,null,null,"LRAA",null,null,"NA","NA","NA","NA","NA","NA","NA","NA"]
[null,null,"LRAA",null,null,"NA","NA","NA","NA","NA","NA","NA","NA",null,null,null,null,"LRAA",null,null,"NA","NA","NA","NA","NA","NA","NA","NA"]
[null,"Max LRAA",null,null,null,{"$f":"IF(COUNT(F79:F86)=0,\"NA\",MAX(F79:F86))","v":86.25},{"$f":"IF(COUNT(G79:G86)=0,\"NA\",MAX(G79:G86))","v":75.25},69.6875,61.6,62.325000000000003,68.45,67.5,68.75,null,null,null,"Max LRAA",null,null,null,{"$f":"IF(COUNT(U79:U86)=0,\"NA\",MAX(U79:U86))","v":45.25},{"$f":"IF(COUNT(V79:V86)=0,\"NA\",MAX(V79:V86))","v":43.5},55.25,59,56.5,51.75,36.567500000000003,31.2425]
[null,"Avg of Max LRAAs",null,null,null,null,null,null,null,null,null,null,{"$f":"IF(COUNT(F87:M87)<8,\"NA\",AVERAGE(F87:M87))","v":69.9765625},null,null,null,"Avg of Max LRAAs",null,null,null,null,null,null,null,null,null,null,{"$f":"IF(COUNT(U87:AB87)<8,\"NA\",AVERAGE(U87:AB87))","v":47.3825}]
[null,"Since System C has only 4 DBP sampling sites, LRAAS are not calculated in rows 83 through 86.",null,null,null,null,null,null,null,null,null,null,null,null,null,null,"Since System C has only 4 DBP sampling sites, LRAAS are not calculated in rows 83 through 86."]
[]
[]
[null,"System:","D",null,"Comments:","example system where sample sites were switched (but with 11 quarters of data)",null,null,null,null,null,null,null,null,null,null,"System:","D",null,"Comments:","example system where sample sites were switched (but with 11 quarters of data)"]
[null,"Enter Starting Quarter:",null,null,4,null,null,null,null,null,null,null,null,null,null,null,"Enter Starting Quarter:",null,null,4]
[null,"Enter Starting Year:",null,null,2002,null,null,null,null,null,null,null,null,null,null,null,"Enter Starting Year:",null,null,2002]
[null,"qtr",{"$f":"+E93","v":4},{"$f":"IF(C95<4,C95+1,IF(C95=4,1,4))","v":1},{"$f":"IF(D95<4,D95+1,IF(D95=4,1,4))","v":2},3,4,1,2,3,4,1,2,null,null,null,"qtr",{"$f":"+T93","v":4},{"$f":"IF(R95<4,R95+1,IF(R95=4,1,4))","v":1},{"$f":"IF(S95<4,S95+1,IF(S95=4,1,4))","v":2},3,4,1,2,3,4,1,2]
[null,"year",{"$f":"+E94","v":2002},{"$f":"IF(C95<=3,C96,C96+1)","v":2003},2003,2003,2003,2004,2004,2004,2004,2005,2005,null,null,null,"year",{"$f":"+T94","v":2002},{"$f":"IF(R95<=3,R96,R96+1)","v":2003},2003,2003,2003,2004,2004,2004,2004,2005,2005]
[null,"Sample Location",{"$f":"\"Q\"&C95&\" \"&C96","v":"Q4 2002"},"Q1 2003","Q2 2003","Q3 2003","Q4 2003","Q1 2004","Q2 2004","Q3 2004","Q4 2004","Q1 2005","Q2 2005",null,null,null,"Sample Location",{"$f":"\"Q\"&R95&\" \"&R96","v":"Q4 2002"},"Q1 2003","Q2 2003","Q3 2003","Q4 2003","Q1 2004","Q2 2004","Q3 2004","Q4 2004","Q1 2005","Q2 2005"]
[null,"Site 1",19.8,38.6,37.799999999999997,31.2,85,130,80,31.1,51.9,43.3,47,null,null,null,"Site 1",29,17.8,29.7,26.7,26.1,83,24.4,17.5,24.3,24,20]
[null,"Site 2",21.2,36.5,32.1,21.8,35.9,46.2,33.1,23.9,26.5,42.9,35,null,null,null,"Site 2",27.8,17.3,24.3,17.7,22.7,18.5,18.7,12.6,16.399999999999999,23.6,24]
[null,"Site 3",20,35.799999999999997,41.7,32.299999999999997,58.9,"no data","no data","no data","no data","no data","no data",null,null,null,"Site 3",27.3,21.9,34,22.6,41.3,"no data","no data","no data","no data","no data","no data"]
[null,"Site 4",21.1,36.5,57.1,44.4,47.4,"no data","no data","no data","no data","no data","no data",null,null,null,"Site 4",25.1,20.7,29.2,33.700000000000003,33.4,"no data","no data","no data","no data","no data","no data"]
[null,"Site 5","no data","no data","not data","no data","no data",42,44.9,31.6,33.799999999999997,45.7,49,null,null,null,"Site 5","no data","no data","no data","no data","no data",21.6,23.7,16.899999999999999,19.8,25.8,22]
[null,"Site 6","no data","no data","not data","no data","no data",41,64.099999999999994,35.299999999999997,34.9,46.1,41,null,null,null,"Site 6","no data","no data","no data","no data","no data",11.5,20,16.100000000000001,24.3,23.2,24]
[null,"Site 7",55,85,54,42,73,90,55,21,55,80,30,null,null,null,"Site 7",36,24.8,36.700000000000003,33.700000000000003,33.1,90,31.4,24.5,31.3,31,27]
[null,"Site 8",75,80,90,20,78,82,70,30,55,75,65,null,null,null,"Site 8",34.799999999999997,24.3,31.3,24.7,29.7,25.5,25.7,19.600000000000001,23.4,30.6,31]
[null,{"$f":"+B98","v":"Site 1"},"LRAA",null,null,{"$f":"IF(COUNT(C98:F98)<4,\"NA\",AVERAGE(C98:F98))","v":31.85},{"$f":"IF(COUNT(D98:G98)<4,\"NA\",AVERAGE(D98:G98))","v":48.150000000000006},71,81.55,81.525000000000006,73.25,51.575000000000003,43.325000000000003,null,null,null,{"$f":"+Q98","v":"Site 1"},"LRAA",null,null,{"$f":"IF(COUNT(R98:U98)<4,\"NA\",AVERAGE(R98:U98))","v":25.8},{"$f":"IF(COUNT(S98:V98)<4,\"NA\",AVERAGE(S98:V98))","v":25.075000000000003},41.375,40.050000000000004,37.75,37.300000000000004,22.55,21.45]
[null,{"$f":"+B99","v":"Site 2"},"LRAA",null,null,{"$f":"IF(COUNT(C99:F99)<4,\"NA\",AVERAGE(C99:F99))","v":27.900000000000002},31.574999999999996,34,34.25,34.774999999999999,32.425000000000004,31.6,32.075000000000003,null,null,null,{"$f":"+Q99","v":"Site 2"},"LRAA",null,null,{"$f":"IF(COUNT(R99:U99)<4,\"NA\",AVERAGE(R99:U99))","v":21.775000000000002},20.5,20.8,19.399999999999999,18.125,16.55,17.824999999999999,19.149999999999999]
[null,"Site 3","LRAA",null,null,32.450000000000003,42.174999999999997,"NA","NA","NA","NA","NA","NA",null,null,null,"Site 3","LRAA",null,null,26.450000000000003,29.95,"NA","NA","NA","NA","NA","NA"]
[null,"Site 4","LRAA",null,null,39.774999999999999,46.35,"NA","NA","NA","NA","NA","NA",null,null,null,"Site 4","LRAA",null,null,27.175000000000001,29.25,"NA","NA","NA","NA","NA","NA"]
[null,"Site 5","LRAA",null,null,"NA","NA","NA","NA","NA",38.075000000000003,39,40.025000000000006,null,null,null,"Site 5","LRAA",null,null,"NA","NA","NA","NA","NA",20.5,21.549999999999997,21.125]
[null,"Site 6","LRAA",null,null,"NA","NA","NA","NA","NA",43.824999999999996,45.099999999999994,39.324999999999996,null,null,null,"Site 6","LRAA",null,null,"NA","NA","NA","NA","NA",17.975000000000001,20.900000000000002,21.900000000000002]
[null,"Site 7","LRAA",null,null,59,63.5,64.75,65,59.75,55.25,52.75,46.5,null,null,null,"Site 7","LRAA",null,null,32.799999999999997,32.075000000000003,48.375,47.050000000000004,44.75,44.300000000000004,29.55,28.45]
[null,"Site 8","LRAA",null,null,66.25,67,67.5,62.5,65,59.25,57.5,56.25,null,null,null,"Site 8","LRAA",null,null,28.774999999999999,27.5,27.8,26.400000000000002,25.125,23.550000000000004,24.824999999999996,26.15]
[null,"Max LRAA",null,null,null,{"$f":"IF(COUNT(F106:F113)=0,\"NA\",MAX(F106:F113))","v":66.25},67,71,81.55,81.525000000000006,73.25,57.5,56.25,null,null,null,"Max LRAA",null,null,null,{"$f":"IF(COUNT(U106:U113)=0,\"NA\",MAX(U106:U113))","v":32.799999999999997},{"$f":"IF(COUNT(V106:V113)=0,\"NA\",MAX(V106:V113))","v":32.075000000000003},48.375,47.050000000000004,44.75,44.300000000000004,29.55,28.45]
[null,"Avg of Max LRAAs",null,null,null,null,null,null,null,null,null,null,{"$f":"IF(COUNT(F114:M114)<8,\"NA\",AVERAGE(F114:M114))","v":69.290625000000006},null,null,null,"Avg of Max LRAAs",null,null,null,null,null,null,null,null,null,null,{"$f":"IF(COUNT(U114:AB114)<8,\"NA\",AVERAGE(U114:AB114))","v":38.418750000000003}]
[null,"Since System D switched sample sites in Quarter 1 2004 a LRAA cannot be calculated until 4 quarters of data are available for Sites 5 and 6 (i.e., starting in Quarter 4 2004). ",null,null,null,null,null,null,null,null,null,null,null,null,null,null,"Since System D switched sample sites in Quarter 1 2004 a LRAA cannot be calculated until 4 quarters of data are available for Sites 5 and 6 (i.e., starting in Quarter 4 2004). "]
[]
[]
[]
[null,"System:","E",null,"Comments:","example system where 1 data point is missing (but with 11 quarters of data)",null,null,null,null,null,null,null,null,null,null,"System:","E",null,"Comments:","example system where 1 data point is missing (but with 11 quarters of data)"]
[null,"Enter Starting Quarter:",null,null,4,null,null,null,null,null,null,null,null,null,null,null,"Enter Starting Quarter:",null,null,4]
[null,"Enter Starting Year:",null,null,2002,null,null,null,null,null,null,null,null,null,null,null,"Enter Starting Year:",null,null,2002]
[null,"qtr",{"$f":"+E121","v":4},{"$f":"IF(C123<4,C123+1,IF(C123=4,1,4))","v":1},{"$f":"IF(D123<4,D123+1,IF(D123=4,1,4))","v":2},3,4,1,2,3,4,1,2,null,null,null,"qtr",{"$f":"+T121","v":4},{"$f":"IF(R123<4,R123+1,IF(R123=4,1,4))","v":1},{"$f":"IF(S123<4,S123+1,IF(S123=4,1,4))","v":2},3,4,1,2,3,4,1,2]
[null,"year",{"$f":"+E122","v":2002},{"$f":"IF(C123<=3,C124,C124+1)","v":2003},2003,2003,2003,2004,2004,2004,2004,2005,2005,null,null,null,"year",{"$f":"+T122","v":2002},{"$f":"IF(R123<=3,R124,R124+1)","v":2003},2003,2003,2003,2004,2004,2004,2004,2005,2005]
[null,"Sample Location",{"$f":"\"Q\"&C123&\" \"&C124","v":"Q4 2002"},"Q1 2003","Q2 2003","Q3 2003","Q4 2003","Q1 2004","Q2 2004","Q3 2004","Q4 2004","Q1 2005","Q2 2005",null,null,null,"Sample Location",{"$f":"\"Q\"&R123&\" \"&R124","v":"Q4 2002"},"Q1 2003","Q2 2003","Q3 2003","Q4 2003","Q1 2004","Q2 2004","Q3 2004","Q4 2004","Q1 2005","Q2 2005"]
[null,"Site 1",64.900000000000006,46.4,42.9,5.44,25.9,38.6,14,11.2,29.2,67,20,null,null,null,"Site 1",29,22,37.1,4.2300000000000004,11.5,19.899999999999999,15,10.8,11.4,20.399999999999999,13]
[null,"Site 2",73.3,57.9,56.8,9.68,38.700000000000003,42.9,17.7,11.9,33.200000000000003,66.3,25,null,null,null,"Site 2",40.9,23.9,44.9,4.7,18.2,30.1,9.75,12.9,24.6,19,17]
[null,"Site 3",79.2,55,46,10.1,34.9,44.6,18.5,18.3,32.299999999999997,64.3,22,null,null,null,"Site 3",40.9,28.1,42.4,6.62,14,28.8,8.1199999999999992,12.8,20,18.7,24]
[null,"Site 4",110,114,68.5,21.2,54.6,"no data",56.3,47.7,87.3,110,24,null,null,null,"Site 4",60,57.7,54.4,12.4,24.8,"no data",27.9,34.9,52.6,45.4,37]
[null,"Site 5",55,85,75,30,70,99,65,75,85,90,60,null,null,null,"Site 5",34,27,42.1,9.23,16.5,24.9,12.48,15.8,16.399999999999999,25.4,18]
[null,"Site 6",60,60,73,60,75,90,55,72,66,80,55,null,null,null,"Site 6",37.9,20.9,41.9,1.7,15.2,27.1,6.75,9.9,21.6,16,14]
[null,"Site 7",35,65,55,38,45,75,50,45,55,85,40,null,null,null,"Site 7",61.35,42.15,63.6,9.93,21,43.2,12.18,19.2,30,28.05,36]
[null,"Site 8",20,55,25,25,61,73,33,25,65,75,30,null,null,null,"Site 8",55,52.7,49.4,7.4,19.8,15,22.9,29.9,47.6,40.4,32]
[null,{"$f":"+B126","v":"Site 1"},"LRAA",null,null,{"$f":"IF(COUNT(C126:F126)<4,\"NA\",AVERAGE(C126:F126))","v":39.910000000000004},{"$f":"IF(COUNT(D126:G126)<4,\"NA\",AVERAGE(D126:G126))","v":30.159999999999997},28.21,20.984999999999999,22.425000000000001,23.25,30.35,31.85,null,null,null,{"$f":"+Q126","v":"Site 1"},"LRAA",null,null,{"$f":"IF(COUNT(R126:U126)<4,\"NA\",AVERAGE(R126:U126))","v":23.0825},{"$f":"IF(COUNT(S126:V126)<4,\"NA\",AVERAGE(S126:V126))","v":18.7075},18.182499999999997,12.657499999999999,14.3,14.275,14.4,13.9]
[null,{"$f":"+B127","v":"Site 2"},"LRAA",null,null,{"$f":"IF(COUNT(C127:F127)<4,\"NA\",AVERAGE(C127:F127))","v":49.42},40.769999999999996,37.019999999999996,27.245000000000001,27.8,26.425000000000001,32.274999999999999,34.1,null,null,null,{"$f":"+Q127","v":"Site 2"},"LRAA",null,null,{"$f":"IF(COUNT(R127:U127)<4,\"NA\",AVERAGE(R127:U127))","v":28.599999999999998},22.925000000000001,24.475000000000001,15.6875,17.737500000000001,19.337499999999999,16.5625,18.375]
[null,{"$f":"+B128","v":"Site 3"},"LRAA",null,null,47.574999999999996,36.5,33.9,27.024999999999999,29.074999999999999,28.425000000000001,33.349999999999994,34.224999999999994,null,null,null,{"$f":"+Q128","v":"Site 3"},"LRAA",null,null,29.505000000000003,22.78,22.954999999999998,14.385,15.93,17.43,14.905000000000001,18.875]
[null,"Site 4","LRAA",null,null,78.424999999999997,64.575000000000003,"NA","NA","NA","NA",75.325000000000003,67.25,null,null,null,"Site 4","LRAA",null,null,46.125,37.325000000000003,"NA","NA","NA","NA",40.200000000000003,42.475000000000001]
[null,"Site 5","LRAA",null,null,61.25,65,68.5,66,77.25,81,78.75,77.5,null,null,null,"Site 5","LRAA",null,null,28.0825,23.7075,23.182499999999997,15.7775,17.419999999999998,17.394999999999996,17.52,18.899999999999999]
[null,"Site 6","LRAA",null,null,63.25,67,74.5,70,73,70.75,68.25,68.25,null,null,null,"Site 6","LRAA",null,null,25.599999999999998,19.925000000000001,21.475000000000001,12.6875,14.737499999999999,16.337499999999999,13.5625,15.375]
[null,"Site 7","LRAA",null,null,48.25,50.75,53.25,52,53.75,56.25,58.75,56.25,null,null,null,"Site 7","LRAA",null,null,44.2575,34.17,34.432500000000005,21.577500000000001,23.895,26.145,22.357499999999998,28.3125]
[null,"Site 8","LRAA",null,null,31.25,41.5,46,48,48,49,49.5,48.75,null,null,null,"Site 8","LRAA",null,null,41.125,32.325000000000003,22.9,16.274999999999999,21.9,28.85,35.200000000000003,37.475000000000001]
[null,"Max LRAA",null,null,null,{"$f":"IF(COUNT(F134:F141)=0,\"NA\",MAX(F134:F141))","v":78.424999999999997},67,74.5,70,77.25,81,78.75,77.5,null,null,null,"Max LRAA",null,null,null,{"$f":"IF(COUNT(U134:U141)=0,\"NA\",MAX(U134:U141))","v":46.125},{"$f":"IF(COUNT(V134:V141)=0,\"NA\",MAX(V134:V141))","v":37.325000000000003},34.432500000000005,21.577500000000001,23.895,28.85,40.200000000000003,42.475000000000001]
[null,"Avg of Max LRAAs",null,null,null,null,null,null,null,null,null,null,{"$f":"IF(COUNT(F142:M142)<8,\"NA\",AVERAGE(F142:M142))","v":75.553124999999994},null,null,null,"Avg of Max LRAAs",null,null,null,null,null,null,null,null,null,null,{"$f":"IF(COUNT(U142:AB142)<8,\"NA\",AVERAGE(U142:AB142))","v":34.360000000000007}]
[null,"Because System E did not collect data in Quarter 1 2004 at Site 4, a LRAA cannot be calculated until 4 quarters of data available (i.e., calculating LRAAs can resume in Quarter 1 of 2005).  ",null,null,null,null,null,null,null,null,null,null,null,null,null,null,"Because System E did not collect data in Quarter 1 2004 at Site 4, a LRAA cannot be calculated until 4 quarters of data available (i.e., calculating LRAAs can resume in Quarter 1 of 2005).  "]

{"sheet":"TOC-UV","index":44,"n_rows":0,"n_cols":0,"rows_kept":0,"cut":false,"hidden":true,"merged":[]}

{"sheet":"LRAA Sites 1-4","index":45,"n_rows":2,"n_cols":2,"rows_kept":2,"cut":false,"hidden":true,"merged":[]}
[]
[null,"DBP Locational Running Annual Average (LRAA) Concentrations for Sites 1 thru 4"]

{"sheet":"LRAA Sites 5-8","index":46,"n_rows":2,"n_cols":2,"rows_kept":2,"cut":false,"hidden":true,"merged":[]}
[]
[null,"DBP Locational Running Annual Average (LRAA) Concentrations for Sites 5 thru 8"]

{"sheet":"LRAA Sites 9-12","index":47,"n_rows":2,"n_cols":2,"rows_kept":2,"cut":false,"hidden":true,"merged":[]}
[]
[null,"DBP Locational Running Annual Average (LRAA) Concentrations for Sites 9 thru 12"]