{"text_format":"1","workbook":"xlsx","n_sheets":17,"sheets":["Development","Data Entry","Chlorine Summary Table","Chlorine Chart","Cl2 Delta Table","pH Summary Table","pH Chart","Temp Summary Table","Temp Chart","TTHM Summary Table","TTHM Chart","TTHM Goals","HAA5 Summary Table","HAA5 Chart","HAA5 Goals","OEL Calc","Site Info"],"not_rendered":{"charts":7,"images":0,"macros":1,"external_links":1,"defined_names":50,"comments":4,"pivot_tables":6},"unopened":[],"bounds":{"document_bytes":16777216,"sheet_cells":100000,"rows_first":2000,"rows_last":500,"rows_between":2000,"halvings":0,"cell_chars":16384,"cell_head_chars":4096},"cells_cut":0,"cells_raw":0,"read":"whole","date_system":"1900"}

{"sheet":"Development","index":0,"n_rows":21,"n_cols":3,"rows_kept":21,"cut":false,"hidden":true,"merged":[]}
["Column1","Column2","Version"]
["Developer Comments"]
[]
["2011-04-14","Modified GW spreadsheet to use for DS PBT. Added DBP pivot tables and charts. Added DBP goals"]
[null,"tables for TTHM and HAA5."]
["2011-04-29","Pivot tables set to automatically Refresh each time file is opened. Identifed method to display"]
[null,"system wide chlorine concentration by month by dragging Sample Site Field out of box."]
[null,"Added DBP long-term charts to goals worksheets."]
["2011-09-01","William McClimans added macro to auto update all pivot tables."]
["2012-01-04","Added macro to auto update DBP Goals table based on DBP pivot table quarterly summary table."]
{"$rows_left_out":12}
{"sheet":"Data Entry","index":1,"n_rows":53,"n_cols":16,"rows_kept":53,"cut":false,"hidden":false,"merged":[[0,10,1,13],[2,0,3,2],[2,5,2,6]]}
["Enter new sample data by inserting rows in table or entering data in the row immediately below the table.",null,null,null,null,null,null,null,null,null,"Enter Water System"]
["Note: Avoid blank rows in the data entry table. Pivot tables and charts do not like blank rows!"]
["Operational Goals (Individual Samples)",null,null,null,null,"(min)  pH  (Max)"]
[null,null,null,"##",null,"##","##","##","##"]
["Sample Site","Date","Time","Free Cl2, Mg/L","Total Cl2, Mg/L","Temp","pH","TTHM, Mg/L","HAA5, Mg/L","Other 3","Other 4","Other 5","Latitude","Longitude","Comments","CL2 Rounded"]
[null,null,null,null,null,null,null,null,null,null,null,null,null,null,null,{"$f":"VLOOKUP(Table6[[#This Row],[Free Cl2, Mg/L]],CL_RND_TBL[#All],2)","v":0}]
[null,null,null,null,null,null,null,null,null,null,null,null,null,null,null,{"$f":"VLOOKUP(Table6[[#This Row],[Free Cl2, Mg/L]],CL_RND_TBL[#All],2)","v":0}]
[null,null,null,null,null,null,null,null,null,null,null,null,null,null,null,{"$f":"VLOOKUP(Table6[[#This Row],[Free Cl2, Mg/L]],CL_RND_TBL[#All],2)","v":0}]
[null,null,null,null,null,null,null,null,null,null,null,null,null,null,null,{"$f":"VLOOKUP(Table6[[#This Row],[Free Cl2, Mg/L]],CL_RND_TBL[#All],2)","v":0}]
[null,null,null,null,null,null,null,null,null,null,null,null,null,null,null,{"$f":"VLOOKUP(Table6[[#This Row],[Free Cl2, Mg/L]],CL_RND_TBL[#All],2)","v":0}]
{"$rows_left_out":44}
{"sheet":"Chlorine Summary Table","index":2,"n_rows":7,"n_cols":3,"rows_kept":7,"cut":false,"hidden":false,"merged":[[1,0,2,11]]}
[{"$f":"'Data Entry'!K1:K2","v":"Enter Water System"}]
["Note:  If table is not updated go to the \"Data Entry\" tab and click the \"Update Tables\" button.  If table does not update, make sure that macros are enabled. Go to Trust Center & Macro Settings to enable macros."]
[]
["Average of Free Cl2, Mg/L","Date"]
["Sample Site","(blank)","Average"]
["(blank)"]
["Average"]

{"sheet":"Chlorine Chart","index":3,"n_rows":0,"n_cols":0,"rows_kept":0,"cut":false,"hidden":false,"merged":[]}

{"sheet":"Cl2 Delta Table","index":4,"n_rows":28,"n_cols":18,"rows_kept":28,"cut":false,"hidden":true,"merged":[]}
["Sample Site","(Multiple Items)",null,null,null,"Note: Update this table each time new data is entered in the Data Entry Table.",null,null,null,null,null,null,null,null,null,null,"Chlorine","Result"]
[null,null,null,null,null,"To update, 'right clicking' on any cell in the table and select Refresh.",null,null,null,null,null,null,null,null,null,null,0,0]
["Delta Cl2",null,null,null,null,"Legend",null,null,null,null,null,null,null,null,null,null,0.01,0]
["Date","Total",null,null,null,"Green Light: Delta less than or equal to 0.19",null,null,null,null,null,null,null,null,null,null,0.04,0]
[null,null,null,null,null,"Yellow Light: Delta less than 0.25 and greater than 0.19",null,null,null,null,null,null,null,null,null,null,0.05,0.1]
[null,null,null,null,null,"Red Light: Delta greater than or equal to 0.25 ",null,null,null,null,null,null,null,null,null,null,9.5000000000000001E-2,0.1]
[null,null,null,null,null,null,null,null,null,null,null,null,null,null,null,null,0.1,0.1]
[null,null,null,null,null,null,null,null,null,null,null,null,null,null,null,null,0.11,0.2]
[null,null,null,null,null,null,null,null,null,null,null,null,null,null,null,null,0.12,0.2]
[null,null,null,null,null,null,null,null,null,null,null,null,null,null,null,null,0.2,0.2]
{"$rows_left_out":19}
{"sheet":"pH Summary Table","index":5,"n_rows":7,"n_cols":3,"rows_kept":7,"cut":false,"hidden":false,"merged":[[1,0,2,11]]}
[{"$f":"'Data Entry'!K1:K2","v":"Enter Water System"}]
["Note:  If table is not updated go to the \"Data Entry\" tab and click the \"Update Tables\" button.  If table does not update, make sure that macros are enabled. Go to Trust Center & Macro Settings to enable macros."]
[]
["Average of pH","Date"]
["Sample Site","(blank)","Average"]
["(blank)"]
["Average"]

{"sheet":"pH Chart","index":6,"n_rows":0,"n_cols":0,"rows_kept":0,"cut":false,"hidden":false,"merged":[]}

{"sheet":"Temp Summary Table","index":7,"n_rows":7,"n_cols":3,"rows_kept":7,"cut":false,"hidden":false,"merged":[[1,0,2,11]]}
[{"$f":"'Data Entry'!K1:K2","v":"Enter Water System"}]
["Note:  If table is not updated go to the \"Data Entry\" tab and click the \"Update Tables\" button.  If table does not update, make sure that macros are enabled. Go to Trust Center & Macro Settings to enable macros."]
[]
["Average of Temp","Date"]
["Sample Site","(blank)","Average"]
["(blank)"]
["Average"]

{"sheet":"Temp Chart","index":8,"n_rows":0,"n_cols":0,"rows_kept":0,"cut":false,"hidden":false,"merged":[]}

{"sheet":"TTHM Summary Table","index":9,"n_rows":47,"n_cols":34,"rows_kept":47,"cut":false,"hidden":false,"merged":[[0,1,1,12]]}
[null,"Note:  If table is not updated go to the \"Data Entry\" tab and click the \"Update Tables\" button.  If table does not update, make sure that macros are enabled. Go to Trust Center & Macro Settings to enable macros.",null,null,null,null,null,null,null,null,null,null,null,{"$f":"'Data Entry'!K1:K2","v":"Enter Water System"}]
[]
[null,"Average of TTHM, Mg/L","Date",null,null,null,null,null,null,null,null,null,null,null,null,null,"Start","End"]
[null,"Sample Site","(blank)","Average",null,null,null,null,null,null,null,null,null,null,null,null,"4/1/111","2012-07-30"]
[null,"(blank)","na","na"]
[null,"Average","na","na"]
[]
[]
[]
[]
{"$rows_left_out":38}
{"sheet":"TTHM Chart","index":10,"n_rows":0,"n_cols":0,"rows_kept":0,"cut":false,"hidden":false,"merged":[]}

{"sheet":"TTHM Goals","index":11,"n_rows":64,"n_cols":15,"rows_kept":64,"cut":false,"hidden":false,"merged":[[13,12,13,15]]}
["TTHM Goals Calculation"]
["If desired, the goals can be modified on a system-specific basis.  Default values are shown in the comment boxes below."]
["Individual Site Goal:",7.0000000000000007E-2]
["Long-Term System Goal:",0.06]
["Water System Name:",{"$f":"'Data Entry'!K1","v":"Enter Water System"}]
["Yellow","highlighted LRAA exceeds TTHM Individual Site Goal (i.e., default goal is LRAA < 0.07 Mg/L) for that quarter"]
["Blue","highlighted LRAA is the max LRAA for that quarter; unless the LRAA exceeds the Individual Site Goal (see above)"]
["Green","highlighted data exceeds the TTHM Long-Term System Goal (i.e., default goal is ave Max LRAAs < 0.06 Mg/L)"]
[]
[null,{"$f":"B11&B12","v":{"$error":"#VALUE!"}},{"$f":"C11&C12","v":{"$error":"#VALUE!"}},{"$error":"#VALUE!"},{"$error":"#VALUE!"},{"$error":"#VALUE!"},{"$error":"#VALUE!"},{"$error":"#VALUE!"},{"$error":"#VALUE!"},{"$error":"#VALUE!"},{"$error":"#VALUE!"},"aAverage"]
{"$rows_left_out":55}
{"sheet":"HAA5 Summary Table","index":12,"n_rows":46,"n_cols":33,"rows_kept":46,"cut":false,"hidden":false,"merged":[[0,0,1,11]]}
["Note:  If table is not updated go to the \"Data Entry\" tab and click the \"Update Tables\" button.  If table does not update, make sure that macros are enabled. Go to Trust Center & Macro Settings to enable macros.",null,null,null,null,null,null,null,null,null,null,null,null,{"$f":"'Data Entry'!K1:K2","v":"Enter Water System"}]
[]
["Average of HAA5, Mg/L","Date"]
["Sample Site","(blank)","Average"]
["(blank)","na","na"]
["Average","na","na"]
[]
[]
[]
[]
{"$rows_left_out":37}
{"sheet":"HAA5 Chart","index":13,"n_rows":0,"n_cols":0,"rows_kept":0,"cut":false,"hidden":false,"merged":[]}

{"sheet":"HAA5 Goals","index":14,"n_rows":64,"n_cols":15,"rows_kept":64,"cut":false,"hidden":false,"merged":[]}
["HAA5 Goals Calculation"]
["If desired, the goals can be modified on a system-specific basis.  Default values are shown in the comment boxes below."]
["Individual Site Goal:",0.05]
["Long-Term System Goal:",0.04]
["Water System Name:",{"$f":"'TTHM Goals'!B5","v":"Enter Water System"}]
["Yellow","highlighted LRAA exceeds TTHM Individual Site Goal (i.e., default goal is LRAA < 0.050 Mg/L) for that quarter"]
["Blue","highlighted LRAA is the max LRAA for that quarter; unless the LRAA exceeds the Individual Site Goal (see above)"]
["Green","highlighted data exceeds the TTHM Long-Term System Goal (i.e., default goal is ave Max LRAAs < 0.04 Mg/L)"]
[]
[null,{"$f":"B11&B12","v":{"$error":"#VALUE!"}},{"$f":"C11&C12","v":{"$error":"#VALUE!"}},{"$error":"#VALUE!"},{"$error":"#VALUE!"},{"$error":"#VALUE!"},{"$error":"#VALUE!"},{"$error":"#VALUE!"},{"$error":"#VALUE!"},{"$error":"#VALUE!"},{"$error":"#VALUE!"},"aAverage"]
{"$rows_left_out":55}
{"sheet":"OEL Calc","index":15,"n_rows":45,"n_cols":13,"rows_kept":45,"cut":false,"hidden":false,"merged":[]}
[null,{"$f":"'Data Entry'!K1:K2","v":"Enter Water System"}]
[]
[null,"TTHM OEL Table"]
[null,"Operational Evaluation Level (OEL)",8.0399999999999999E-2,"Colored cell indicates OEL was exceeded"]
[null,null,{"$f":"'TTHM Goals'!B13","v":{"$error":"#VALUE!"}},{"$f":"'TTHM Goals'!C13","v":{"$error":"#VALUE!"}},{"$f":"'TTHM Goals'!D13","v":{"$error":"#VALUE!"}},{"$f":"'TTHM Goals'!E13","v":{"$error":"#VALUE!"}},{"$f":"'TTHM Goals'!F13","v":{"$error":"#VALUE!"}},{"$f":"'TTHM Goals'!G13","v":{"$error":"#VALUE!"}},{"$f":"'TTHM Goals'!H13","v":{"$error":"#VALUE!"}},{"$f":"'TTHM Goals'!I13","v":{"$error":"#VALUE!"}},{"$f":"'TTHM Goals'!J13","v":{"$error":"#VALUE!"}},{"$f":"'TTHM Goals'!K13","v":{"$error":"#VALUE!"}},{"$f":"'TTHM Goals'!L13","v":{"$error":"#VALUE!"}}]
[null,{"$f":"IF(ISBLANK('TTHM Goals'!A14),\"\",'TTHM Goals'!A14)","v":"(blank)"},null,null,{"$f":"IF(ISERROR(('TTHM Goals'!D14*2+SUM('TTHM Goals'!B14:C14))/4),\"\",(('TTHM Goals'!D14*2+SUM('TTHM Goals'!B14:C14))/4))","v":""},{"$f":"IF(ISERROR(('TTHM Goals'!E14*2+SUM('TTHM Goals'!C14:D14))/4),\"\",(('TTHM Goals'!E14*2+SUM('TTHM Goals'!C14:D14))/4))","v":""},{"$f":"IF(ISERROR(('TTHM Goals'!F14*2+SUM('TTHM Goals'!D14:E14))/4),\"\",(('TTHM Goals'!F14*2+SUM('TTHM Goals'!D14:E14))/4))","v":""},{"$f":"IF(ISERROR(('TTHM Goals'!G14*2+SUM('TTHM Goals'!E14:F14))/4),\"\",(('TTHM Goals'!G14*2+SUM('TTHM Goals'!E14:F14))/4))","v":""},{"$f":"IF(ISERROR(('TTHM Goals'!H14*2+SUM('TTHM Goals'!F14:G14))/4),\"\",(('TTHM Goals'!H14*2+SUM('TTHM Goals'!F14:G14))/4))","v":""},{"$f":"IF(ISERROR(('TTHM Goals'!I14*2+SUM('TTHM Goals'!G14:H14))/4),\"\",(('TTHM Goals'!I14*2+SUM('TTHM Goals'!G14:H14))/4))","v":""},{"$f":"IF(ISERROR(('TTHM Goals'!J14*2+SUM('TTHM Goals'!H14:I14))/4),\"\",(('TTHM Goals'!J14*2+SUM('TTHM Goals'!H14:I14))/4))","v":""},{"$f":"IF(ISERROR(('TTHM Goals'!K14*2+SUM('TTHM Goals'!I14:J14))/4),\"\",(('TTHM Goals'!K14*2+SUM('TTHM Goals'!I14:J14))/4))","v":""},{"$f":"IF(ISERROR(('TTHM Goals'!L14*2+SUM('TTHM Goals'!J14:K14))/4),\"\",(('TTHM Goals'!L14*2+SUM('TTHM Goals'!J14:K14))/4))","v":""}]
[null,{"$f":"IF(ISBLANK('TTHM Goals'!A15),\"\",'TTHM Goals'!A15)","v":"(blank)"},null,null,{"$f":"IF(ISERROR(('TTHM Goals'!D15*2+SUM('TTHM Goals'!B15:C15))/4),\"\",(('TTHM Goals'!D15*2+SUM('TTHM Goals'!B15:C15))/4))","v":""},{"$f":"IF(ISERROR(('TTHM Goals'!E15*2+SUM('TTHM Goals'!C15:D15))/4),\"\",(('TTHM Goals'!E15*2+SUM('TTHM Goals'!C15:D15))/4))","v":""},{"$f":"IF(ISERROR(('TTHM Goals'!F15*2+SUM('TTHM Goals'!D15:E15))/4),\"\",(('TTHM Goals'!F15*2+SUM('TTHM Goals'!D15:E15))/4))","v":""},{"$f":"IF(ISERROR(('TTHM Goals'!G15*2+SUM('TTHM Goals'!E15:F15))/4),\"\",(('TTHM Goals'!G15*2+SUM('TTHM Goals'!E15:F15))/4))","v":""},{"$f":"IF(ISERROR(('TTHM Goals'!H15*2+SUM('TTHM Goals'!F15:G15))/4),\"\",(('TTHM Goals'!H15*2+SUM('TTHM Goals'!F15:G15))/4))","v":""},{"$f":"IF(ISERROR(('TTHM Goals'!I15*2+SUM('TTHM Goals'!G15:H15))/4),\"\",(('TTHM Goals'!I15*2+SUM('TTHM Goals'!G15:H15))/4))","v":""},{"$f":"IF(ISERROR(('TTHM Goals'!J15*2+SUM('TTHM Goals'!H15:I15))/4),\"\",(('TTHM Goals'!J15*2+SUM('TTHM Goals'!H15:I15))/4))","v":""},{"$f":"IF(ISERROR(('TTHM Goals'!K15*2+SUM('TTHM Goals'!I15:J15))/4),\"\",(('TTHM Goals'!K15*2+SUM('TTHM Goals'!I15:J15))/4))","v":""},{"$f":"IF(ISERROR(('TTHM Goals'!L15*2+SUM('TTHM Goals'!J15:K15))/4),\"\",(('TTHM Goals'!L15*2+SUM('TTHM Goals'!J15:K15))/4))","v":""}]
[null,{"$f":"IF(ISBLANK('TTHM Goals'!A16),\"\",'TTHM Goals'!A16)","v":"(blank)"},null,null,{"$f":"IF(ISERROR(('TTHM Goals'!D16*2+SUM('TTHM Goals'!B16:C16))/4),\"\",(('TTHM Goals'!D16*2+SUM('TTHM Goals'!B16:C16))/4))","v":""},{"$f":"IF(ISERROR(('TTHM Goals'!E16*2+SUM('TTHM Goals'!C16:D16))/4),\"\",(('TTHM Goals'!E16*2+SUM('TTHM Goals'!C16:D16))/4))","v":""},{"$f":"IF(ISERROR(('TTHM Goals'!F16*2+SUM('TTHM Goals'!D16:E16))/4),\"\",(('TTHM Goals'!F16*2+SUM('TTHM Goals'!D16:E16))/4))","v":""},{"$f":"IF(ISERROR(('TTHM Goals'!G16*2+SUM('TTHM Goals'!E16:F16))/4),\"\",(('TTHM Goals'!G16*2+SUM('TTHM Goals'!E16:F16))/4))","v":""},{"$f":"IF(ISERROR(('TTHM Goals'!H16*2+SUM('TTHM Goals'!F16:G16))/4),\"\",(('TTHM Goals'!H16*2+SUM('TTHM Goals'!F16:G16))/4))","v":""},{"$f":"IF(ISERROR(('TTHM Goals'!I16*2+SUM('TTHM Goals'!G16:H16))/4),\"\",(('TTHM Goals'!I16*2+SUM('TTHM Goals'!G16:H16))/4))","v":""},{"$f":"IF(ISERROR(('TTHM Goals'!J16*2+SUM('TTHM Goals'!H16:I16))/4),\"\",(('TTHM Goals'!J16*2+SUM('TTHM Goals'!H16:I16))/4))","v":""},{"$f":"IF(ISERROR(('TTHM Goals'!K16*2+SUM('TTHM Goals'!I16:J16))/4),\"\",(('TTHM Goals'!K16*2+SUM('TTHM Goals'!I16:J16))/4))","v":""},{"$f":"IF(ISERROR(('TTHM Goals'!L16*2+SUM('TTHM Goals'!J16:K16))/4),\"\",(('TTHM Goals'!L16*2+SUM('TTHM Goals'!J16:K16))/4))","v":""}]
[null,{"$f":"IF(ISBLANK('TTHM Goals'!A17),\"\",'TTHM Goals'!A17)","v":"(blank)"},null,null,{"$f":"IF(ISERROR(('TTHM Goals'!D17*2+SUM('TTHM Goals'!B17:C17))/4),\"\",(('TTHM Goals'!D17*2+SUM('TTHM Goals'!B17:C17))/4))","v":""},{"$f":"IF(ISERROR(('TTHM Goals'!E17*2+SUM('TTHM Goals'!C17:D17))/4),\"\",(('TTHM Goals'!E17*2+SUM('TTHM Goals'!C17:D17))/4))","v":""},{"$f":"IF(ISERROR(('TTHM Goals'!F17*2+SUM('TTHM Goals'!D17:E17))/4),\"\",(('TTHM Goals'!F17*2+SUM('TTHM Goals'!D17:E17))/4))","v":""},{"$f":"IF(ISERROR(('TTHM Goals'!G17*2+SUM('TTHM Goals'!E17:F17))/4),\"\",(('TTHM Goals'!G17*2+SUM('TTHM Goals'!E17:F17))/4))","v":""},{"$f":"IF(ISERROR(('TTHM Goals'!H17*2+SUM('TTHM Goals'!F17:G17))/4),\"\",(('TTHM Goals'!H17*2+SUM('TTHM Goals'!F17:G17))/4))","v":""},{"$f":"IF(ISERROR(('TTHM Goals'!I17*2+SUM('TTHM Goals'!G17:H17))/4),\"\",(('TTHM Goals'!I17*2+SUM('TTHM Goals'!G17:H17))/4))","v":""},{"$f":"IF(ISERROR(('TTHM Goals'!J17*2+SUM('TTHM Goals'!H17:I17))/4),\"\",(('TTHM Goals'!J17*2+SUM('TTHM Goals'!H17:I17))/4))","v":""},{"$f":"IF(ISERROR(('TTHM Goals'!K17*2+SUM('TTHM Goals'!I17:J17))/4),\"\",(('TTHM Goals'!K17*2+SUM('TTHM Goals'!I17:J17))/4))","v":""},{"$f":"IF(ISERROR(('TTHM Goals'!L17*2+SUM('TTHM Goals'!J17:K17))/4),\"\",(('TTHM Goals'!L17*2+SUM('TTHM Goals'!J17:K17))/4))","v":""}]
[null,{"$f":"IF(ISBLANK('TTHM Goals'!A18),\"\",'TTHM Goals'!A18)","v":"(blank)"},null,null,{"$f":"IF(ISERROR(('TTHM Goals'!D18*2+SUM('TTHM Goals'!B18:C18))/4),\"\",(('TTHM Goals'!D18*2+SUM('TTHM Goals'!B18:C18))/4))","v":""},{"$f":"IF(ISERROR(('TTHM Goals'!E18*2+SUM('TTHM Goals'!C18:D18))/4),\"\",(('TTHM Goals'!E18*2+SUM('TTHM Goals'!C18:D18))/4))","v":""},{"$f":"IF(ISERROR(('TTHM Goals'!F18*2+SUM('TTHM Goals'!D18:E18))/4),\"\",(('TTHM Goals'!F18*2+SUM('TTHM Goals'!D18:E18))/4))","v":""},{"$f":"IF(ISERROR(('TTHM Goals'!G18*2+SUM('TTHM Goals'!E18:F18))/4),\"\",(('TTHM Goals'!G18*2+SUM('TTHM Goals'!E18:F18))/4))","v":""},{"$f":"IF(ISERROR(('TTHM Goals'!H18*2+SUM('TTHM Goals'!F18:G18))/4),\"\",(('TTHM Goals'!H18*2+SUM('TTHM Goals'!F18:G18))/4))","v":""},{"$f":"IF(ISERROR(('TTHM Goals'!I18*2+SUM('TTHM Goals'!G18:H18))/4),\"\",(('TTHM Goals'!I18*2+SUM('TTHM Goals'!G18:H18))/4))","v":""},{"$f":"IF(ISERROR(('TTHM Goals'!J18*2+SUM('TTHM Goals'!H18:I18))/4),\"\",(('TTHM Goals'!J18*2+SUM('TTHM Goals'!H18:I18))/4))","v":""},{"$f":"IF(ISERROR(('TTHM Goals'!K18*2+SUM('TTHM Goals'!I18:J18))/4),\"\",(('TTHM Goals'!K18*2+SUM('TTHM Goals'!I18:J18))/4))","v":""},{"$f":"IF(ISERROR(('TTHM Goals'!L18*2+SUM('TTHM Goals'!J18:K18))/4),\"\",(('TTHM Goals'!L18*2+SUM('TTHM Goals'!J18:K18))/4))","v":""}]
{"$rows_left_out":36}
{"sheet":"Site Info","index":16,"n_rows":19,"n_cols":5,"rows_kept":19,"cut":false,"hidden":true,"merged":[]}
[null,"Note:  Change W longitude to negative value"]
[null,"Enter water qaulity data (e.g., chlorine residual) to plot in GE Graph from a summary table worksheet."]
[null,"Name","Latitude","Longitude","Value"]
[null,"EP",35.493000000000002,-94.221999999999994,1.25]
[null,"S5",35.499600000000001,-94.258799999999994,0.68]
[]
[]
[]
[]
[]
{"$rows_left_out":9}