{"text_format":"1","workbook":"xlsx","n_sheets":21,"sheets":["Instructions","DataEntryPaste","DataEntryValues","Summary","OptimizationTrend","LogProfile","MaxSed","SedSum","MaxFilter","FilterSum(1-4)","FilterSum(5-8)","FilterSum(9-12)","BW Data","BW Data Chart","BW Data PT","LT-Trend","LT-Settle","PT setup","LT-Filter","AllDataSort","MonthDist"],"not_rendered":{"charts":33,"images":2,"macros":1,"external_links":0,"defined_names":80,"comments":4,"pivot_tables":1},"unopened":[{"sheet":"LogProfile","index":5,"reason":"not_a_worksheet"},{"sheet":"MaxSed","index":6,"reason":"not_a_worksheet"},{"sheet":"MaxFilter","index":8,"reason":"not_a_worksheet"},{"sheet":"BW Data Chart","index":13,"reason":"not_a_worksheet"},{"sheet":"LT-Settle","index":16,"reason":"not_a_worksheet"},{"sheet":"LT-Filter","index":18,"reason":"not_a_worksheet"}],"bounds":{"document_bytes":16777216,"sheet_cells":100000,"rows_first":2000,"rows_last":500,"rows_between":2000,"halvings":0,"cell_chars":16384,"cell_head_chars":4096},"cells_cut":0,"cells_raw":0,"read":"whole","date_system":"1900"}

{"sheet":"Instructions","index":0,"n_rows":78,"n_cols":4,"rows_kept":78,"cut":false,"hidden":false,"merged":[]}
[null,"Optimization Assessment Software - Version 33"]
[null,"Instructions"]
["Entering data from another spreadsheet (copy/pasting):"]
["1.","When entering data sets from another spreadsheet, use the DataEntryPaste worksheet.  This will"]
[null,"reduce problems that could occur due to formatting differences.  "]
["2.","Before entering new data, you should clear the data entry area of any pre-existing data.  This can be"]
[null,"performed by clicking on the CLEAR button."]
["3.","After the data is entered, click the TRANSFER button to transfer the data to the database"]
[null,"i.e., Data Entry Values worksheet."]
[null,"Warning! The transfer button replaces all values in the Data Entry Values worksheet."]
["4.","Go to the DataEntryValues worksheet and enter the plant name and performance goals."]
["5.","Click the UPDATE button to develop the Summary and Optimization Trend Reports."]
[]
["Entering individual data from plant records:"]
["1.","When entering daily data from plant records, use the DataEntryValues worksheet."]
["2.","Before entering new data, you should clear the database of any pre-existing data.  This can be "]
[null,"performed by clicking on the CLEAR button."]
["3.","After data is entered, click on the UPDATE button to develop the Summary and Optimization Trend"]
[null,"Reports."]
[]
{"$rows_left_out":59}
{"sheet":"DataEntryPaste","index":1,"n_rows":380,"n_cols":19,"rows_kept":380,"cut":false,"hidden":false,"merged":[]}
[]
[]
[null,"Instruction to users:  Paste plant turbidity data sets into the data entry area below.  The "]
[null,"data entry area will hold 366 days of data.  Following data input, transfer data to the"]
[null,"database by clicking on the data TRANSFER button.  Go to the DataEntryValues "]
[null,"worksheet to enter the plant name and performance goals."]
[]
[]
[]
[]
[]
[]
["Data Entry Area for Posting Data Sets"]
["Date","Raw","Sed 1","Sed 2","Sed 3","Sed 4","Filter 1","Filter 2","Filter 3","Filter 4","Filter 5","Filter 6","Filter 7","Filter 8","Filter 9","Filter 10","Filter 11","Filter 12","Combined"]
["2016-01-01"]
[{"$f":"A15+1","v":"2016-01-02"}]
[{"$f":"A16+1","v":"2016-01-03"}]
["2016-01-04"]
["2016-01-05"]
["2016-01-06"]
{"$rows_left_out":361}
{"sheet":"DataEntryValues","index":2,"n_rows":380,"n_cols":32,"rows_kept":380,"cut":false,"hidden":false,"merged":[[1,6,1,10],[3,6,3,10],[4,6,4,10],[5,6,5,10],[2,6,2,10]]}
[]
[null,"Plant Name",null,null,null,null,"Rocky Mountain Water District"]
[null,"PWS #",null,null,null,null,1031009]
[null,"Max. settled water turbidity goal",null,null,null,null,2]
[null,"Filtered water turbidity optimization goal",null,null,null,null,0.1]
[null,"Filtered water turbidity regulation",null,null,null,null,0.3]
[null,"Instruction to users:  Input plant name and turbidity goals above.  Input start date"]
[null,"and turbidity data below.  The database will hold 366 days of data.  The turbidity data"]
[null,"entry cells will turn yellow if the value exceeds the process goal.  The IFE and CFE cells"]
[null,"will turn red if the value is less than or equal to 0.02 NTU (suggesting checking"]
[null,"intrument O&M and sample flow rate).  Following data input, develop the reports"]
[null,"by clicking the UPDATE button."]
["Data Entry Area"]
[null,"Raw","Sed 1","Sed 2","Sed 3","Sed 4","Filter 1","Filter 2","Filter 3","Filter 4","Filter 5","Filter 6","Filter 7","Filter 8","Filter 9","Filter 10","Filter 11","Filter 12","Combined",null,null,null,null,null,null,null,"MaxSed","MaxSedPlot","Sed Goal","Max Filter","MaxFilterPlot","Filter Goal"]
["2016-01-01",null,null,null,null,null,null,null,null,null,null,null,null,null,null,null,null,null,null,null,null,null,null,null,null,1,{"$f":"MAX(C15:F15)","v":0},null,{"$f":"$G$4","v":2},{"$f":"MAX(G15:R15)","v":0},null,{"$f":"$G$5","v":0.1}]
[{"$f":"A15+1","v":"2016-01-02"},null,null,null,null,null,null,null,null,null,null,null,null,null,null,null,null,null,null,null,null,null,null,null,null,{"$f":"Z15+1","v":2},{"$f":"MAX(C16:F16)","v":0},null,2,{"$f":"MAX(G16:R16)","v":0},null,0.1]
["2016-01-03",null,null,null,null,null,null,null,null,null,null,null,null,null,null,null,null,null,null,null,null,null,null,null,null,3,0,null,2,0,null,0.1]
["2016-01-04",null,null,null,null,null,null,null,null,null,null,null,null,null,null,null,null,null,null,null,null,null,null,null,null,4,0,null,2,0,null,0.1]
["2016-01-05",null,null,null,null,null,null,null,null,null,null,null,null,null,null,null,null,null,null,null,null,null,null,null,null,5,0,null,2,0,null,0.1]
["2016-01-06",null,null,null,null,null,null,null,null,null,null,null,null,null,null,null,null,null,null,null,null,null,null,null,null,6,0,null,2,0,null,0.1]
{"$rows_left_out":361}
{"sheet":"Summary","index":3,"n_rows":43,"n_cols":17,"rows_kept":43,"cut":false,"hidden":false,"merged":[[25,2,25,3],[24,2,24,4]]}
[]
[null,null,{"$f":"DataEntryValues!G2&\"  \"&DataEntryValues!G3","v":"Rocky Mountain Water District  1031009"},null,null,null,null,null,null,null,null,null,null,null,null,null,"Treatment Barrier Performance Summary"]
[]
[]
[]
[]
[]
[]
[]
[]
[]
[]
[]
[]
[]
[]
[]
[]
[]
[]
{"$rows_left_out":24}
{"sheet":"OptimizationTrend","index":4,"n_rows":40,"n_cols":28,"rows_kept":40,"cut":false,"hidden":false,"merged":[[4,3,4,10],[4,11,4,27],[5,3,5,6],[5,8,5,10],[5,11,5,24],[5,25,5,27]]}
[]
[null,null,{"$f":"DataEntryValues!G2&\"  \"&DataEntryValues!G3","v":"Rocky Mountain Water District  1031009"},null,null,null,null,null,null,null,null,null,null,null,null,null,null,null,null,null,null,null,null,null,"Optimization Trend Report"]
[]
[]
[null,null,null,"Settled Water Turbidity",null,null,null,null,null,null,null,"Filtered Water Turbidity"]
[null,null,null,"95th Percentile Values (NTU)",null,null,null,null,"% Values Meeting Goal",null,null,"95th Percentile Values (NTU)",null,null,null,null,null,null,null,null,null,null,null,null,null,"% Values Meeting Goal All Filters"]
[null,null,null,"Sed 1","Sed 2","Sed 3","Sed 4","All Sed","3 NTU","2 NTU","1 NTU","Filter 1","Filter 2","Filter 3","Filter 4","Filter 5","Filter 6","Filter 7","Filter 8","Filter 9","Filter 10","Filter 11","Filter 12","Combined","All Filters",0.3,0.2,0.1]
[null,null,"2016-01-01"]
[null,null,"2016-02-01"]
[null,null,"2016-03-01"]
[null,null,"2016-04-01"]
[null,null,"2016-05-01"]
[null,null,"2016-06-01"]
[null,null,"2016-07-01"]
[null,null,"2016-08-01"]
[null,null,"2016-09-01"]
[null,null,"2016-10-01"]
[null,null,"2016-11-01"]
[null,null,"2016-12-01"]
[null,null,"Yr. 95%",{"$f":"IF(SUM(DataEntryValues!C15:C380)=0,,PERCENTILE(DataEntryValues!C15:C380,0.95))","v":0},{"$f":"IF(SUM(DataEntryValues!D15:D380)=0,,PERCENTILE(DataEntryValues!D15:D380,0.95))","v":0},{"$f":"IF(SUM(DataEntryValues!E15:E380)=0,,PERCENTILE(DataEntryValues!E15:E380,0.95))","v":0},{"$f":"IF(SUM(DataEntryValues!F15:F380)=0,,PERCENTILE(DataEntryValues!F15:F380,0.95))","v":0},null,null,null,null,{"$f":"IF(SUM(DataEntryValues!G15:G380)=0,,PERCENTILE(DataEntryValues!G15:G380,0.95))","v":0},{"$f":"IF(SUM(DataEntryValues!H15:H380)=0,,PERCENTILE(DataEntryValues!H15:H380,0.95))","v":0},{"$f":"IF(SUM(DataEntryValues!I15:I380)=0,,PERCENTILE(DataEntryValues!I15:I380,0.95))","v":0},{"$f":"IF(SUM(DataEntryValues!J15:J380)=0,,PERCENTILE(DataEntryValues!J15:J380,0.95))","v":0},{"$f":"IF(SUM(DataEntryValues!K15:K380)=0,,PERCENTILE(DataEntryValues!K15:K380,0.95))","v":0},{"$f":"IF(SUM(DataEntryValues!L15:L380)=0,,PERCENTILE(DataEntryValues!L15:L380,0.95))","v":0},{"$f":"IF(SUM(DataEntryValues!M15:M380)=0,,PERCENTILE(DataEntryValues!M15:M380,0.95))","v":0},{"$f":"IF(SUM(DataEntryValues!N15:N380)=0,,PERCENTILE(DataEntryValues!N15:N380,0.95))","v":0},{"$f":"IF(SUM(DataEntryValues!O15:O380)=0,,PERCENTILE(DataEntryValues!O15:O380,0.95))","v":0},{"$f":"IF(SUM(DataEntryValues!P15:P380)=0,,PERCENTILE(DataEntryValues!P15:P380,0.95))","v":0},{"$f":"IF(SUM(DataEntryValues!Q15:Q380)=0,,PERCENTILE(DataEntryValues!Q15:Q380,0.95))","v":0},{"$f":"IF(SUM(DataEntryValues!R15:R380)=0,,PERCENTILE(DataEntryValues!R15:R380,0.95))","v":0},{"$f":"IF(SUM([0]!Comb)=0,,PERCENTILE([0]!Comb,0.95))","v":0}]
{"$rows_left_out":21}
{"sheet":"SedSum","index":7,"n_rows":1,"n_cols":1,"rows_kept":1,"cut":false,"hidden":false,"merged":[[0,0,0,12]]}
["Sedimentation Performance Summary"]

{"sheet":"FilterSum(1-4)","index":9,"n_rows":1,"n_cols":1,"rows_kept":1,"cut":false,"hidden":false,"merged":[[0,0,0,12]]}
["Filtration Performance Summary (Filters 1 - 4)"]

{"sheet":"FilterSum(5-8)","index":10,"n_rows":1,"n_cols":1,"rows_kept":1,"cut":false,"hidden":false,"merged":[[0,0,0,12]]}
["Filtration Performance Summary (Filters 5 - 8)"]

{"sheet":"FilterSum(9-12)","index":11,"n_rows":1,"n_cols":1,"rows_kept":1,"cut":false,"hidden":false,"merged":[[0,0,0,12]]}
["Filtration Performance Summary (Filters 9 - 12)"]

{"sheet":"BW Data","index":12,"n_rows":632,"n_cols":20,"rows_kept":632,"cut":false,"hidden":false,"merged":[]}
[null,"Data input screen for filter backwash data."]
[null,"For filters with filter-to-waste (FTW) capability, input three values",null,null,null,null,null,"Return to Service Turbidity (% values <= goal)"]
[null,"per backwash: 1) max. turbidity during FTW period, 2) turbidity at",null,null,null,null,null,null,"Filter #"]
[null,"return to service (RTS) and 3) FTW time.",null,null,null,null,null,"Goal",1,2,3,4,5,6,7,8,9,10,11,12]
[null,"For filters without FTW capability, input two values per backwash:",null,null,null,null,null,"Peak",{"$f":"IFERROR(COUNTIFS(Table1[Filter],I4,Table1[Peak Turbidity],\"<=\"&ROUND($D$10,2))/COUNTIF(Table1[Filter],I4),\"\")","v":0.93396226415094341},{"$f":"IFERROR(COUNTIFS(Table1[Filter],J4,Table1[Peak Turbidity],\"<=\"&ROUND($D$10,2))/COUNTIF(Table1[Filter],J4),\"\")","v":0.95959595959595956},{"$f":"IFERROR(COUNTIFS(Table1[Filter],K4,Table1[Peak Turbidity],\"<=\"&ROUND($D$10,2))/COUNTIF(Table1[Filter],K4),\"\")","v":0.92307692307692313},{"$f":"IFERROR(COUNTIFS(Table1[Filter],L4,Table1[Peak Turbidity],\"<=\"&ROUND($D$10,2))/COUNTIF(Table1[Filter],L4),\"\")","v":0.93396226415094341},{"$f":"IFERROR(COUNTIFS(Table1[Filter],M4,Table1[Peak Turbidity],\"<=\"&ROUND($D$10,2))/COUNTIF(Table1[Filter],M4),\"\")","v":0.95959595959595956},{"$f":"IFERROR(COUNTIFS(Table1[Filter],N4,Table1[Peak Turbidity],\"<=\"&ROUND($D$10,2))/COUNTIF(Table1[Filter],N4),\"\")","v":0.92307692307692313},{"$f":"IFERROR(COUNTIFS(Table1[Filter],O4,Table1[Peak Turbidity],\"<=\"&ROUND($D$10,2))/COUNTIF(Table1[Filter],O4),\"\")","v":""},{"$f":"IFERROR(COUNTIFS(Table1[Filter],P4,Table1[Peak Turbidity],\"<=\"&ROUND($D$10,2))/COUNTIF(Table1[Filter],P4),\"\")","v":""},{"$f":"IFERROR(COUNTIFS(Table1[Filter],Q4,Table1[Peak Turbidity],\"<=\"&ROUND($D$10,2))/COUNTIF(Table1[Filter],Q4),\"\")","v":""},{"$f":"IFERROR(COUNTIFS(Table1[Filter],R4,Table1[Peak Turbidity],\"<=\"&ROUND($D$10,2))/COUNTIF(Table1[Filter],R4),\"\")","v":""},{"$f":"IFERROR(COUNTIFS(Table1[Filter],S4,Table1[Peak Turbidity],\"<=\"&ROUND($D$10,2))/COUNTIF(Table1[Filter],S4),\"\")","v":""},{"$f":"IFERROR(COUNTIFS(Table1[Filter],T4,Table1[Peak Turbidity],\"<=\"&ROUND($D$10,2))/COUNTIF(Table1[Filter],T4),\"\")","v":""}]
[null,"1) max. turbidity during initial 15 minutes of filter run and",null,null,null,null,null,"RTS",{"$f":"IFERROR(COUNTIFS(Table1[Filter],I4,Table1[RTS Turbidity],\"<=\"&ROUND($E$10,2))/COUNTIF(Table1[Filter],I4),\"\")","v":0.68867924528301883},{"$f":"IFERROR(COUNTIFS(Table1[Filter],J4,Table1[RTS Turbidity],\"<=\"&ROUND($E$10,2))/COUNTIF(Table1[Filter],J4),\"\")","v":0.77777777777777779},{"$f":"IFERROR(COUNTIFS(Table1[Filter],K4,Table1[RTS Turbidity],\"<=\"&ROUND($E$10,2))/COUNTIF(Table1[Filter],K4),\"\")","v":0.75961538461538458},{"$f":"IFERROR(COUNTIFS(Table1[Filter],L4,Table1[RTS Turbidity],\"<=\"&ROUND($E$10,2))/COUNTIF(Table1[Filter],L4),\"\")","v":0.68867924528301883},{"$f":"IFERROR(COUNTIFS(Table1[Filter],M4,Table1[RTS Turbidity],\"<=\"&ROUND($E$10,2))/COUNTIF(Table1[Filter],M4),\"\")","v":0.77777777777777779},{"$f":"IFERROR(COUNTIFS(Table1[Filter],N4,Table1[RTS Turbidity],\"<=\"&ROUND($E$10,2))/COUNTIF(Table1[Filter],N4),\"\")","v":0.75961538461538458},{"$f":"IFERROR(COUNTIFS(Table1[Filter],O4,Table1[RTS Turbidity],\"<=\"&ROUND($E$10,2))/COUNTIF(Table1[Filter],O4),\"\")","v":""},{"$f":"IFERROR(COUNTIFS(Table1[Filter],P4,Table1[RTS Turbidity],\"<=\"&ROUND($E$10,2))/COUNTIF(Table1[Filter],P4),\"\")","v":""},{"$f":"IFERROR(COUNTIFS(Table1[Filter],Q4,Table1[RTS Turbidity],\"<=\"&ROUND($E$10,2))/COUNTIF(Table1[Filter],Q4),\"\")","v":""},{"$f":"IFERROR(COUNTIFS(Table1[Filter],R4,Table1[RTS Turbidity],\"<=\"&ROUND($E$10,2))/COUNTIF(Table1[Filter],R4),\"\")","v":""},{"$f":"IFERROR(COUNTIFS(Table1[Filter],S4,Table1[RTS Turbidity],\"<=\"&ROUND($E$10,2))/COUNTIF(Table1[Filter],S4),\"\")","v":""},{"$f":"IFERROR(COUNTIFS(Table1[Filter],T4,Table1[RTS Turbidity],\"<=\"&ROUND($E$10,2))/COUNTIF(Table1[Filter],T4),\"\")","v":""}]
[null,"2) turbidity after 15 minutes of filter run."]
[null,"To start, delete rows with demo data, but leave a few rows for new."]
[null,"Add new data to bottom of table.",null,null,null,null,null,"Turbidity during FTW (95th percentile)"]
[null,null,"Perf. Goals (NTU)",0.3,0.1,"Avg FTW",null,null,"Filter #"]
[null,null,"% values <= Goal",{"$f":"COUNTIF(D15:D632,\"<=\"&ROUND(D10,2))/COUNT(D15:D632)*100","v":94.155844155844164},{"$f":"COUNTIF(E15:E632,\"<=\"&ROUND(E10,2))/COUNT(E15:E632)*100","v":74.110032362459549},"Time",null,"Percentile",1,2,3,4,5,6,7,8,9,10,11,12]
[null,null,"95th % NTU",{"$f":"IF(SUM(D15:D632)=0,\"\",PERCENTILE(D15:D632,0.95))","v":0.32500000000000001},{"$f":"IF(SUM(E15:E632)=0,\"\",PERCENTILE(E15:E632,0.95))","v":0.17},{"$f":"IF(SUM(F15:F632)=0,\"\",AVERAGE(F15:F632))","v":24.708737864077669},null,"Peak",{"$f":"IFERROR(PERCENTILE(IF(Table1[Filter]=I$11,Table1[Peak Turbidity],\"\"),0.95),\"\")","v":0.3115},{"$f":"IFERROR(PERCENTILE(IF(Table1[Filter]=J$11,Table1[Peak Turbidity],\"\"),0.95),\"\")","v":0.2745999999999999},{"$f":"IFERROR(PERCENTILE(IF(Table1[Filter]=K$11,Table1[Peak Turbidity],\"\"),0.95),\"\")","v":0.33079999999999998},{"$f":"IFERROR(PERCENTILE(IF(Table1[Filter]=L$11,Table1[Peak Turbidity],\"\"),0.95),\"\")","v":0.3115},{"$f":"IFERROR(PERCENTILE(IF(Table1[Filter]=M$11,Table1[Peak Turbidity],\"\"),0.95),\"\")","v":0.2745999999999999},{"$f":"IFERROR(PERCENTILE(IF(Table1[Filter]=N$11,Table1[Peak Turbidity],\"\"),0.95),\"\")","v":0.33079999999999998},{"$f":"IFERROR(PERCENTILE(IF(Table1[Filter]=O$11,Table1[Peak Turbidity],\"\"),0.95),\"\")","v":""},{"$f":"IFERROR(PERCENTILE(IF(Table1[Filter]=P$11,Table1[Peak Turbidity],\"\"),0.95),\"\")","v":""},{"$f":"IFERROR(PERCENTILE(IF(Table1[Filter]=Q$11,Table1[Peak Turbidity],\"\"),0.95),\"\")","v":""},{"$f":"IFERROR(PERCENTILE(IF(Table1[Filter]=R$11,Table1[Peak Turbidity],\"\"),0.95),\"\")","v":""},{"$f":"IFERROR(PERCENTILE(IF(Table1[Filter]=S$11,Table1[Peak Turbidity],\"\"),0.95),\"\")","v":""},{"$f":"IFERROR(PERCENTILE(IF(Table1[Filter]=T$11,Table1[Peak Turbidity],\"\"),0.95),\"\")","v":""}]
[null,null,null,null,null,null,null,"RTS",{"$f":"IFERROR(PERCENTILE(IF(Table1[Filter]=I$11,Table1[RTS Turbidity],\"\"),0.95),\"\")","v":0.161},{"$f":"IFERROR(PERCENTILE(IF(Table1[Filter]=J$11,Table1[RTS Turbidity],\"\"),0.95),\"\")","v":0.18439999999999993},{"$f":"IFERROR(PERCENTILE(IF(Table1[Filter]=K$11,Table1[RTS Turbidity],\"\"),0.95),\"\")","v":0.15934999999999994},{"$f":"IFERROR(PERCENTILE(IF(Table1[Filter]=L$11,Table1[RTS Turbidity],\"\"),0.95),\"\")","v":0.161},{"$f":"IFERROR(PERCENTILE(IF(Table1[Filter]=M$11,Table1[RTS Turbidity],\"\"),0.95),\"\")","v":0.18439999999999993},{"$f":"IFERROR(PERCENTILE(IF(Table1[Filter]=N$11,Table1[RTS Turbidity],\"\"),0.95),\"\")","v":0.15934999999999994},{"$f":"IFERROR(PERCENTILE(IF(Table1[Filter]=O$11,Table1[RTS Turbidity],\"\"),0.95),\"\")","v":""},{"$f":"IFERROR(PERCENTILE(IF(Table1[Filter]=P$11,Table1[RTS Turbidity],\"\"),0.95),\"\")","v":""},{"$f":"IFERROR(PERCENTILE(IF(Table1[Filter]=Q$11,Table1[RTS Turbidity],\"\"),0.95),\"\")","v":""},{"$f":"IFERROR(PERCENTILE(IF(Table1[Filter]=R$11,Table1[RTS Turbidity],\"\"),0.95),\"\")","v":""},{"$f":"IFERROR(PERCENTILE(IF(Table1[Filter]=S$11,Table1[RTS Turbidity],\"\"),0.95),\"\")","v":""},{"$f":"IFERROR(PERCENTILE(IF(Table1[Filter]=T$11,Table1[RTS Turbidity],\"\"),0.95),\"\")","v":""}]
[null,"BW Date","Filter","Peak Turbidity","RTS Turbidity","FTW Time (min)"]
[null,"2008-01-01",3,0.10100000000000001,5.8999999999999997E-2,15]
[null,"2008-01-01",6,0.10100000000000001,5.8999999999999997E-2,15]
[null,"2008-01-02",2,0.16400000000000001,9.8000000000000004E-2,25]
[null,"2008-01-02",5,0.16400000000000001,9.8000000000000004E-2,25]
[null,"2008-01-02",1,0.109,9.8000000000000004E-2,15]
[null,"2008-01-02",4,0.109,9.8000000000000004E-2,15]
{"$rows_left_out":613}
{"sheet":"BW Data PT","index":14,"n_rows":110,"n_cols":4,"rows_kept":110,"cut":false,"hidden":false,"merged":[]}
["Filter",1,null,"Pivot table for creating charts. Do not enter data here."]
[]
["Row Labels","Average of FTW Time (min)","Max of Peak Turbidity","Max of RTS Turbidity"]
["2008-01-02",15,0.109,9.8000000000000004E-2]
["2008-01-09",15,9.0999999999999998E-2,8.5999999999999993E-2]
["2008-01-11",20,0.125,0.11899999999999999]
["2008-01-15",15,9.9000000000000005E-2,9.0999999999999998E-2]
["2008-01-17",22,0.11899999999999999,9.8000000000000004E-2]
["2008-01-19",22,0.107,9.9000000000000005E-2]
["2008-01-22",30,0.13100000000000001,9.9000000000000005E-2]
["2008-01-24",25,0.17899999999999999,0.16800000000000001]
["2008-01-27",14,7.8E-2,7.0999999999999994E-2]
["2008-01-30",17,7.4999999999999997E-2,6.6000000000000003E-2]
["2008-02-02",14,7.0999999999999994E-2,7.0000000000000007E-2]
["2008-02-07",50,0.115,0.111]
["2008-02-08",30,0.74199999999999999,0.105]
["2008-02-13",22,0.1,9.0999999999999998E-2]
["2008-02-15",30,0.125,0.1]
["2008-02-17",35,0.127,9.6000000000000002E-2]
["2008-02-19",150,null,0.14899999999999999]
{"$rows_left_out":91}
{"sheet":"LT-Trend","index":15,"n_rows":61,"n_cols":10,"rows_kept":61,"cut":false,"hidden":false,"merged":[]}
[]
[]
[null,null,"Settled Water (All Sed)",null,null,null,"Filtered Water (All Filters)"]
[null,null,"Turbidity","% Values Meeting Goal",null,null,"Turbidity","% Values Meeting Goal"]
[null,"Month/Yr","95th %","3 NTU","2 NTU","1 NTU","95th %","0.3 NTU","0.2 NTU","0.1 NTU"]
[null,"2016-01-01"]
[null,"2016-02-01"]
[null,"2016-03-01"]
[null,"2016-04-01"]
[null,"2016-05-01"]
[null,"2016-06-01"]
[null,"2016-07-01"]
[null,"2016-08-01"]
[null,"2016-09-01"]
[null,"2016-10-01"]
[null,"2016-11-01"]
[null,"2016-12-01"]
[]
[null,"The area in blue can be copied to the long-term trend table below to develop up to three year trend charts."]
[null,"Delete example data."]
{"$rows_left_out":42}
{"sheet":"PT setup","index":17,"n_rows":1,"n_cols":2,"rows_kept":1,"cut":false,"hidden":true,"merged":[]}
[null,"Use to screen shots to recreate BW pivot table and charts"]

{"sheet":"AllDataSort","index":19,"n_rows":371,"n_cols":32,"rows_kept":371,"cut":false,"hidden":true,"merged":[]}
[]
[null,null,null,null,null,{"$f":"DataEntryValues!G2","v":"Rocky Mountain Water District"},null,null,null,"2016-02-01"]
[null,null,null,null,null,"Cell to identify if year is a leap year or not.",null,null,null,{"$f":"IF(MOD(YEAR(J2)/4,1)=0,1,2)","v":1}]
[null,null,null,null,"Data Entry Area",null,null,null,null,null,null,null,null,null,null,null,null,null,null,null,null,null,null,null,null,null,null,null,null,null,null,"Yearly Data Sort Table"]
["FebValue","FebFind",null,null,null,"Raw","Sed 1","Sed 2","Sed 3","Sed 4","Filter 1","Filter 2","Filter 3","Filter 4","Filter 5","Filter 6","Filter 7","Filter 8","Filter 9","Filter 10","Filter 11","Filter 12","Combined"]
[0,{"$f":"IF(MONTH(E6)=2,\"feb\",)","v":0},{"$f":"MONTH(E6)","v":1},1,"2016-01-01"]
[0,0,{"$f":"MONTH(E7)","v":1},1,"2016-01-02"]
[0,0,1,1,"2016-01-03"]
[0,0,1,1,"2016-01-04"]
[0,0,1,1,"2016-01-05"]
[0,0,1,1,"2016-01-06"]
[0,0,1,1,"2016-01-07"]
[0,0,1,1,"2016-01-08"]
[0,0,1,1,"2016-01-09"]
[0,0,1,1,"2016-01-10"]
[0,0,1,1,"2016-01-11"]
[0,0,1,1,"2016-01-12"]
[0,0,1,1,"2016-01-13"]
[0,0,1,1,"2016-01-14"]
[0,0,1,1,"2016-01-15"]
{"$rows_left_out":352}
{"sheet":"MonthDist","index":20,"n_rows":43,"n_cols":29,"rows_kept":43,"cut":false,"hidden":true,"merged":[]}
[null,"Settled Turbidity",null,null,null,null,null,null,null,"Filtered Turbidity"]
["MONTH","Sed1 95%","Sed2 95%","Sed3 95%","Sed4 95%","All Sed 95th P","Goal 3","Goal 2","Goal 1","95% #1","95% #2","95% #3","95% #4","95% #5","95% #6","95% #7","95% #8","95% #9","95% #10","95% #11","95% #12","95% Comb","95% All Filters","Goal .3","Goal .2","Goal .1"]
[{"$f":"MonthStart","v":"2016-12-01"},{"$f":"IF(SUM(_Sed1)=0,,PERCENTILE(_Sed1,0.95))","v":0},{"$f":"IF(SUM(_Sed2)=0,,PERCENTILE(_Sed2,0.95))","v":0},{"$f":"IF(SUM(_Sed3)=0,,PERCENTILE(_Sed3,0.95))","v":0},{"$f":"IF(SUM(_Sed4)=0,,PERCENTILE(_Sed4,0.95))","v":0},{"$f":"IF(SUM(SedGoalPercent)=0,,PERCENTILE(SedGoalPercent,0.95))","v":0},{"$f":"IF(SUM(SedGoalPercent)=0,,100*FREQUENCY(SedGoalPercent,3)/COUNT(SedGoalPercent))","v":0},{"$f":"IF(SUM(SedGoalPercent)=0,,100*FREQUENCY(SedGoalPercent,2)/COUNT(SedGoalPercent))","v":0},{"$f":"IF(SUM(SedGoalPercent)=0,,100*FREQUENCY(SedGoalPercent,1)/COUNT(SedGoalPercent))","v":0},{"$f":"IF(SUM(Filter1)=0,,PERCENTILE(Filter1,0.95))","v":0},{"$f":"IF(SUM(Filter2)=0,,PERCENTILE(Filter2,0.95))","v":0},{"$f":"IF(SUM(Filter3)=0,,PERCENTILE(Filter3,0.95))","v":0},{"$f":"IF(SUM(Filter4)=0,,PERCENTILE(Filter4,0.95))","v":0},{"$f":"IF(SUM(Filter5)=0,,PERCENTILE(Filter5,0.95))","v":0},{"$f":"IF(SUM(Filter6)=0,,PERCENTILE(Filter6,0.95))","v":0},{"$f":"IF(SUM(Filter7)=0,,PERCENTILE(Filter7,0.95))","v":0},{"$f":"IF(SUM(Filter8)=0,,PERCENTILE(Filter8,0.95))","v":0},{"$f":"IF(SUM(Filter9)=0,,PERCENTILE(Filter9,0.95))","v":0},{"$f":"IF(SUM(Filter10)=0,,PERCENTILE(Filter10,0.95))","v":0},{"$f":"IF(SUM(Filter11)=0,,PERCENTILE(Filter11,0.95))","v":0},{"$f":"IF(SUM(Filter12)=0,,PERCENTILE(Filter12,0.95))","v":0},{"$f":"IF(SUM(Combined)=0,,PERCENTILE(Combined,0.95))","v":0},{"$f":"IF(SUM(FilterGoalPercent)=0,,PERCENTILE(FilterGoalPercent,0.95))","v":0},{"$f":"IF(SUM(FilterGoalPercent)=0,,100*FREQUENCY(FilterGoalPercent,0.3)/COUNT(FilterGoalPercent))","v":0},{"$f":"IF(SUM(FilterGoalPercent)=0,,100*FREQUENCY(FilterGoalPercent,0.2)/COUNT(FilterGoalPercent))","v":0},{"$f":"IF(SUM(FilterGoalPercent)=0,,100*FREQUENCY(FilterGoalPercent,0.1)/COUNT(FilterGoalPercent))","v":0}]
[]
[]
["Monthly Data"]
[null,"Raw","Sed 1","Sed 2","Sed 3","Sed 4","Filter 1","Filter 2","Filter 3","Filter 4","Filter 5","Filter 6","Filter 7","Filter 8","Filter 9","Filter 10","Filter 11","Filter 12","Combined"]
[]
[]
["2016-12-01"]
["2016-12-02"]
["2016-12-03"]
["2016-12-04"]
["2016-12-05"]
["2016-12-06"]
["2016-12-07"]
["2016-12-08"]
["2016-12-09"]
["2016-12-10"]
["2016-12-11"]
{"$rows_left_out":23}