{"text_format":"1","workbook":"xlsx","n_sheets":8,"sheets":["Instructions","Outcomes","Dynamic Formula","Printable Summary","Weights","Historical Trends","FAQs","Working"],"not_rendered":{"charts":0,"images":1,"macros":1,"external_links":0,"defined_names":8,"comments":2,"pivot_tables":0},"unopened":[],"bounds":{"document_bytes":16777216,"sheet_cells":100000,"rows_first":2000,"rows_last":500,"rows_between":2000,"halvings":0,"cell_chars":16384,"cell_head_chars":4096},"cells_cut":0,"cells_raw":0,"read":"whole","date_system":"1900"}

{"sheet":"Instructions","index":0,"n_rows":40,"n_cols":11,"rows_kept":40,"cut":false,"hidden":false,"merged":[[83,8,83,9],[0,1,0,13],[1,1,1,13],[79,2,79,11],[80,2,80,11],[82,8,82,9]]}
[null,"Tennessee Higher Education Commission"]
[null,"Outcomes-Based Funding Dynamic Simulation Instructions"]
[]
[]
[]
[]
[]
[]
[]
[]
[null,null,102,null,null,null,101,null,null,null,100]
[]
[null,null,0.01,0.01,0.01,0.01,0.01,0.01,0.01,0.01,0.01]
[null,null,0.01,0.01,0.01,0.01,0.01,0.01,0.01,0.01,0.01]
[null,null,0.01,0.01,0.01,0.01,0.01,0.01,0.01,0.01,0.01]
[null,null,0.01,0.01,0.01,0.01,0.01,0.01,0.01,0.01,0.01]
[null,null,0.01,0.01,0.01,0.01,0.01,0.01,0.01,0.01,0.01]
[null,null,0.01,0.01,0.01,0.01,0.01,0.01,0.01,0.01,0.01]
[null,null,0.01,0.01,0.01,0.01,0.01,0.01,0.01,0.01,0.01]
[null,null,0.01,0.01,0.01,0.01,0.01,0.01,0.01,0.01,0.01]
{"$rows_left_out":21}
{"sheet":"Outcomes","index":1,"n_rows":306,"n_cols":47,"rows_kept":306,"cut":false,"hidden":false,"merged":[[0,1,0,14],[1,1,1,14],[2,2,2,3],[3,9,3,11],[4,9,4,11],[197,1,197,2],[249,25,249,29],[301,2,301,10],[5,20,5,22],[7,13,7,14],[28,11,28,12],[40,11,40,12],[110,18,110,22],[176,2,176,14],[5,9,5,11]]}
[null,"Tennessee Higher Education Commission"]
[null,"Estimated Changes in FY 2015-16 Formula Outcomes"]
[null,null,"Select institutions:"]
[null,null,"Chattanooga","APSU","All CC","All 4yr","All TCAT","Total",null,"14-15 Appropriations",null,null,{"$f":"'Printable Summary'!C6","v":827231300}]
[null,"Change in Est. Funding",{"$f":"VLOOKUP(C4,'Printable Summary'!F6:H30,2,0)","v":0},{"$f":"VLOOKUP(D4,'Printable Summary'!F6:H31,2,0)","v":0},{"$f":"'Printable Summary'!G27","v":0},{"$f":"'Printable Summary'!G12+'Printable Summary'!G32","v":0},{"$f":"'Printable Summary'!G34","v":0},{"$f":"'Printable Summary'!G36","v":0},null,"Estimated 15-16 Appropriations",null,null,{"$f":"'Printable Summary'!C7","v":827231300}]
[null,"Percent Change in Est. Funding",{"$f":"VLOOKUP(C4,'Printable Summary'!F6:H30,3,0)","v":0},{"$f":"VLOOKUP(D4,'Printable Summary'!F6:H31,3,0)","v":0},{"$f":"'Printable Summary'!H27","v":0},{"$f":"SUM('Printable Summary'!G12,'Printable Summary'!G32)/(SUM(Working!C13,Working!C33))","v":0},{"$f":"'Printable Summary'!H34","v":0},{"$f":"'Printable Summary'!H36","v":0},null,"Change",null,null,{"$f":"'Printable Summary'!C9","v":0},{"$f":"'Printable Summary'!C8","v":0},null,null,null,null,null,null,"WORKING AREA------"]
[null,"Change in Weighted Outcomes ",{"$f":"HLOOKUP($C$4,$R$135:$AE$139,5,0)","v":0},{"$f":"HLOOKUP($D$4,$R$276:$Z$281,5,0)","v":0},{"$f":"AE139","v":0},{"$f":"AA280","v":0},"n/a",{"$f":"AE139+AA280","v":0}]
[null,"Change in Weighted Outcomes ",{"$f":"HLOOKUP(C4, R135:AE140, 6,0)","v":0},{"$f":"HLOOKUP($D$4,$R$276:$Z$281,6,0)","v":0},{"$f":"E7/AE136","v":0},{"$f":"F7/AA277","v":0},"n/a",{"$f":"H7/(AE136+AA277)","v":0}]
[]
[]
[null,"CC Outcomes Annual Changes","Chattanooga","Cleveland","Columbia","Dyersburg","Jackson","Motlow","Nashville","Northeast","Pellissippi","Roane","Southwest","Volunteer","Walters",null,null,null,null,null,{"$f":"C4","v":"Chattanooga"},null,"Avg CC Change",null,null,null,null,"Change in Weighted Outcomes ",3.3333333333331705E-3,3.3333333333332793E-3,6.6666666666667564E-3,5.7130810667704738E-3]
[null,"Students Accumulating 12 hrs",0,0,0,0,0,0,0,0,0,0,0,0,0,null,null,null,null,null,{"$f":"HLOOKUP($U$11,$C$11:$O$25,2)","v":0},null,{"$f":"AVERAGE(C12:O12)","v":0},{"$f":"13*W12","v":0},null,null,null,null,{"$f":"C4","v":"Chattanooga"},{"$f":"E4","v":"All CC"},{"$f":"F4","v":"All 4yr"},{"$f":"H4","v":"Total"}]
[null,"Students Accumulating 24 hrs",0,0,0,0,0,0,0,0,0,0,0,0,0,null,null,null,null,null,{"$f":"HLOOKUP($U$11,$C$11:$O$25,3)","v":0},null,{"$f":"AVERAGE(C13:O13)","v":0},0,null,null,null,"Change in Appropriations",{"$f":"C6","v":0},{"$f":"E6","v":0},{"$f":"F6","v":0},{"$f":"H6","v":0}]
[null,"Students Accumulating 36 hrs",0,0,0,0,0,0,0,0,0,0,0,0,0,null,null,null,null,null,{"$f":"HLOOKUP($U$11,$C$11:$O$25,4)","v":0},null,0,0,null,null,null,"Change in Weighted Outcomes ",{"$f":"C8","v":0},{"$f":"E8","v":0},{"$f":"F8","v":0},{"$f":"H8","v":0}]
[null,"Dual Enrollment",0,0,0,0,0,0,0,0,0,0,0,0,0,null,null,null,null,null,{"$f":"HLOOKUP($U$11,$C$11:$O$25,5)","v":0},null,0,0]
[null,"Associates",0,0,0,0,0,0,0,0,0,0,0,0,0,null,null,null,null,null,{"$f":"HLOOKUP($U$11,$C$11:$O$25,6)","v":0},null,0,0]
[null,"Certificates 1-2 Years",0,0,0,0,0,0,0,0,0,0,0,0,0,null,null,null,null,null,{"$f":"HLOOKUP($U$11,$C$11:$O$25,7)","v":0},null,0,0]
[null,"Certificates Less Than 1 Year",0,0,0,0,0,0,0,0,0,0,0,0,0,null,null,null,null,null,{"$f":"HLOOKUP($U$11,$C$11:$O$25,8)","v":0},null,0,0]
[null,"Job Placements",0,0,0,0,0,0,0,0,0,0,0,0,0,null,null,null,null,null,{"$f":"HLOOKUP($U$11,$C$11:$O$25,9)","v":0},null,0,0]
[null,"R & D Success",0,0,0,0,0,0,0,0,0,0,0,0,0,null,null,null,null,null,{"$f":"HLOOKUP($U$11,$C$11:$O$25,10)","v":0},null,0,0]
{"$rows_left_out":287}
{"sheet":"Dynamic Formula","index":2,"n_rows":128,"n_cols":40,"rows_kept":128,"cut":false,"hidden":false,"merged":[[3,1,30,1],[3,2,3,12],[3,14,5,16],[3,17,5,18],[6,5,29,5],[6,6,8,6],[6,7,29,7],[6,9,29,9],[6,10,8,10],[6,11,29,11],[6,12,8,12],[6,15,6,16],[6,17,6,18],[7,15,7,16],[7,17,7,18],[8,15,8,16],[8,17,8,18],[27,14,27,16],[12,6,14,6],[12,10,14,10],[12,12,14,12],[12,15,12,16],[12,17,12,18],[13,17,13,18],[14,17,15,18],[9,6,11,6],[9,10,11,10],[9,12,11,12],[10,15,10,16],[9,17,9,18],[10,17,10,18],[11,15,11,16],[11,17,11,18],[9,15,9,16],[22,6,24,6],[22,10,24,10],[22,12,24,12],[22,14,24,16],[22,17,24,18],[25,14,26,14],[25,15,26,16],[25,17,26,18],[16,6,18,6],[16,10,18,10],[16,12,18,12],[16,17,16,18],[17,17,17,18],[19,6,21,6],[19,10,21,10],[19,12,21,12],[27,17,30,18],[28,14,28,16],[29,14,29,16],[32,1,53,1],[32,2,32,12],[32,14,34,16],[32,17,34,18],[35,5,52,5],[35,6,37,6],[35,7,52,7],[38,6,40,6],[38,10,40,10],[38,12,40,12],[39,15,39,16],[38,17,38,18],[39,17,39,18],[40,15,40,16],[40,17,40,18],[35,9,52,9],[35,10,37,10],[35,11,52,11],[35,12,37,12],[35,15,35,16],[35,17,35,18],[36,15,36,16],[36,17,36,18],[37,15,37,16],[37,17,37,18],[45,17,45,18],[46,17,46,18],[47,14,47,16],[47,17,48,18],[48,14,48,16],[38,15,38,16],[49,15,49,16],[49,17,49,18],[41,6,43,6],[41,10,43,10],[41,12,43,12],[41,15,41,16],[41,17,41,18],[42,17,42,18],[43,17,44,18],[44,6,46,6],[44,10,46,10],[44,12,46,12],[95,38,97,38],[95,39,97,39],[104,24,105,28],[107,24,107,27],[88,27,90,27],[88,28,90,28],[92,27,94,27],[92,28,94,28],[92,38,94,38],[92,39,94,39],[0,1,0,18],[1,1,1,18],[118,27,120,27],[118,28,120,28],[109,27,111,27],[109,28,111,28],[112,27,114,27],[112,28,114,28],[115,27,117,27],[115,28,117,28],[95,27,97,27],[95,28,97,28],[77,24,78,28],[80,24,80,27],[82,27,84,27],[82,28,84,28],[85,27,87,27],[85,28,87,28],[50,17,53,18],[51,14,51,16],[52,14,52,16],[57,1,57,18],[67,1,72,9],[76,24,76,26]]}
[null,"Tennessee Higher Education Commission"]
[null,"Estimated Changes in FY 2015-16 Formula Recommendation and Appropriations*"]
[]
[null,"Community Colleges",{"$f":"Outcomes!C4","v":"Chattanooga"},null,null,null,null,null,null,null,null,null,null,null,"Total Weighted Outcomes",null,null,{"$f":"M31","v":1000.5909060328313}]
[null,null,null,"Estimated","Sub-pop",null,null,null,null,null,"Mission-Based",null,"Weighted"]
[null,null,"Outcomes","Data","x","/","Scales","=","Scaled Data","x","Weights","=","Outcomes"]
[null,null,"Students Accumulating 12 hrs",{"$f":"HLOOKUP($C$4,Outcomes!$C$71:$O$83,2,0)","v":2461.6666666666665},null,"/",{"$f":"Outcomes!A101","v":2},"=",{"$f":"HLOOKUP($C$4,Outcomes!$C$100:$O$112,2,0)","v":1230.8333333333333},"X",{"$f":"HLOOKUP($C$4,Outcomes!$C$128:$O$140,2,0)","v":0.06},"=",{"$f":"HLOOKUP($C$4,Outcomes!$C$143:$O$155,2,0)","v":99.549999999999983},null,"X","Salary Multiplier",null,{"$f":"HLOOKUP($C$4,Outcomes!C143:O158,16,0)","v":54621.269166583021}]
[null,null,"Sub-population Adults",{"$f":"HLOOKUP($C$4,Outcomes!$C$85:$O$96,2,0)","v":748},0.4,null,null,null,{"$f":"HLOOKUP($C$4,Outcomes!$C$114:$O$125,2,0)","v":149.6},null,null,null,null,null,null,"=    Outcomes Based Subtotal",null,{"$f":"HLOOKUP($C$4,Outcomes!C143:O160,17,0)","v":54653545.20405446}]
[null,null,"Sub-population Pell",{"$f":"HLOOKUP($C$4,Outcomes!$C$85:$O$96,8,0)","v":1393.6666666666667},0.4,null,null,null,{"$f":"HLOOKUP($C$4,Outcomes!$C$114:$O$125,8,0)","v":278.73333333333335},null,null,null,null,null,"+","M&O & Utilities",null,{"$f":"HLOOKUP($C$4,Outcomes!C143:O163,20,0)","v":8180769.1816084106}]
[null,null,"Students Accumulating 24 hrs",{"$f":"HLOOKUP($C$4,Outcomes!$C$71:$O$83,3,0)","v":1880.6666666666667},null,null,{"$f":"Outcomes!A102","v":2},null,{"$f":"HLOOKUP($C$4,Outcomes!$C$100:$O$112,3,0)","v":940.33333333333337},null,{"$f":"HLOOKUP($C$4,Outcomes!$C$128:$O$140,3,0)","v":7.0000000000000007E-2},null,{"$f":"HLOOKUP($C$4,Outcomes!$C$143:$O$155,3,0)","v":92.834000000000017},null,"+"," Equipment",null,{"$f":"HLOOKUP($C$4,Outcomes!C143:O164,21,0)","v":1224978.2640000002}]
[null,null,"Sub-population Adults",{"$f":"HLOOKUP($C$4,Outcomes!$C$85:$O$96,3,0)","v":760.33333333333337},0.4,null,null,null,{"$f":"HLOOKUP($C$4,Outcomes!$C$114:$O$125,3,0)","v":152.06666666666669},null,null,null,null,null,"x","Three-Year Formula Phase In",null,{"$f":"HLOOKUP($C$4,Outcomes!$C$56:$O$60,5,0)","v":1}]
[null,null,"Sub-population Pell",{"$f":"HLOOKUP($C$4,Outcomes!$C$85:$O$96,9,0)","v":1169},0.4,null,null,null,{"$f":"HLOOKUP($C$4,Outcomes!$C$114:$O$125,9,0)","v":233.8},null,null,null,null,null,null,"=    Estimated Need",null,{"$f":"(R8+R9+R10)*R11","v":64059292.649662867}]
[null,null,"Students Accumulating 36 hrs",{"$f":"HLOOKUP($C$4,Outcomes!$C$71:$O$83,4,0)","v":1628},null,null,{"$f":"Outcomes!A103","v":2},null,{"$f":"HLOOKUP($C$4,Outcomes!$C$100:$O$112,4,0)","v":814},null,{"$f":"HLOOKUP($C$4,Outcomes!$C$128:$O$140,4,0)","v":7.0000000000000007E-2},null,{"$f":"HLOOKUP($C$4,Outcomes!$C$143:$O$155,4,0)","v":81.550000000000011},null,"X","Subsidy/Fee Policy",null,0.66669999999999996]
[null,null,"Sub-population Adults",{"$f":"HLOOKUP($C$4,Outcomes!$C$85:$O$96,4,0)","v":736.33333333333337},0.4,null,null,null,{"$f":"HLOOKUP($C$4,Outcomes!$C$114:$O$125,4,0)","v":147.26666666666668},null,null,null,null,null,"-","Out of State Tuition Revenue",null,{"$f":"HLOOKUP($C$4,Outcomes!C56:O66,11,0)","v":2121291.5021079709}]
[null,null,"Sub-population Pell",{"$f":"HLOOKUP($C$4,Outcomes!$C$85:$O$96,10,0)","v":1018.6666666666666},0.4,null,null,null,{"$f":"HLOOKUP($C$4,Outcomes!$C$114:$O$125,10,0)","v":203.73333333333335},null,null,null,null,null,"+","Performance Funding:",null,{"$f":"(R12*R13-R14)*((0.0545*R17)/100)","v":2145633.8118408779}]
[null,null,"Dual Enrollment",{"$f":"HLOOKUP($C$4,Outcomes!$C$71:$O$83,5,0)","v":1167.6666666666667},null,null,{"$f":"Outcomes!A104","v":2},null,{"$f":"HLOOKUP($C$4,Outcomes!$C$100:$O$112,5,0)","v":583.83333333333337},null,{"$f":"HLOOKUP($C$4,Outcomes!$C$128:$O$140,5,0)","v":0.05},null,{"$f":"HLOOKUP($C$4,Outcomes!$C$143:$O$155,5,0)","v":29.19166666666667},null,null,"    Quality Assurance Amount"]
[null,null,"Associates",{"$f":"HLOOKUP($C$4,Outcomes!$C$71:$O$83,6,0)","v":913.33333333333337},null,null,{"$f":"Outcomes!A105","v":1.5},null,{"$f":"HLOOKUP($C$4,Outcomes!$C$100:$O$112,6,0)","v":608.88888888888891},null,{"$f":"HLOOKUP($C$4,Outcomes!$C$128:$O$140,6,0)","v":0.05},null,{"$f":"HLOOKUP($C$4,Outcomes!$C$143:$O$155,6,0)","v":45.408888888888896},null,null,"    (Quality Assurance Score)",null,{"$f":"HLOOKUP($C$4,Outcomes!C143:O169,26,0)","v":97}]
[null,null,"Sub-population Adults",{"$f":"HLOOKUP($C$4,Outcomes!$C$85:$O$96,5,0)","v":572},0.4,null,null,null,{"$f":"HLOOKUP($C$4,Outcomes!$C$114:$O$125,5,0)","v":152.53333333333333},null,null,null,null,null,"+","Legislative Initiatives",null,{"$f":"HLOOKUP($C$4,Outcomes!C56:O67,12,0)","v":0}]
[null,null,"Sub-population Pell",{"$f":"HLOOKUP($C$4,Outcomes!$C$85:$O$96,11,0)","v":550.33333333333337},0.4,null,null,null,{"$f":"HLOOKUP($C$4,Outcomes!$C$114:$O$125,11,0)","v":146.75555555555556}]
[null,null,"Certificates 1-2 Years",{"$f":"HLOOKUP($C$4,Outcomes!$C$71:$O$83,7,0)","v":166},null,null,{"$f":"Outcomes!A106","v":1.5},null,{"$f":"HLOOKUP($C$4,Outcomes!$C$100:$O$112,7,0)","v":110.66666666666667},null,{"$f":"HLOOKUP($C$4,Outcomes!$C$128:$O$140,7,0)","v":0.05},null,{"$f":"HLOOKUP($C$4,Outcomes!$C$143:$O$155,7,0)","v":7.9955555555555566}]
{"$rows_left_out":109}
{"sheet":"Printable Summary","index":3,"n_rows":40,"n_cols":8,"rows_kept":40,"cut":false,"hidden":false,"merged":[[43,5,43,7],[0,1,0,7],[1,1,1,7],[4,1,4,3],[39,5,39,7],[36,5,38,7]]}
[null,"Tennessee Higher Education Commission"]
[null,"Summary of Changes in FY 2015-16 Formula Outcomes and Estimated State Appropriations"]
[]
[null,null,null,null,null,null,"Est. Change Due to","Percent Change Due to "]
[null,"Assumptions",null,null,null,null,"Outcomes and Funding*","Outcomes and Funding*"]
[null,"2014-15 State Appropriations",{"$f":"Working!G39","v":827231300},null,null,"APSU",{"$f":"Working!N7","v":0},{"$f":"G6/Working!C7","v":0}]
[null,"Est 2015-16 State Appropriations",{"$f":"ROUND(((1+C8)*C6), -2)","v":827231300},null,null,"ETSU",{"$f":"Working!N8","v":0},{"$f":"G7/Working!C8","v":0}]
[null,"Percentage Change from 2014-15",{"$f":"((D8-100)/2)/100","v":0},100,null,"MTSU",{"$f":"Working!N9","v":0},{"$f":"G8/Working!C9","v":0}]
[null,"Dollar Change from 2014-15",{"$f":"C7-C6","v":0},null,null,"TSU",{"$f":"Working!N10","v":0},{"$f":"G9/Working!C10","v":0}]
[null,"Percent of THEC Rec. Funded",{"$f":"Working!L39","v":0.60928674901547053},null,null,"TTU",{"$f":"Working!N11","v":0},{"$f":"G10/Working!C11","v":0}]
[null,null,null,null,null,"UM",{"$f":"Working!N12","v":0},{"$f":"G11/Working!C12","v":0}]
[null,"University Outcomes**",{"$f":"Outcomes!D4","v":"APSU"},"Avg Univ Change",null,"TBR Univ. Subtotal ",{"$f":"SUM(G6:G11)","v":0},{"$f":"G12/Working!C13","v":0}]
[null,"Students Accumulating 24 hours",{"$f":"HLOOKUP($C$12,Outcomes!$C$29:$K$41,2,0)","v":0},{"$f":"Outcomes!W30","v":0}]
[null,"Students Accumulating 48 hours",{"$f":"HLOOKUP($C$12,Outcomes!$C$29:$K$41,3,0)","v":0},{"$f":"Outcomes!W31","v":0},null,"Chattanooga",{"$f":"Working!N15","v":0},{"$f":"G14/Working!C15","v":0}]
[null,"Students Accumulating 72 hours",{"$f":"HLOOKUP($C$12,Outcomes!$C$29:$K$41,4,0)","v":0},{"$f":"Outcomes!W32","v":0},null,"Cleveland",{"$f":"Working!N16","v":0},{"$f":"G15/Working!C16","v":0}]
[null,"Bachelors and Associates",{"$f":"HLOOKUP($C$12,Outcomes!$C$29:$K$41,5,0)","v":0},{"$f":"Outcomes!W33","v":0},null,"Columbia",{"$f":"Working!N17","v":0},{"$f":"G16/Working!C17","v":0}]
[null,"Masters/Ed Specialist Degrees",{"$f":"HLOOKUP($C$12,Outcomes!$C$29:$K$41,6,0)","v":0},{"$f":"Outcomes!W34","v":0},null,"Dyersburg",{"$f":"Working!N18","v":0},{"$f":"G17/Working!C18","v":0}]
[null,"Doctoral / Law Degrees",{"$f":"HLOOKUP($C$12,Outcomes!$C$29:$K$41,7,0)","v":0},{"$f":"Outcomes!W35","v":0},null,"Jackson",{"$f":"Working!N19","v":0},{"$f":"G18/Working!C19","v":0}]
[null,"Research and Service",{"$f":"HLOOKUP($C$12,Outcomes!$C$29:$K$41,8,0)","v":0},{"$f":"Outcomes!W36","v":0},null,"Motlow",{"$f":"Working!N20","v":0},{"$f":"G19/Working!C20","v":0}]
[null,"Transfers Out with 12 hours",{"$f":"HLOOKUP($C$12,Outcomes!$C$29:$K$41,9,0)","v":0},{"$f":"Outcomes!W37","v":0},null,"Nashville",{"$f":"Working!N21","v":0},{"$f":"G20/Working!C21","v":0}]
{"$rows_left_out":21}
{"sheet":"Weights","index":4,"n_rows":35,"n_cols":15,"rows_kept":35,"cut":false,"hidden":false,"merged":[[0,1,0,14],[1,1,1,14]]}
[null,"Tennessee Higher Education Commission"]
[null,"Outcomes Formula Weights - Based on Institutional Mission"]
[]
[]
[null,"Universities","UTM","APSU","TTU","UTC","MTSU","ETSU","TSU","UM","UTK"]
[null,"Students Accumulating 24 hrs",0.03,0.03,0.03,0.03,0.03,0.03,0.03,0.02,0.02]
[null,"Students Accumulating 48 hrs",0.05,0.05,0.05,0.05,0.05,0.05,0.05,0.03,0.03]
[null,"Students Accumulating 72 hrs",7.0000000000000007E-2,7.0000000000000007E-2,7.0000000000000007E-2,7.0000000000000007E-2,7.0000000000000007E-2,7.0000000000000007E-2,7.0000000000000007E-2,0.05,0.05]
[null,"Progression",{"$f":"SUM(C6:C8)","v":0.15000000000000002},{"$f":"SUM(D6:D8)","v":0.15000000000000002},0.15000000000000002,0.15000000000000002,0.15000000000000002,0.15000000000000002,0.15000000000000002,0.1,0.1]
[null,"Bachelors and Associates",0.3,0.25,0.25,0.25,0.25,0.25,0.25,0.25,0.15]
[null,"Masters / Ed Specialist Degrees",0.15,0.2,0.15,0.15,0.15,0.15,0.15,0.15,0.15]
[null,"Doctoral / Law Degrees",0,0,0.05,0.05,7.4999999999999997E-2,7.4999999999999997E-2,7.4999999999999997E-2,0.1,0.1]
[null,"Research and Service",0.1,0.1,0.1,0.1,0.125,0.125,0.125,0.125,0.15]
[null,"Transfers Out with 12 hrs",0.1,0.1,0.1,0.1,0.05,0.05,0.05,0.05,0.05]
[null,"Degrees per 100 FTE",0.15,0.1,0.1,0.1,0.1,0.1,0.1,7.4999999999999997E-2,0.1]
[null,"Six-Year Graduation Rate",0.05,0.1,0.1,0.1,0.1,0.1,0.1,0.15,0.2]
[null,null,{"$f":"SUM(C9:C16)","v":1},{"$f":"SUM(D9:D16)","v":1},1,1,1,1,1,1,1]
[]
[]
[null,"Community Colleges","CHSCC","CLSCC","COSCC","DSCC","JSCC","MSCC","NASCC","NESCC","PSCC","RSCC","STCC","VSCC","WSCC"]
{"$rows_left_out":16}
{"sheet":"Historical Trends","index":5,"n_rows":177,"n_cols":17,"rows_kept":177,"cut":false,"hidden":false,"merged":[[133,0,134,0],[133,9,134,9],[148,9,149,9],[148,0,149,0],[163,0,164,0],[164,9,167,16],[131,0,131,16],[41,0,41,16],[42,0,42,16],[16,0,17,0],[16,9,17,9],[29,9,30,9],[29,0,30,0],[43,0,44,0],[43,9,44,9],[56,0,57,0],[71,0,72,0],[71,9,72,9],[86,9,87,9],[0,0,0,16],[1,0,1,16],[68,0,68,16],[69,0,69,16],[130,0,130,16],[3,0,4,0],[3,9,4,9],[86,0,87,0],[101,0,102,0],[101,9,102,9],[116,9,117,9],[116,0,117,0]]}
["Tennessee Higher Education Commission"]
["Historical Trends of Outcomes Used in Funding Formula"]
[]
["UTM",null,null,null,null,null,null,"Avg. Annual",null,"ETSU",null,null,null,null,null,null,"Avg. Annual"]
[null,"2007-08","2008-09","2009-10","2010-11","2011-12","2012-13","Change",null,null,"2007-08","2008-09","2009-10","2010-11","2011-12","2012-13","Change"]
["Students Accumulating 24 hrs",1415,1514,1514,1351,1261,1217,{"$f":"((G6-B6)/B6)/5","v":-2.7985865724381626E-2},null,"Students Accumulating 24 hrs",2055,2110,2152,1816,1823,1764,{"$f":"((P6-K6)/K6)/5","v":-2.8321167883211679E-2}]
["Students Accumulating 48 hrs",1072,1158,1301,1283,1163,1155,{"$f":"((G7-B7)/B7)/5","v":1.5485074626865672E-2},null,"Students Accumulating 48 hrs",1656,1811,1949,1745,1716,1709,{"$f":"((P7-K7)/K7)/5","v":6.4009661835748802E-3}]
["Students Accumulating 72 hrs",1013,1114,1147,1299,1206,1203,3.751233958538993E-2,null,"Students Accumulating 72 hrs",1859,1840,1977,1919,2040,1879,2.1516944593867669E-3]
["Bachelors and Associates",998,1018,1017,1038,1116,1247,4.9899799599198394E-2,null,"Bachelors and Associates",1693,1878,1873,2028,2146,2314,7.3360897814530424E-2]
["Masters / Ed Specialist Degrees",140,115,129,131,132,122,-2.571428571428571E-2,null,"Masters / Ed Specialist Degrees",530,577,655,630,609,576,1.7358490566037735E-2]
["Doctoral / Law Degrees",0,0,0,0,0,0,0,null,"Doctoral / Law Degrees",69,75,57,79,83,86,4.9275362318840582E-2]
["Research and Service",4527800,4386318,4311201.5199999996,3646780.32,3036994.36,2001803.7700000003,{"$f":"((G12-B12)/B12)/5","v":-0.11157719996466273},null,"Research and Service",20082056,21215713,22883113.969999999,24085480,23159718,22836711,2.7433993810195529E-2]
["Transfers Out with 12 hrs",249,195,225,223,260,264,1.2048192771084338E-2,null,"Transfers Out with 12 hrs",312,298,321,338,391,417,{"$f":"((P13-K13)/K13)/5","v":6.7307692307692318E-2}]
["Degrees per 100 FTE",16.43,16.260000000000002,15.282125773247515,15.04217024606556,16.32955659498505,18.522736275053475,2.5474574255063609E-2,null,"Degrees per 100 FTE",17.440000000000001,18.739999999999998,17.689726169713072,18.281469729203476,18.915043894183871,21.04918450328837,4.1389730542297797E-2]
["Six-Year Graduation Rate",0.52759999999999996,0.54900000000000004,0.54437869822485208,0.58685064935064934,0.56702747710241463,0.53,9.0978013646704665E-4,null,"Six-Year Graduation Rate",0.48199999999999998,0.48720000000000002,0.4593140551445864,0.5128369704749679,0.48483080513418902,0.47789999999999999,-1.7012448132780055E-3]
[]
["APSU",null,null,null,null,null,null,"Avg. Annual",null,"TSU",null,null,null,null,null,null,"Avg. Annual"]
[null,"2007-08","2008-09","2009-10","2010-11","2011-12","2012-13","Change",null,null,"2007-08","2008-09","2009-10","2010-11","2011-12","2012-13","Change"]
["Students Accumulating 24 hrs",1580,1703,1811,1582,1502,1463,{"$f":"((G19-B19)/B19)/5","v":-1.4810126582278482E-2},null,"Students Accumulating 24 hrs",1435,1184,1360,999,976,994,{"$f":"((P19-K19)/K19)/5","v":-6.1463414634146341E-2}]
["Students Accumulating 48 hrs",1358,1448,1487,1354,1433,1476,{"$f":"((G20-B20)/B20)/5","v":1.7378497790868926E-2},null,"Students Accumulating 48 hrs",1114,983,956,861,901,839,{"$f":"((P20-K20)/K20)/5","v":-4.9371633752244168E-2}]
{"$rows_left_out":158}
{"sheet":"FAQs","index":6,"n_rows":2,"n_cols":1,"rows_kept":2,"cut":false,"hidden":false,"merged":[[0,0,0,19],[1,0,1,19]]}
["Tennessee Higher Education Commission"]
["Outcomes Funding Dynamic Simulation"]

{"sheet":"Working","index":7,"n_rows":98,"n_cols":14,"rows_kept":98,"cut":false,"hidden":false,"merged":[[2,5,2,7],[2,9,2,11],[71,9,71,10]]}
[]
[]
[null,null,null,null,null,"Technical Corrections",null,null,null,"Total New Model"]
[null,"2014-15","2014-15","Percent ",null,"2015-16","2015-16","Percent ",null,"2015-16","2015-16","Percent ",null,"Change Due to "]
["Academic Formula Units","Formula Calculation","State Appr**","Funded",null,"Formula Calculation","Est State Appr*","Funded",null,"Formula Calculation","State Appr*","Funded",null,"Funding and Outcomes"]
["TBR Universities"]
["Austin Peay",56186000,34229500,{"$f":"C7/B7","v":0.60921759869006509},null,{"$f":"B7","v":56186000},{"$f":"F7*($C$39/$B$39)","v":34233385.280183226},{"$f":"G7/F7","v":0.60928674901547053},null,{"$f":"Outcomes!D211","v":56186000},{"$f":"J7*('Printable Summary'!$C$7/$J$39)","v":34233385.280183226},{"$f":"K7/J7","v":0.60928674901547053},null,{"$f":"ROUND((K7-G7), -2)","v":0}]
["East Tennessee",78623000,48031700,{"$f":"C8/B8","v":0.6109115653180367},null,{"$f":"B8","v":78623000},{"$f":"F8*($C$39/$B$39)","v":47903952.06784334},{"$f":"G8/F8","v":0.60928674901547053},null,{"$f":"Outcomes!H211","v":78623000},{"$f":"J8*('Printable Summary'!$C$7/$J$39)","v":47903952.06784334},{"$f":"K8/J8","v":0.60928674901547053},null,{"$f":"ROUND((K8-G8), -2)","v":0}]
["Middle Tennessee",135820500,82793000,0.60957661030551358,null,135820500,82753630.894655719,0.60928674901547053,null,{"$f":"Outcomes!G211","v":135820500},{"$f":"J9*('Printable Summary'!$C$7/$J$39)","v":82753630.894655719},0.60928674901547053,null,0]
["Tennessee State",52609300,32094700,0.61005753735556256,null,52609300,32054149.364979595,0.60928674901547053,null,{"$f":"Outcomes!I211","v":52609300},{"$f":"J10*('Printable Summary'!$C$7/$J$39)","v":32054149.364979595},0.60928674901547053,null,0]
["Tennessee Tech",62960900,38383300,0.60963709222708062,null,62960900,38361242.076088138,0.60928674901547053,null,{"$f":"Outcomes!E211","v":62960900},{"$f":"J11*('Printable Summary'!$C$7/$J$39)","v":38361242.076088138},0.60928674901547053,null,0]
["University of Memphis",146528000,89314500,0.60953879122079058,null,146528000,89277568.759738863,0.60928674901547053,null,{"$f":"Outcomes!J211","v":146528000},{"$f":"J12*('Printable Summary'!$C$7/$J$39)","v":89277568.759738863},0.60928674901547053,null,0]
["Subtotal ",{"$f":"SUM(B7:B12)","v":532727700},{"$f":"SUM(C7:C12)","v":324846700},0.60978000580784519,null,{"$f":"SUM(F7:F12)","v":532727700},{"$f":"SUM(G7:G12)","v":324583928.44348884},0.60928674901547042,null,{"$f":"SUM(J7:J12)","v":532727700},{"$f":"SUM(K7:K12)","v":324583928.44348884},0.60928674901547042,null,{"$f":"SUM(N7:N12)","v":0}]
["Two-Year Colleges*"]
["Chattanooga",42730000,{"$f":"B15*($C$28/$B$28)","v":26017879.951773673},{"$f":"C15/B15","v":0.6088902399198145},null,{"$f":"B15","v":42730000},{"$f":"F15*($C$39/$B$39)","v":26034822.785431057},0.60928674901547053,null,{"$f":"Outcomes!$C$68","v":42730000},{"$f":"J15*('Printable Summary'!$C$7/$J$39)","v":26034822.785431057},0.60928674901547053,null,{"$f":"ROUND((K15-G15), -2)","v":0}]
["Cleveland",14530000,{"$f":"B16*($C$28/$B$28)","v":8847175.1860349048},0.6088902399198145,null,{"$f":"B16","v":14530000},{"$f":"F16*($C$39/$B$39)","v":8852936.4631947875},0.60928674901547053,null,{"$f":"Outcomes!$D$68","v":14530000},{"$f":"J16*('Printable Summary'!$C$7/$J$39)","v":8852936.4631947875},0.60928674901547053,null,{"$f":"ROUND((K16-G16), -2)","v":0}]
["Columbia",20290700,12354809.19114098,0.6088902399198145,null,20290700,12362854.638248207,0.60928674901547053,null,{"$f":"Outcomes!$E$68","v":20290700},{"$f":"J17*('Printable Summary'!$C$7/$J$39)","v":12362854.638248207},0.60928674901547053,null,0]
["Dyersburg",12024000,7321296.2447958495,0.6088902399198145,null,12024000,7326063.8701620176,0.60928674901547053,null,{"$f":"Outcomes!$F$68","v":12024000},{"$f":"J18*('Printable Summary'!$C$7/$J$39)","v":7326063.8701620176},0.60928674901547053,null,0]
["Jackson",18229000,11099460.183498299,0.6088902399198145,null,18229000,11106688.147803012,0.60928674901547053,null,{"$f":"Outcomes!$G$68","v":18229000},{"$f":"J19*('Printable Summary'!$C$7/$J$39)","v":11106688.147803012},{"$f":"K19/J19","v":0.60928674901547053},null,0]
["Motlow",17508000,10660450.320516113,0.6088902399198145,null,17508000,10667392.401762858,0.60928674901547053,null,{"$f":"Outcomes!$H$68","v":17508000},{"$f":"J20*('Printable Summary'!$C$7/$J$39)","v":10667392.401762858},0.60928674901547053,null,0]
{"$rows_left_out":78}